{
  "project_info": {
    "project_number": "992852276065",
    "project_id": "fluttercrud-12fb1",
    "storage_bucket": "fluttercrud-12fb1.appspot.com"
  },
  "client": [
    {
      "client_info": {
        "mobilesdk_app_id": "1:992852276065:android:e55959181934b317a8cb20",
        "android_client_info": {
          "package_name": "com.example.community"
        }
      },
      "oauth_client": [
        {
          "client_id": "992852276065-n643dtl7grr162p0f2ee4mc3935ka86v.apps.googleusercontent.com",
          "client_type": 3
        }
      ],
      "api_key": [
        {
          "current_key": "AIzaSyBcC2f6cGJkg_H6i_j463OASv8f-0QrFlw"
        }
      ],
      "services": {
        "appinvite_service": {
          "other_platform_oauth_client": [
            {
              "client_id": "992852276065-n643dtl7grr162p0f2ee4mc3935ka86v.apps.googleusercontent.com",
              "client_type": 3
            },
            {
              "client_id": "992852276065-fl8eroljn4fsrg78jbj28oe3k3t3461p.apps.googleusercontent.com",
              "client_type": 2,
              "ios_info": {
                "bundle_id": "com.example.community"
              }
            }
          ]
        }
      }
    }
  ],
  "configuration_version": "1"
}