<svg width="30" height="30" viewBox="0 0 30 30" fill="none" xmlns="http://www.w3.org/2000/svg">
<circle cx="15" cy="15" r="14.5" stroke="#777777"/>
<path d="M18.1364 8L11.8634 8C9.73312 8 8 9.7332 8 11.8635L8 18.1364C8 20.2668 9.73312 21.9999 11.8634 21.9999L18.1364 21.9999C20.2668 21.9999 21.9999 20.2667 21.9999 18.1364L21.9999 11.8635C22 9.7332 20.2668 8 18.1364 8ZM20.7579 18.1364C20.7579 19.5819 19.5819 20.7578 18.1364 20.7578L11.8634 20.7578C10.418 20.7579 9.24214 19.5819 9.24214 18.1364L9.24214 11.8635C9.24214 10.4181 10.418 9.24214 11.8634 9.24214L18.1364 9.24214C19.5818 9.24214 20.7578 10.4181 20.7578 11.8635L20.7578 18.1364H20.7579Z" fill="#777777"/>
<path d="M15 11.3926C13.0108 11.3926 11.3926 13.0108 11.3926 15C11.3926 16.9891 13.0108 18.6073 15 18.6073C16.9892 18.6073 18.6074 16.9891 18.6074 15C18.6074 13.0108 16.9892 11.3926 15 11.3926ZM15 17.365C13.6958 17.365 12.6347 16.3041 12.6347 14.9999C12.6347 13.6957 13.6958 12.6346 15 12.6346C16.3042 12.6346 17.3653 13.6957 17.3653 14.9999C17.3653 16.3041 16.3042 17.365 15 17.365Z" fill="#777777"/>
<path d="M18.7586 10.3398C18.5192 10.3398 18.2841 10.4367 18.1151 10.6065C17.9453 10.7754 17.8477 11.0106 17.8477 11.2507C17.8477 11.4901 17.9454 11.7252 18.1151 11.895C18.2841 12.0639 18.5192 12.1616 18.7586 12.1616C18.9987 12.1616 19.2331 12.0639 19.4028 11.895C19.5726 11.7252 19.6695 11.4901 19.6695 11.2507C19.6695 11.0106 19.5726 10.7754 19.4028 10.6065C19.2339 10.4367 18.9987 10.3398 18.7586 10.3398Z" fill="#777777"/>
</svg>
