<svg width="150" height="150" viewBox="0 0 150 150" fill="none" xmlns="http://www.w3.org/2000/svg">
<g filter="url(#filter0_i)">
<circle cx="75" cy="75" r="63" fill="white"/>
</g>
<circle cx="75" cy="75" r="63.5" stroke="url(#paint0_linear)"/>
<path d="M51.16 90.1998C51.72 88.7598 51.96 87.1598 51.8 85.9598C51.8 85.6398 51.72 85.3998 51.72 85.1598C51.72 84.9198 51.72 84.6798 51.64 84.5198C51.64 84.1198 51.56 83.8798 51.56 83.8798C51.56 83.8798 50.52 83.9598 49.32 84.4398C48.68 84.6798 48.04 84.9998 47.4 85.4798C46.76 85.9598 46.12 86.5198 45.8 87.3198C45.16 88.5998 45 90.1198 45.16 91.4798C45.16 91.4798 45 91.1598 44.84 90.6798C44.68 90.1998 44.52 89.4798 44.36 88.8398C44.2 88.1998 43.96 87.4798 43.88 86.9998C43.8 86.5198 43.72 86.1198 43.72 86.1198C44.68 85.9598 47.32 85.0798 48.76 83.1598C49.56 81.9598 50.12 80.5998 50.28 79.3998C50.36 78.8398 50.36 78.3598 50.44 77.9598C50.52 77.6398 50.52 77.3998 50.52 77.3998C50.52 77.3998 49.64 77.3198 48.44 77.4798C47.88 77.5598 47.16 77.7198 46.52 78.0398C45.88 78.3598 45.24 78.7598 44.76 79.3198C43.96 80.2798 43.48 81.5598 43.32 82.6798C43.24 82.6798 43.24 81.2398 43.16 79.7998C43.16 79.0798 43.08 78.3598 43.08 77.7998C43.16 77.2398 43.16 76.9198 43.16 76.9198C44.04 76.9998 46.44 76.8398 48.12 75.3998C48.68 74.9998 49 74.4398 49.32 73.8798C49.72 73.3198 49.96 72.8398 50.12 72.3598C50.52 71.3998 50.6 70.5998 50.6 70.5998C50.6 70.5998 49.8 70.3598 48.76 70.2798C47.72 70.1998 46.36 70.3598 45.24 71.2398C44.44 71.8798 43.72 72.8398 43.4 73.7998C43.4 73.7998 43.4 73.3998 43.56 72.9198C43.64 72.3598 43.8 71.6398 43.96 70.9198C44.12 70.1998 44.28 69.4798 44.36 68.9198C44.52 68.3598 44.6 68.0398 44.6 68.0398C45.4 68.2798 47.48 68.5998 49.08 67.7198C49.64 67.3998 50.04 67.0798 50.44 66.6798C50.84 66.2798 51.24 65.8798 51.48 65.4798C52.04 64.6798 52.28 64.0398 52.28 64.0398C52.28 64.0398 51.64 63.6398 50.76 63.3998C49.88 63.1598 48.68 62.9998 47.56 63.5598C46.76 63.9598 46.04 64.5198 45.56 65.2398C45.56 65.2398 45.64 65.0798 45.72 64.8398C45.8 64.5998 45.96 64.2798 46.12 64.0398C46.36 63.3998 46.68 62.8398 46.68 62.8398C47.08 62.5998 47.8 62.1998 48.44 61.7198C49.16 61.2398 49.88 60.5998 50.36 59.7198C51 58.5198 51.32 57.3198 51.4 56.2798C51.48 55.2398 51.4 54.4398 51.4 54.4398C51.4 54.4398 50.68 54.5198 49.64 54.9998C48.68 55.4798 47.32 56.1998 46.68 57.4798C46.12 58.4398 45.88 59.4798 45.8 60.3598C45.8 61.3198 45.88 62.0398 46.04 62.5998C46.04 62.5998 45.48 63.7998 45 64.9998C44.6 66.2798 44.2 67.4798 44.2 67.4798C44.28 66.5998 44.2 65.6398 43.88 64.7598C43.4 63.4798 42.6 62.5998 41.88 62.0398C41.08 61.4798 40.44 61.2398 40.44 61.2398C40.44 61.2398 40.36 61.4798 40.2 61.7998C40.04 62.1998 39.88 62.6798 39.72 63.3198C39.48 64.5998 39.4 66.1998 39.8 67.4798C40.68 69.5598 42.68 70.1198 43.48 70.3598C43.48 70.3598 43.16 71.8798 42.84 73.3198C42.68 74.8398 42.6 76.3598 42.6 76.3598C42.44 75.3198 42.12 74.1998 41.48 73.2398C40.6 71.7998 39.48 71.0798 38.44 70.5998C37.48 70.1198 36.68 70.0398 36.68 70.0398C36.68 70.0398 36.36 71.1598 36.36 72.5998C36.44 74.1198 36.68 75.8798 37.56 77.2398C39 79.3198 41.48 79.4798 42.36 79.4798C42.36 79.4798 42.44 80.9198 42.44 82.3598C42.68 83.7998 42.84 85.2398 42.84 85.2398C42.44 84.1198 41.64 82.9198 40.84 81.9598C39.72 80.7598 38.28 80.1198 37.08 79.8798C35.88 79.6398 35 79.7198 35 79.7198C35 79.7198 35 80.9998 35.24 82.6798C35.56 84.3598 36.44 86.2798 37.72 87.4798C39.88 89.3998 42.68 88.8398 43.56 88.6798C43.56 88.6798 43.88 90.0398 44.36 91.3998C44.92 92.6798 45.4 94.0398 45.4 94.0398C44.68 92.9198 43.48 91.7198 42.28 90.8398C40.84 89.7198 39.08 89.3998 37.72 89.3998C36.36 89.3998 35.4 89.7198 35.4 89.7198C35.4 89.7198 35.72 91.1598 36.44 92.9198C37.16 94.6798 38.68 96.5998 40.36 97.5598C43.32 99.1598 46.12 97.7198 47 97.2398C47 97.2398 47.16 97.5598 47.48 98.1198C47.64 98.3598 47.8 98.6798 47.96 98.9998C48.2 99.3198 48.44 99.6398 48.68 99.9598C49.64 101.24 50.6 102.6 50.6 102.6L51.16 102.12C51.16 102.12 49.88 100.36 48.6 98.5198C48.04 97.5598 47.56 96.5998 47.16 95.8798C46.92 95.4798 46.76 95.2398 46.68 94.9998C46.6 94.7598 46.52 94.6798 46.52 94.6798C47.4 94.2798 50.12 92.6798 51.16 90.1998Z" fill="#E21A3D"/>
<path d="M112.679 86.5199C112.039 86.5999 111.239 86.6799 110.519 86.9999C109.799 87.2399 108.999 87.6399 108.199 88.1999C106.919 89.1599 106.119 90.4399 105.399 91.6399C105.399 91.6399 105.559 91.3199 105.719 90.8399C105.879 90.3599 106.039 89.6399 106.199 88.9999C106.359 88.2799 106.599 87.6399 106.679 87.1599C106.759 86.6799 106.839 86.2799 106.839 86.2799C107.799 86.4399 110.519 86.8399 112.519 84.6799C113.879 83.3999 114.359 81.3999 114.679 79.7199C114.839 78.9199 114.919 78.1199 114.919 77.6399C114.919 77.0799 114.839 76.7599 114.839 76.7599C114.839 76.7599 113.959 76.7599 112.759 77.0799C112.199 77.2399 111.559 77.4799 110.919 77.8799C110.279 78.2799 109.639 78.7599 109.079 79.3999C108.199 80.4399 107.719 81.6399 107.319 82.8399C107.319 82.8399 107.319 82.7599 107.399 82.5999C107.399 82.4399 107.399 82.1999 107.399 81.9599C107.399 81.3999 107.479 80.6799 107.479 79.9599C107.479 79.2399 107.559 78.5199 107.559 77.9599C107.479 77.3999 107.479 77.0799 107.479 77.0799C108.359 76.9999 110.759 76.7599 112.119 74.5199C112.519 73.7999 112.839 72.9999 112.919 72.1999C112.999 71.3999 112.999 70.5999 112.919 69.7999C112.839 68.3599 112.519 67.2399 112.519 67.2399C112.519 67.2399 111.719 67.3999 110.759 67.8799C109.799 68.3599 108.679 69.2399 107.959 70.5999C107.399 71.5599 107.319 72.6799 107.159 73.7199C107.159 73.7199 107.159 73.3199 106.999 72.7599C106.919 72.1999 106.759 71.4799 106.599 70.7599C106.439 70.0399 106.279 69.2399 106.199 68.7599C106.039 68.1999 105.879 67.8799 105.879 67.8799C106.679 67.6399 108.599 66.9199 109.319 64.8399C109.559 64.1999 109.639 63.3999 109.639 62.7599C109.559 62.0399 109.399 61.3199 109.239 60.7599C108.839 59.5599 108.439 58.6799 108.439 58.6799C108.439 58.6799 107.799 58.9199 107.079 59.5599C106.359 60.1999 105.559 61.1599 105.159 62.4399C104.919 63.3199 104.999 64.2799 105.079 65.1599C105.079 65.1599 104.999 64.9999 104.919 64.7599C104.839 64.5199 104.679 64.1999 104.519 63.8799C104.279 63.2399 103.959 62.6799 103.959 62.6799C104.039 62.1999 104.199 61.3999 104.199 60.4399C104.119 59.5599 103.879 58.5199 103.319 57.5599C102.599 56.1999 101.319 55.5599 100.359 55.0799C99.3993 54.5999 98.5993 54.5199 98.5993 54.5199C98.5993 54.5199 98.5193 55.3199 98.5993 56.3599C98.6793 57.3999 99.0793 58.5999 99.6393 59.7999C100.119 60.6799 100.839 61.3199 101.559 61.7999C102.199 62.3599 102.839 62.7599 103.319 62.9199C103.319 62.9199 103.879 64.1199 104.359 65.3199C104.759 66.5199 105.159 67.7999 105.159 67.7999C104.679 67.0799 104.119 66.3599 103.319 65.9599C102.279 65.3199 100.919 65.3999 100.039 65.6399C99.0793 65.7999 98.4393 66.1199 98.4393 66.1199C98.4393 66.1199 98.5193 66.2799 98.5993 66.5199C98.7593 66.7599 98.9193 67.1599 99.1593 67.5599C99.5593 68.3599 100.279 69.3999 101.399 69.9599C102.999 70.9999 104.999 70.7599 105.799 70.5999C105.799 70.5999 106.119 72.0399 106.359 73.4799C106.519 74.9199 106.599 76.4399 106.599 76.4399C106.279 75.4799 105.799 74.5199 104.999 73.7999C103.879 72.8399 102.519 72.6799 101.399 72.6799C100.359 72.6799 99.5593 72.9199 99.5593 72.9199C99.5593 72.9199 99.7193 73.7199 100.039 74.6799C100.279 75.7199 100.839 76.9199 101.879 77.8799C103.479 79.3999 105.719 79.7199 106.679 79.7199C106.679 79.7199 106.599 81.1599 106.599 82.5999C106.359 84.0399 106.199 85.3999 106.199 85.3999C106.119 84.1999 105.879 82.9199 105.079 81.9599C104.039 80.6799 102.599 80.1199 101.479 79.8799C100.279 79.6399 99.3993 79.6399 99.3993 79.6399C99.3993 79.6399 99.3193 80.5199 99.4793 81.6399C99.5593 82.7599 99.7993 84.1999 100.679 85.4799C102.039 87.4799 104.519 88.5199 105.399 88.7599C105.399 88.7599 105.079 90.1199 104.679 91.3999C104.119 92.6799 103.639 93.9599 103.639 93.9599C103.799 92.5999 104.039 91.1599 103.319 89.7999C102.519 88.1999 101.159 87.2399 99.9593 86.7599C98.7593 86.1999 97.7993 86.0399 97.7993 86.0399C97.7993 86.0399 97.4793 86.9199 97.3993 88.1199C97.3993 88.7599 97.2393 89.3999 97.3193 90.1199C97.3193 90.8399 97.4793 91.6399 97.7993 92.4399C98.6793 94.9199 101.159 96.6799 102.039 97.2399C102.039 97.2399 101.879 97.5599 101.559 98.1199C101.399 98.3599 101.239 98.6799 101.079 98.9999C100.839 99.3199 100.599 99.6399 100.439 99.9599C99.4793 101.24 98.5993 102.52 98.5993 102.52L99.1593 103C99.1593 103 100.519 101.16 101.799 99.3199C102.359 98.3599 102.919 97.3199 103.319 96.5999C103.559 96.1999 103.719 95.9599 103.799 95.7199C103.879 95.4799 103.959 95.3999 103.959 95.3999C104.919 95.7999 107.719 96.9999 110.519 95.2399C112.279 94.1999 113.399 92.1199 114.119 90.3599C114.279 89.8799 114.439 89.4799 114.599 89.0799C114.679 88.6799 114.759 88.3599 114.839 88.0399C114.919 87.4799 114.999 87.0799 114.999 87.0799C114.999 87.0799 114.039 86.4399 112.679 86.5199Z" fill="#E21A3D"/>
<path d="M95.8011 45.7199L95.4811 49.1599L98.1211 51.4799L94.6811 52.1999L93.4011 55.4799L91.6411 52.4399L88.1211 52.1999L90.4411 49.5599L89.6411 46.1199L92.8411 47.5599L95.8011 45.7199Z" fill="#E21A3D"/>
<path d="M74.9993 39L77.0793 43.24L81.7193 43.88L78.3593 47.16L79.1593 51.8L74.9993 49.64L70.8393 51.8L71.6393 47.16L68.2793 43.88L72.9193 43.24L74.9993 39Z" fill="#E21A3D"/>
<path d="M54.1989 45.7199L57.1589 47.5599L60.3589 46.1199L59.5589 49.5599L61.8789 52.1999L58.3589 52.4399L56.5989 55.4799L55.3189 52.1999L51.8789 51.4799L54.5189 49.1599L54.1989 45.7199Z" fill="#E21A3D"/>
<path d="M53.3984 106.083L54.8868 106.635L56.1569 103.213L56.8334 107.358L57.6639 107.666L60.8808 104.967L59.6106 108.389L61.1387 108.956L62.9737 104.013L60.8544 103.226L57.9982 105.666L57.4327 101.956L55.2336 101.139L53.3984 106.083Z" fill="#111111"/>
<path d="M63.8545 104.011L62.9453 109.205L68.4881 110.175L68.6996 108.967L64.7624 108.278L64.9114 107.426L68.688 108.088L68.8958 106.901L65.1192 106.24L65.2536 105.472L69.121 106.149L69.3275 104.969L63.8545 104.011Z" fill="#111111"/>
<path d="M74.4019 110.437C77.4139 110.437 77.9384 108.963 77.9384 108.297V108.219H76.1879C76.1453 108.34 75.9752 109.155 74.2673 109.155C72.7294 109.155 72.3113 108.333 72.3113 107.709V107.624C72.3113 106.965 72.6728 106.256 74.2532 106.256C75.9256 106.256 76.1383 106.993 76.1807 107.135H77.9313V107.057C77.9313 106.44 77.4564 104.98 74.4019 104.98H74.1114C70.9931 104.98 70.582 106.632 70.582 107.588V107.794C70.582 108.73 71.0569 110.437 74.1114 110.437H74.4019Z" fill="#111111"/>
<path d="M84.3123 107.329L84.6513 109.169L86.2753 108.87L85.32 103.684L81.0685 104.467C79.34 104.786 78.97 105.712 79.1202 106.527L79.1357 106.611C79.2845 107.419 79.9033 107.961 81.3139 107.795L79.5843 110.102L81.6613 109.72L83.246 107.525L84.3123 107.329ZM84.1005 106.179L81.5705 106.645C81.1035 106.731 80.8742 106.543 80.8216 106.257L80.8203 106.25C80.7702 105.978 80.909 105.715 81.383 105.627L83.913 105.161L84.1005 106.179Z" fill="#111111"/>
<path d="M88.5645 108.166L94.0076 106.09L94.3232 106.917L95.7999 106.354L95.0296 104.335L94.2351 104.638L92.8107 100.903L91.2679 101.491L92.6922 105.226L89.6527 106.385L88.2284 102.651L86.6855 103.239L88.5645 108.166Z" fill="#111111"/>
<path d="M79.2184 69.2529H71.2644V75.4138H82.5287C82.8352 75.4138 83.1264 75.4291 83.4023 75.4598C83.7088 75.4904 83.9847 75.5517 84.2299 75.6437C84.659 75.7663 85.0268 75.9962 85.3333 76.3333C85.6398 76.6398 85.8697 77.023 86.023 77.4828C86.1149 77.728 86.1762 77.9885 86.2069 78.2644C86.2375 78.5402 86.2529 78.8314 86.2529 79.1379V91.2759C86.2529 91.8276 86.1762 92.3793 86.023 92.931C85.931 93.1456 85.8238 93.3602 85.7011 93.5747C85.6092 93.7586 85.4866 93.9272 85.3333 94.0805C85.1801 94.2337 85.0115 94.3716 84.8276 94.4943C84.6437 94.6169 84.4291 94.7088 84.1839 94.7701C83.9387 94.8621 83.6782 94.9234 83.4023 94.954C83.1264 94.9847 82.8352 95 82.5287 95H67.7241C67.4176 95 67.1111 94.9847 66.8046 94.954C66.5287 94.9234 66.2682 94.8621 66.023 94.7701C65.6245 94.6169 65.2567 94.387 64.9195 94.0805C64.613 93.7739 64.3831 93.3908 64.2299 92.931C64.1379 92.6858 64.0766 92.4253 64.046 92.1494C64.0153 91.8736 64 91.5824 64 91.2759V85.2069H64.092V75.7356L71.2644 75.7816V77.069L71.1724 85.2069V88.7931H79.1264L79.1724 82.0805V81.5287L71.2184 81.4828L71.2644 77.069V75.7816L64.1379 75.7356V66.7241C64.1379 66.1724 64.2146 65.6207 64.3678 65.069C64.4598 64.8544 64.5517 64.6552 64.6437 64.4713C64.7663 64.2567 64.9042 64.0728 65.0575 63.9195C65.2107 63.7663 65.3793 63.6284 65.5632 63.5057C65.7471 63.3831 65.9617 63.2912 66.2069 63.2299C66.4521 63.1379 66.7126 63.0766 66.9885 63.046C67.2644 63.0153 67.5556 63 67.8621 63H82.6667C82.9732 63 83.2644 63.0153 83.5402 63.046C83.8467 63.0766 84.1226 63.1379 84.3678 63.2299C84.7969 63.3525 85.1648 63.5824 85.4713 63.9195C85.7778 64.2261 86.0077 64.6092 86.1609 65.069C86.2529 65.3142 86.3142 65.5747 86.3448 65.8506C86.3755 66.1264 86.3908 66.4176 86.3908 66.7241V72.7931H79.2184V69.2529Z" fill="#111111"/>
<circle cx="75" cy="75" r="71" stroke="#F0F712" stroke-width="8"/>
<defs>
<filter id="filter0_i" x="11" y="11" width="130" height="130" filterUnits="userSpaceOnUse" color-interpolation-filters="sRGB">
<feFlood flood-opacity="0" result="BackgroundImageFix"/>
<feBlend mode="normal" in="SourceGraphic" in2="BackgroundImageFix" result="shape"/>
<feColorMatrix in="SourceAlpha" type="matrix" values="0 0 0 0 0 0 0 0 0 0 0 0 0 0 0 0 0 0 127 0" result="hardAlpha"/>
<feOffset dx="2" dy="2"/>
<feGaussianBlur stdDeviation="2.5"/>
<feComposite in2="hardAlpha" operator="arithmetic" k2="-1" k3="1"/>
<feColorMatrix type="matrix" values="0 0 0 0 0.554167 0 0 0 0 0.554167 0 0 0 0 0.554167 0 0 0 0.4 0"/>
<feBlend mode="normal" in2="shape" result="effect1_innerShadow"/>
</filter>
<linearGradient id="paint0_linear" x1="19.0875" y1="12" x2="160.197" y2="72.7234" gradientUnits="userSpaceOnUse">
<stop stop-color="white"/>
<stop offset="1" stop-color="#D5D5D5"/>
</linearGradient>
</defs>
</svg>
