<svg width="16" height="16" viewBox="0 0 16 16" fill="none" xmlns="http://www.w3.org/2000/svg">
<path d="M14.2223 14.4C14.2223 14.5886 14.1494 14.7695 14.0198 14.9029C13.8901 15.0362 13.7143 15.1111 13.5309 15.1111C13.3476 15.1111 13.1717 15.0362 13.0421 14.9029C12.9124 14.7695 12.8396 14.5886 12.8396 14.4V12.9778C12.8396 12.412 12.621 11.8694 12.2321 11.4693C11.8431 11.0692 11.3156 10.8445 10.7655 10.8445H5.23462C4.68454 10.8445 4.15699 11.0692 3.76803 11.4693C3.37907 11.8694 3.16055 12.412 3.16055 12.9778V14.4C3.16055 14.5886 3.08771 14.7695 2.95805 14.9029C2.8284 15.0362 2.65255 15.1111 2.46919 15.1111C2.28583 15.1111 2.10998 15.0362 1.98033 14.9029C1.85067 14.7695 1.77783 14.5886 1.77783 14.4V12.9778C1.77783 12.0348 2.14203 11.1304 2.7903 10.4636C3.43858 9.79685 4.31782 9.42225 5.23462 9.42225H10.7655C11.6823 9.42225 12.5615 9.79685 13.2098 10.4636C13.8581 11.1304 14.2223 12.0348 14.2223 12.9778V14.4ZM8.00005 8.00003C7.08326 8.00003 6.20401 7.62542 5.55573 6.95863C4.90746 6.29183 4.54326 5.38746 4.54326 4.44447C4.54326 3.50148 4.90746 2.59711 5.55573 1.93031C6.20401 1.26352 7.08326 0.888916 8.00005 0.888916C8.91685 0.888916 9.7961 1.26352 10.4444 1.93031C11.0926 2.59711 11.4568 3.50148 11.4568 4.44447C11.4568 5.38746 11.0926 6.29183 10.4444 6.95863C9.7961 7.62542 8.91685 8.00003 8.00005 8.00003ZM8.00005 6.5778C8.27243 6.5778 8.54213 6.52262 8.79377 6.41541C9.04541 6.3082 9.27405 6.15106 9.46665 5.95297C9.65924 5.75487 9.81202 5.51969 9.91625 5.26086C10.0205 5.00203 10.0741 4.72462 10.0741 4.44447C10.0741 4.16432 10.0205 3.88691 9.91625 3.62808C9.81202 3.36925 9.65924 3.13408 9.46665 2.93598C9.27405 2.73788 9.04541 2.58074 8.79377 2.47353C8.54213 2.36632 8.27243 2.31114 8.00005 2.31114C7.44998 2.31114 6.92243 2.5359 6.53346 2.93598C6.1445 3.33605 5.92598 3.87868 5.92598 4.44447C5.92598 5.01027 6.1445 5.55289 6.53346 5.95297C6.92243 6.35304 7.44998 6.5778 8.00005 6.5778Z" fill="#111111"/>
</svg>
