<svg width="150" height="150" viewBox="0 0 150 150" fill="none" xmlns="http://www.w3.org/2000/svg">
<g filter="url(#filter0_i)">
<circle cx="75" cy="75" r="63" fill="white"/>
</g>
<circle cx="75" cy="75" r="63.5" stroke="url(#paint0_linear)"/>
<g filter="url(#filter1_ii)">
<circle cx="75" cy="75" r="71" stroke="#E0E0E0" stroke-width="8"/>
</g>
<mask id="path-4-inside-1" fill="white">
<path d="M150 75C150 116.421 116.421 150 75 150C33.5786 150 0 116.421 0 75C0 33.5786 33.5786 0 75 0C116.421 0 150 33.5786 150 75ZM7.98179 75C7.98179 112.013 37.9869 142.018 75 142.018C112.013 142.018 142.018 112.013 142.018 75C142.018 37.9869 112.013 7.98179 75 7.98179C37.9869 7.98179 7.98179 37.9869 7.98179 75Z"/>
</mask>
<path d="M150 75C150 116.421 116.421 150 75 150C33.5786 150 0 116.421 0 75C0 33.5786 33.5786 0 75 0C116.421 0 150 33.5786 150 75ZM7.98179 75C7.98179 112.013 37.9869 142.018 75 142.018C112.013 142.018 142.018 112.013 142.018 75C142.018 37.9869 112.013 7.98179 75 7.98179C37.9869 7.98179 7.98179 37.9869 7.98179 75Z" stroke="#F0F712" stroke-width="20" stroke-linecap="round" mask="url(#path-4-inside-1)"/>
<path d="M75.0086 105.818C87.163 98.8754 98.4189 88.4691 104.561 75.7593C106.718 71.283 107.665 66.1697 106.914 61.2197C106.081 55.845 100.543 50.7807 95.3476 49.4411C87.0977 47.301 77.9655 53.2475 75.0086 60.942C72.0354 53.2475 62.9033 47.301 54.6697 49.4411C49.4746 50.7807 43.9366 55.8614 43.1034 61.2197C42.3356 66.1697 43.2831 71.283 45.4558 75.7593C51.5984 88.4691 62.8543 98.8754 75.0086 105.818Z" fill="#E21A3D"/>
<path d="M73.0478 95.0364L69.2577 69.29L66.1211 78.3894H35V76.4291H64.7162L70.0419 60.9747L73.5379 84.8097L76.5601 72.5246L79.3864 81.2483L81.4938 74.8444H115V76.8211H82.915L79.3864 87.6032L76.8215 79.7127L73.0478 95.0364Z" fill="white"/>
<defs>
<filter id="filter0_i" x="11" y="11" width="130" height="130" filterUnits="userSpaceOnUse" color-interpolation-filters="sRGB">
<feFlood flood-opacity="0" result="BackgroundImageFix"/>
<feBlend mode="normal" in="SourceGraphic" in2="BackgroundImageFix" result="shape"/>
<feColorMatrix in="SourceAlpha" type="matrix" values="0 0 0 0 0 0 0 0 0 0 0 0 0 0 0 0 0 0 127 0" result="hardAlpha"/>
<feOffset dx="2" dy="2"/>
<feGaussianBlur stdDeviation="2.5"/>
<feComposite in2="hardAlpha" operator="arithmetic" k2="-1" k3="1"/>
<feColorMatrix type="matrix" values="0 0 0 0 0.554167 0 0 0 0 0.554167 0 0 0 0 0.554167 0 0 0 0.4 0"/>
<feBlend mode="normal" in2="shape" result="effect1_innerShadow"/>
</filter>
<filter id="filter1_ii" x="-4" y="-4" width="158" height="158" filterUnits="userSpaceOnUse" color-interpolation-filters="sRGB">
<feFlood flood-opacity="0" result="BackgroundImageFix"/>
<feBlend mode="normal" in="SourceGraphic" in2="BackgroundImageFix" result="shape"/>
<feColorMatrix in="SourceAlpha" type="matrix" values="0 0 0 0 0 0 0 0 0 0 0 0 0 0 0 0 0 0 127 0" result="hardAlpha"/>
<feOffset dx="4" dy="4"/>
<feGaussianBlur stdDeviation="3"/>
<feComposite in2="hardAlpha" operator="arithmetic" k2="-1" k3="1"/>
<feColorMatrix type="matrix" values="0 0 0 0 0.0705882 0 0 0 0 0.180392 0 0 0 0 0.396078 0 0 0 0.1 0"/>
<feBlend mode="normal" in2="shape" result="effect1_innerShadow"/>
<feColorMatrix in="SourceAlpha" type="matrix" values="0 0 0 0 0 0 0 0 0 0 0 0 0 0 0 0 0 0 127 0" result="hardAlpha"/>
<feOffset dx="-4" dy="-4"/>
<feGaussianBlur stdDeviation="2"/>
<feComposite in2="hardAlpha" operator="arithmetic" k2="-1" k3="1"/>
<feColorMatrix type="matrix" values="0 0 0 0 1 0 0 0 0 1 0 0 0 0 1 0 0 0 0.5 0"/>
<feBlend mode="normal" in2="effect1_innerShadow" result="effect2_innerShadow"/>
</filter>
<linearGradient id="paint0_linear" x1="19.0875" y1="12" x2="160.197" y2="72.7234" gradientUnits="userSpaceOnUse">
<stop stop-color="white"/>
<stop offset="1" stop-color="#D5D5D5"/>
</linearGradient>
</defs>
</svg>
