{
  "project_info": {
    "project_number": "964611645813",
    "firebase_url": "https://appx00.firebaseio.com",
    "project_id": "appx00",
    "storage_bucket": "appx00.appspot.com"
  },
  "client": [
    {
      "client_info": {
        "mobilesdk_app_id": "1:964611645813:android:7e0f556cca1b31610ab33c",
        "android_client_info": {
          "package_name": "khoirul.rizqi.apputs_121_137"
        }
      },
      "oauth_client": [
        {
          "client_id": "964611645813-6plnbhdpuam46d5ntep10jrcamm2pbq0.apps.googleusercontent.com",
          "client_type": 3
        }
      ],
      "api_key": [
        {
          "current_key": "AIzaSyD4PXCEejQWJJAZ-hhAAmrXn4H-PgzPXkc"
        }
      ],
      "services": {
        "appinvite_service": {
          "other_platform_oauth_client": [
            {
              "client_id": "964611645813-6plnbhdpuam46d5ntep10jrcamm2pbq0.apps.googleusercontent.com",
              "client_type": 3
            }
          ]
        }
      }
    }
  ],
  "configuration_version": "1"
}