{
  "project_info": {
    "project_number": "716579351163",
    "project_id": "tool-concert-stag",
    "storage_bucket": "tool-concert-stag.appspot.com"
  },
  "client": [
    {
      "client_info": {
        "mobilesdk_app_id": "1:716579351163:android:17180d92dd96eb14e910de",
        "android_client_info": {
          "package_name": "com.toolconcert.stag"
        }
      },
      "oauth_client": [
        {
          "client_id": "716579351163-va3ru3rvnbnvc265vq15538g2ck7jkhi.apps.googleusercontent.com",
          "client_type": 3
        }
      ],
      "api_key": [
        {
          "current_key": "AIzaSyAktxuHPe30QjWXMlWon8tElnOKIT3MJE8"
        }
      ],
      "services": {
        "appinvite_service": {
          "other_platform_oauth_client": [
            {
              "client_id": "716579351163-va3ru3rvnbnvc265vq15538g2ck7jkhi.apps.googleusercontent.com",
              "client_type": 3
            },
            {
              "client_id": "716579351163-norbc37f8ddboirt5jgh80ia3eftth0n.apps.googleusercontent.com",
              "client_type": 2,
              "ios_info": {
                "bundle_id": "com.toolconcert.stag"
              }
            }
          ]
        }
      }
    }
  ],
  "configuration_version": "1"
}