{
	"id": "ffc16ba5-e200-485f-92e7-f51711c09f55",
	"name": "Production",
	"values": [
		{
			"key": "baseUrl",
			"value": "http://carsapi-env.eba-zid4dzym.us-east-1.elasticbeanstalk.com/",
			"enabled": true
		}
	],
	"_postman_variable_scope": "environment",
	"_postman_exported_at": "2021-01-03T13:22:30.891Z",
	"_postman_exported_using": "Postman/8.0.0-201228-1343"
}