{
  "$schema": "https://json.schemastore.org/nest-cli",
  "collection": "@nestjs/schematics",
  "sourceRoot": "src",
  "compilerOptions": {
    "plugins": ["@nestjs/swagger"],
    "assets": ["**/*.hbs", "**/*.ejs"],
    "watchAssets": true
  }
}
