%YAML 1.1
%TAG !u! tag:unity3d.com,2011:
--- !u!74 &7400000
AnimationClip:
  m_ObjectHideFlags: 0
  m_CorrespondingSourceObject: {fileID: 0}
  m_PrefabInstance: {fileID: 0}
  m_PrefabAsset: {fileID: 0}
  m_Name: rinoRun
  serializedVersion: 6
  m_Legacy: 0
  m_Compressed: 0
  m_UseHighQualityCurve: 1
  m_RotationCurves: []
  m_CompressedRotationCurves: []
  m_EulerCurves: []
  m_PositionCurves: []
  m_ScaleCurves: []
  m_FloatCurves: []
  m_PPtrCurves:
  - curve:
    - time: 0
      value: {fileID: 6858001784930192701, guid: 5f6e4279b73f74146bcf36013201d778, type: 3}
    - time: 0.05
      value: {fileID: -144779502802482253, guid: 5f6e4279b73f74146bcf36013201d778, type: 3}
    - time: 0.1
      value: {fileID: -4586267875643385387, guid: 5f6e4279b73f74146bcf36013201d778, type: 3}
    - time: 0.15
      value: {fileID: 3195440121365438547, guid: 5f6e4279b73f74146bcf36013201d778, type: 3}
    - time: 0.2
      value: {fileID: 5954703513139029531, guid: 5f6e4279b73f74146bcf36013201d778, type: 3}
    - time: 0.25
      value: {fileID: 3645781599010443287, guid: 5f6e4279b73f74146bcf36013201d778, type: 3}
    attribute: m_Sprite
    path: 
    classID: 212
    script: {fileID: 0}
  m_SampleRate: 20
  m_WrapMode: 0
  m_Bounds:
    m_Center: {x: 0, y: 0, z: 0}
    m_Extent: {x: 0, y: 0, z: 0}
  m_ClipBindingConstant:
    genericBindings:
    - serializedVersion: 2
      path: 0
      attribute: 0
      script: {fileID: 0}
      typeID: 212
      customType: 23
      isPPtrCurve: 1
    pptrCurveMapping:
    - {fileID: 6858001784930192701, guid: 5f6e4279b73f74146bcf36013201d778, type: 3}
    - {fileID: -144779502802482253, guid: 5f6e4279b73f74146bcf36013201d778, type: 3}
    - {fileID: -4586267875643385387, guid: 5f6e4279b73f74146bcf36013201d778, type: 3}
    - {fileID: 3195440121365438547, guid: 5f6e4279b73f74146bcf36013201d778, type: 3}
    - {fileID: 5954703513139029531, guid: 5f6e4279b73f74146bcf36013201d778, type: 3}
    - {fileID: 3645781599010443287, guid: 5f6e4279b73f74146bcf36013201d778, type: 3}
  m_AnimationClipSettings:
    serializedVersion: 2
    m_AdditiveReferencePoseClip: {fileID: 0}
    m_AdditiveReferencePoseTime: 0
    m_StartTime: 0
    m_StopTime: 0.3
    m_OrientationOffsetY: 0
    m_Level: 0
    m_CycleOffset: 0
    m_HasAdditiveReferencePose: 0
    m_LoopTime: 1
    m_LoopBlend: 0
    m_LoopBlendOrientation: 0
    m_LoopBlendPositionY: 0
    m_LoopBlendPositionXZ: 0
    m_KeepOriginalOrientation: 0
    m_KeepOriginalPositionY: 1
    m_KeepOriginalPositionXZ: 0
    m_HeightFromFeet: 0
    m_Mirror: 0
  m_EditorCurves: []
  m_EulerEditorCurves: []
  m_HasGenericRootTransform: 0
  m_HasMotionFloatCurves: 0
  m_Events: []
