%YAML 1.1
%TAG !u! tag:unity3d.com,2011:
--- !u!74 &7400000
AnimationClip:
  m_ObjectHideFlags: 0
  m_CorrespondingSourceObject: {fileID: 0}
  m_PrefabInstance: {fileID: 0}
  m_PrefabAsset: {fileID: 0}
  m_Name: trunkMove
  serializedVersion: 6
  m_Legacy: 0
  m_Compressed: 0
  m_UseHighQualityCurve: 1
  m_RotationCurves: []
  m_CompressedRotationCurves: []
  m_EulerCurves: []
  m_PositionCurves: []
  m_ScaleCurves: []
  m_FloatCurves: []
  m_PPtrCurves:
  - curve:
    - time: 0
      value: {fileID: 5467963913646556450, guid: daf3a34e52af9394d953d7b098baacc1, type: 3}
    - time: 0.05
      value: {fileID: -5129984973339797206, guid: daf3a34e52af9394d953d7b098baacc1, type: 3}
    - time: 0.1
      value: {fileID: 8562685907987499430, guid: daf3a34e52af9394d953d7b098baacc1, type: 3}
    - time: 0.15
      value: {fileID: -1055706981512347462, guid: daf3a34e52af9394d953d7b098baacc1, type: 3}
    - time: 0.2
      value: {fileID: -2581459109760135476, guid: daf3a34e52af9394d953d7b098baacc1, type: 3}
    - time: 0.25
      value: {fileID: -5091410120139045473, guid: daf3a34e52af9394d953d7b098baacc1, type: 3}
    - time: 0.3
      value: {fileID: -7052807861259409856, guid: daf3a34e52af9394d953d7b098baacc1, type: 3}
    - time: 0.35
      value: {fileID: 4522367324864049998, guid: daf3a34e52af9394d953d7b098baacc1, type: 3}
    - time: 0.4
      value: {fileID: -4895472306142806646, guid: daf3a34e52af9394d953d7b098baacc1, type: 3}
    - time: 0.45
      value: {fileID: -2990568864973285795, guid: daf3a34e52af9394d953d7b098baacc1, type: 3}
    - time: 0.5
      value: {fileID: 4860424459720875830, guid: daf3a34e52af9394d953d7b098baacc1, type: 3}
    - time: 0.55
      value: {fileID: 1019989085357722736, guid: daf3a34e52af9394d953d7b098baacc1, type: 3}
    - time: 0.6
      value: {fileID: -3914711443000631513, guid: daf3a34e52af9394d953d7b098baacc1, type: 3}
    - time: 0.65
      value: {fileID: -6571139122476738579, guid: daf3a34e52af9394d953d7b098baacc1, type: 3}
    attribute: m_Sprite
    path: 
    classID: 212
    script: {fileID: 0}
  m_SampleRate: 20
  m_WrapMode: 0
  m_Bounds:
    m_Center: {x: 0, y: 0, z: 0}
    m_Extent: {x: 0, y: 0, z: 0}
  m_ClipBindingConstant:
    genericBindings:
    - serializedVersion: 2
      path: 0
      attribute: 0
      script: {fileID: 0}
      typeID: 212
      customType: 23
      isPPtrCurve: 1
    pptrCurveMapping:
    - {fileID: 5467963913646556450, guid: daf3a34e52af9394d953d7b098baacc1, type: 3}
    - {fileID: -5129984973339797206, guid: daf3a34e52af9394d953d7b098baacc1, type: 3}
    - {fileID: 8562685907987499430, guid: daf3a34e52af9394d953d7b098baacc1, type: 3}
    - {fileID: -1055706981512347462, guid: daf3a34e52af9394d953d7b098baacc1, type: 3}
    - {fileID: -2581459109760135476, guid: daf3a34e52af9394d953d7b098baacc1, type: 3}
    - {fileID: -5091410120139045473, guid: daf3a34e52af9394d953d7b098baacc1, type: 3}
    - {fileID: -7052807861259409856, guid: daf3a34e52af9394d953d7b098baacc1, type: 3}
    - {fileID: 4522367324864049998, guid: daf3a34e52af9394d953d7b098baacc1, type: 3}
    - {fileID: -4895472306142806646, guid: daf3a34e52af9394d953d7b098baacc1, type: 3}
    - {fileID: -2990568864973285795, guid: daf3a34e52af9394d953d7b098baacc1, type: 3}
    - {fileID: 4860424459720875830, guid: daf3a34e52af9394d953d7b098baacc1, type: 3}
    - {fileID: 1019989085357722736, guid: daf3a34e52af9394d953d7b098baacc1, type: 3}
    - {fileID: -3914711443000631513, guid: daf3a34e52af9394d953d7b098baacc1, type: 3}
    - {fileID: -6571139122476738579, guid: daf3a34e52af9394d953d7b098baacc1, type: 3}
  m_AnimationClipSettings:
    serializedVersion: 2
    m_AdditiveReferencePoseClip: {fileID: 0}
    m_AdditiveReferencePoseTime: 0
    m_StartTime: 0
    m_StopTime: 0.7
    m_OrientationOffsetY: 0
    m_Level: 0
    m_CycleOffset: 0
    m_HasAdditiveReferencePose: 0
    m_LoopTime: 1
    m_LoopBlend: 0
    m_LoopBlendOrientation: 0
    m_LoopBlendPositionY: 0
    m_LoopBlendPositionXZ: 0
    m_KeepOriginalOrientation: 0
    m_KeepOriginalPositionY: 1
    m_KeepOriginalPositionXZ: 0
    m_HeightFromFeet: 0
    m_Mirror: 0
  m_EditorCurves: []
  m_EulerEditorCurves: []
  m_HasGenericRootTransform: 0
  m_HasMotionFloatCurves: 0
  m_Events: []
