Library\Bee\artifacts\mvdfrm\Unity.2D.Animation.Runtime.ref.dll_9FBE706CF9AEB0DB.mvfrm
Library\Bee\artifacts\mvdfrm\Unity.2D.Common.Runtime.ref.dll_65CCE411FBFC3B8E.mvfrm
Library\Bee\artifacts\mvdfrm\Unity.2D.IK.Runtime.ref.dll_03695B999147BB25.mvfrm
Library\Bee\artifacts\mvdfrm\Unity.2D.PixelPerfect.ref.dll_481DFDC80FCFE550.mvfrm
Library\Bee\artifacts\mvdfrm\Unity.2D.SpriteShape.Runtime.ref.dll_DC1134150774DC13.mvfrm
Library\Bee\artifacts\mvdfrm\Unity.2D.Tilemap.Extras.ref.dll_25718A4856CFDD1C.mvfrm
Library\Bee\artifacts\mvdfrm\Unity.Burst.ref.dll_59592FE1C19AAD4D.mvfrm
Library\Bee\artifacts\mvdfrm\Unity.InputSystem.ref.dll_A6FF0182FCD80C46.mvfrm
Library\Bee\artifacts\mvdfrm\Unity.InternalAPIEngineBridge.001.ref.dll_F3B4578E42289F08.mvfrm
Library\Bee\artifacts\mvdfrm\Unity.Mathematics.ref.dll_92C0142275484313.mvfrm
Library\Bee\artifacts\mvdfrm\Unity.Services.Core.Analytics.ref.dll_B6B3928F42109E44.mvfrm
Library\Bee\artifacts\mvdfrm\Unity.Services.Core.Environments.ref.dll_9371070AEE137978.mvfrm
Library\Bee\artifacts\mvdfrm\Unity.Services.Core.ref.dll_FF91F9BC6398EB7C.mvfrm
Library\Bee\artifacts\mvdfrm\Unity.TextMeshPro.ref.dll_2E746244A5BDAEA0.mvfrm
Library\Bee\artifacts\mvdfrm\Unity.Timeline.ref.dll_08E11C037DD39E3A.mvfrm
Library\Bee\artifacts\mvdfrm\Unity.VisualScripting.Core.ref.dll_0FD4FE2CDCC99BDF.mvfrm
Library\Bee\artifacts\mvdfrm\Unity.VisualScripting.Flow.ref.dll_56E5DE835ED3108E.mvfrm
Library\Bee\artifacts\mvdfrm\Unity.VisualScripting.State.ref.dll_A70CD23EFCFC9D47.mvfrm
Library\Bee\artifacts\mvdfrm\UnityEngine.UI.ref.dll_AFC2E85BC2EDBC0B.mvfrm
Library\Bee\artifacts\mvdfrm\UnityEngine.AccessibilityModule.dll_F4A2031D34154EBC.mvfrm
Library\Bee\artifacts\mvdfrm\UnityEngine.AIModule.dll_93A81BBF08C3C4FE.mvfrm
Library\Bee\artifacts\mvdfrm\UnityEngine.AndroidJNIModule.dll_9792A70EE8B709BC.mvfrm
Library\Bee\artifacts\mvdfrm\UnityEngine.AnimationModule.dll_61F0AA0307DE1E62.mvfrm
Library\Bee\artifacts\mvdfrm\UnityEngine.ARModule.dll_4D1AE0C265E123C7.mvfrm
Library\Bee\artifacts\mvdfrm\UnityEngine.AssetBundleModule.dll_2AE5A92ED3FCB5D0.mvfrm
Library\Bee\artifacts\mvdfrm\UnityEngine.AudioModule.dll_062F0C81AC9E16D4.mvfrm
Library\Bee\artifacts\mvdfrm\UnityEngine.ClothModule.dll_6D17697C86BAF5B8.mvfrm
Library\Bee\artifacts\mvdfrm\UnityEngine.CoreModule.dll_FD4273F3C99D3B15.mvfrm
Library\Bee\artifacts\mvdfrm\UnityEngine.CrashReportingModule.dll_D161182FA4370DCD.mvfrm
Library\Bee\artifacts\mvdfrm\UnityEngine.DirectorModule.dll_E2B0AC1E39292672.mvfrm
Library\Bee\artifacts\mvdfrm\UnityEngine.dll_D1182A9C9785A270.mvfrm
Library\Bee\artifacts\mvdfrm\UnityEngine.DSPGraphModule.dll_E8020D87AB89F793.mvfrm
Library\Bee\artifacts\mvdfrm\UnityEngine.GameCenterModule.dll_C1DFF129AEF7FAAD.mvfrm
Library\Bee\artifacts\mvdfrm\UnityEngine.GIModule.dll_2BE464CCA472AD18.mvfrm
Library\Bee\artifacts\mvdfrm\UnityEngine.GridModule.dll_DAB38FE1E1F1D10C.mvfrm
Library\Bee\artifacts\mvdfrm\UnityEngine.HotReloadModule.dll_E3396808E31139E4.mvfrm
Library\Bee\artifacts\mvdfrm\UnityEngine.ImageConversionModule.dll_5E6B7B65CF0FED6F.mvfrm
Library\Bee\artifacts\mvdfrm\UnityEngine.IMGUIModule.dll_3E8EABE872CFAAB5.mvfrm
Library\Bee\artifacts\mvdfrm\UnityEngine.InputLegacyModule.dll_BC2AC44D6BEE6BC1.mvfrm
Library\Bee\artifacts\mvdfrm\UnityEngine.InputModule.dll_6CA4D43222D63B78.mvfrm
Library\Bee\artifacts\mvdfrm\UnityEngine.JSONSerializeModule.dll_54B98C593350AF46.mvfrm
Library\Bee\artifacts\mvdfrm\UnityEngine.LocalizationModule.dll_50D0AE7B43EE395F.mvfrm
Library\Bee\artifacts\mvdfrm\UnityEngine.ParticleSystemModule.dll_2473617C1248995B.mvfrm
Library\Bee\artifacts\mvdfrm\UnityEngine.PerformanceReportingModule.dll_986BD9099A5B24D4.mvfrm
Library\Bee\artifacts\mvdfrm\UnityEngine.Physics2DModule.dll_AE9699F3A8DB15F7.mvfrm
Library\Bee\artifacts\mvdfrm\UnityEngine.PhysicsModule.dll_289085690FFDA425.mvfrm
Library\Bee\artifacts\mvdfrm\UnityEngine.ProfilerModule.dll_14F6E554D282AD7F.mvfrm
Library\Bee\artifacts\mvdfrm\UnityEngine.RuntimeInitializeOnLoadManagerInitializerModule.dll_9A9595D78052F4C0.mvfrm
Library\Bee\artifacts\mvdfrm\UnityEngine.ScreenCaptureModule.dll_6EA139DE47BCDBA8.mvfrm
Library\Bee\artifacts\mvdfrm\UnityEngine.SharedInternalsModule.dll_E27CBA3B463DE8BF.mvfrm
Library\Bee\artifacts\mvdfrm\UnityEngine.SpriteMaskModule.dll_AB0C63B9D0679027.mvfrm
Library\Bee\artifacts\mvdfrm\UnityEngine.SpriteShapeModule.dll_4446D689899EEDDA.mvfrm
Library\Bee\artifacts\mvdfrm\UnityEngine.StreamingModule.dll_168597535765D5A0.mvfrm
Library\Bee\artifacts\mvdfrm\UnityEngine.SubstanceModule.dll_F330AB9CA2B8D3AE.mvfrm
Library\Bee\artifacts\mvdfrm\UnityEngine.SubsystemsModule.dll_15B9CA1B9EAF783A.mvfrm
Library\Bee\artifacts\mvdfrm\UnityEngine.TerrainModule.dll_42D700D7E5BBED13.mvfrm
Library\Bee\artifacts\mvdfrm\UnityEngine.TerrainPhysicsModule.dll_24EE0A4F2B8B93E8.mvfrm
Library\Bee\artifacts\mvdfrm\UnityEngine.TextCoreFontEngineModule.dll_69D1E4C9A52F30F3.mvfrm
Library\Bee\artifacts\mvdfrm\UnityEngine.TextCoreTextEngineModule.dll_B1BA1B3B34B2EA11.mvfrm
Library\Bee\artifacts\mvdfrm\UnityEngine.TextRenderingModule.dll_97E0ABE8FEF45B9D.mvfrm
Library\Bee\artifacts\mvdfrm\UnityEngine.TilemapModule.dll_E1D36858FD78CE1C.mvfrm
Library\Bee\artifacts\mvdfrm\UnityEngine.TLSModule.dll_4A4DA580D5CEE3B9.mvfrm
Library\Bee\artifacts\mvdfrm\UnityEngine.UIElementsModule.dll_19F82B83A1DBB431.mvfrm
Library\Bee\artifacts\mvdfrm\UnityEngine.UIElementsNativeModule.dll_C0A50BC183344CE8.mvfrm
Library\Bee\artifacts\mvdfrm\UnityEngine.UIModule.dll_8F1BB9EC650ACAAA.mvfrm
Library\Bee\artifacts\mvdfrm\UnityEngine.UmbraModule.dll_8103B89A39C4C247.mvfrm
Library\Bee\artifacts\mvdfrm\UnityEngine.UNETModule.dll_8FE8BBDD16AC308E.mvfrm
Library\Bee\artifacts\mvdfrm\UnityEngine.UnityAnalyticsCommonModule.dll_33AA964DB443C332.mvfrm
Library\Bee\artifacts\mvdfrm\UnityEngine.UnityAnalyticsModule.dll_4412D245BE6FEB57.mvfrm
Library\Bee\artifacts\mvdfrm\UnityEngine.UnityConnectModule.dll_8046F321F572744B.mvfrm
Library\Bee\artifacts\mvdfrm\UnityEngine.UnityCurlModule.dll_950D4B3477F2104F.mvfrm
Library\Bee\artifacts\mvdfrm\UnityEngine.UnityTestProtocolModule.dll_5D258FBAA8674C3D.mvfrm
Library\Bee\artifacts\mvdfrm\UnityEngine.UnityWebRequestAssetBundleModule.dll_5A4420A25C6E3768.mvfrm
Library\Bee\artifacts\mvdfrm\UnityEngine.UnityWebRequestAudioModule.dll_10682CE820C5EF6C.mvfrm
Library\Bee\artifacts\mvdfrm\UnityEngine.UnityWebRequestModule.dll_700A830FDA0487EE.mvfrm
Library\Bee\artifacts\mvdfrm\UnityEngine.UnityWebRequestTextureModule.dll_F895CED51E4BEAC1.mvfrm
Library\Bee\artifacts\mvdfrm\UnityEngine.UnityWebRequestWWWModule.dll_7C7C60972472A67D.mvfrm
Library\Bee\artifacts\mvdfrm\UnityEngine.VehiclesModule.dll_5A73A59DB352F60D.mvfrm
Library\Bee\artifacts\mvdfrm\UnityEngine.VFXModule.dll_CB2C3DEFAC3C4D26.mvfrm
Library\Bee\artifacts\mvdfrm\UnityEngine.VideoModule.dll_2B3890EC6F303279.mvfrm
Library\Bee\artifacts\mvdfrm\UnityEngine.VRModule.dll_E1EDE07206C55022.mvfrm
Library\Bee\artifacts\mvdfrm\UnityEngine.WindModule.dll_73914F1C5AD3B97E.mvfrm
Library\Bee\artifacts\mvdfrm\UnityEngine.XRModule.dll_14ACA3768FFF9D80.mvfrm
Library\Bee\artifacts\mvdfrm\Unity.Burst.Cecil.dll_FEE8BA538B699502.mvfrm
Library\Bee\artifacts\mvdfrm\Unity.Burst.Cecil.Mdb.dll_3EB807CA416108BF.mvfrm
Library\Bee\artifacts\mvdfrm\Unity.Burst.Cecil.Pdb.dll_560A8039C0160A42.mvfrm
Library\Bee\artifacts\mvdfrm\Unity.Burst.Cecil.Rocks.dll_2E53807FD6D346A2.mvfrm
Library\Bee\artifacts\mvdfrm\Unity.Burst.Unsafe.dll_41D00C6EDF70EEF1.mvfrm
Library\Bee\artifacts\mvdfrm\Unity.VisualScripting.Antlr3.Runtime.dll_9B6D828C9A79AF39.mvfrm