%YAML 1.1
%TAG !u! tag:unity3d.com,2011:
--- !u!1001 &6794588076809373161
PrefabInstance:
  m_ObjectHideFlags: 0
  serializedVersion: 2
  m_Modification:
    m_TransformParent: {fileID: 0}
    m_Modifications:
    - target: {fileID: 2581292262948527752, guid: 4e13f0c5fd0e1784697917718e497e2e, type: 3}
      propertyPath: m_RootOrder
      value: 0
      objectReference: {fileID: 0}
    - target: {fileID: 2581292262948527752, guid: 4e13f0c5fd0e1784697917718e497e2e, type: 3}
      propertyPath: m_LocalPosition.x
      value: -2.412139
      objectReference: {fileID: 0}
    - target: {fileID: 2581292262948527752, guid: 4e13f0c5fd0e1784697917718e497e2e, type: 3}
      propertyPath: m_LocalPosition.y
      value: -0.036920547
      objectReference: {fileID: 0}
    - target: {fileID: 2581292262948527752, guid: 4e13f0c5fd0e1784697917718e497e2e, type: 3}
      propertyPath: m_LocalPosition.z
      value: 0.70637953
      objectReference: {fileID: 0}
    - target: {fileID: 2581292262948527752, guid: 4e13f0c5fd0e1784697917718e497e2e, type: 3}
      propertyPath: m_LocalRotation.w
      value: 1
      objectReference: {fileID: 0}
    - target: {fileID: 2581292262948527752, guid: 4e13f0c5fd0e1784697917718e497e2e, type: 3}
      propertyPath: m_LocalRotation.x
      value: -0
      objectReference: {fileID: 0}
    - target: {fileID: 2581292262948527752, guid: 4e13f0c5fd0e1784697917718e497e2e, type: 3}
      propertyPath: m_LocalRotation.y
      value: -0
      objectReference: {fileID: 0}
    - target: {fileID: 2581292262948527752, guid: 4e13f0c5fd0e1784697917718e497e2e, type: 3}
      propertyPath: m_LocalRotation.z
      value: -0
      objectReference: {fileID: 0}
    - target: {fileID: 2581292262948527752, guid: 4e13f0c5fd0e1784697917718e497e2e, type: 3}
      propertyPath: m_LocalEulerAnglesHint.x
      value: 0
      objectReference: {fileID: 0}
    - target: {fileID: 2581292262948527752, guid: 4e13f0c5fd0e1784697917718e497e2e, type: 3}
      propertyPath: m_LocalEulerAnglesHint.y
      value: 0
      objectReference: {fileID: 0}
    - target: {fileID: 2581292262948527752, guid: 4e13f0c5fd0e1784697917718e497e2e, type: 3}
      propertyPath: m_LocalEulerAnglesHint.z
      value: 0
      objectReference: {fileID: 0}
    - target: {fileID: 2581292262948527765, guid: 4e13f0c5fd0e1784697917718e497e2e, type: 3}
      propertyPath: m_Name
      value: HiddenTrap
      objectReference: {fileID: 0}
    - target: {fileID: 2581292262948527765, guid: 4e13f0c5fd0e1784697917718e497e2e, type: 3}
      propertyPath: m_TagString
      value: HiddenTrap
      objectReference: {fileID: 0}
    - target: {fileID: 2581292262948527767, guid: 4e13f0c5fd0e1784697917718e497e2e, type: 3}
      propertyPath: m_Color.a
      value: 1
      objectReference: {fileID: 0}
    m_RemovedComponents: []
  m_SourcePrefab: {fileID: 100100000, guid: 4e13f0c5fd0e1784697917718e497e2e, type: 3}
