<svg width="141.732" height="141.732" xmlns="http://www.w3.org/2000/svg">

 <g>
  <title>background</title>
  <rect fill="none" id="canvas_background" height="402" width="582" y="-1" x="-1"/>
 </g>
 <g>
  <title>Layer 1</title>
  <path fill="#ff5656" stroke="null" id="svg_1" d="m121.743,50.645c0,-27.971 -22.777,-50.645 -50.877,-50.645c-28.098,0 -50.877,22.674 -50.877,50.645c0,12.298 4.408,23.574 11.733,32.345l39.188,56.283l39.761,-57.104c1.428,-1.779 2.736,-3.654 3.916,-5.625l0.402,-0.574l-0.066,0c4.33,-7.454 6.82,-16.096 6.82,-25.325"/>
  <text stroke="#000" xml:space="preserve" text-anchor="start" font-family="Helvetica, Arial, sans-serif" font-size="24" id="svg_2" y="42.892972" x="50.80643" stroke-width="0" fill="#ffffff">NƠI</text>
  <text xml:space="preserve" text-anchor="start" font-family="Helvetica, Arial, sans-serif" font-size="47" id="svg_3" y="85.412397" x="48.749039" fill-opacity="null" stroke-opacity="null" stroke-width="0" stroke="null" fill="#ffffff">ĐI</text>
 </g>
</svg>