User Clock-OUT : Khalish
Date           :2016-12-07
Time           :14:32:17.568

User Clock-OUT : Amri
Date           :2016-12-07
Time           :14:33:31.824

User Clock-OUT : asd
Date           :2016-12-07
Time           :21:13:27.325

User Clock-OUT : admin
Date           :2016-12-07
Time           :21:35:12.754

User Clock-OUT : admin
Date           :2016-12-07
Time           :21:54:59.192

User Clock-OUT : admin
Date           :2016-12-07
Time           :22:08:16.166

User Clock-OUT : admin
Date           :2016-12-07
Time           :22:09:18.685

User Clock-OUT : adminK
Date           :2016-12-07
Time           :22:27:34.554

User Clock-OUT : adminL
Date           :2016-12-07
Time           :22:27:45.154

User Clock-OUT : adminK
Date           :2016-12-07
Time           :22:30:14.754

User Clock-OUT : adminS
Date           :2016-12-07
Time           :22:30:42.166

User Clock-OUT : adminK
Date           :2016-12-07
Time           :22:42:11.173

User Clock-OUT : adminK
Date           :2016-12-07
Time           :22:45:27.992

User Clock-OUT : adminK
Date           :2016-12-07
Time           :22:47:52.423

User Clock-OUT : adminK
Date           :2016-12-07
Time           :22:55:57.206

User Clock-OUT : adminK
Date           :2016-12-07
Time           :23:00:29.475

User Clock-OUT : adminK
Date           :2016-12-07
Time           :23:10:06.097

User Clock-OUT : adminK
Date           :2016-12-07
Time           :23:18:48.524

User Clock-OUT : adminK
Date           :2016-12-07
Time           :23:23:53.726

User Clock-OUT : adminK
Date           :2016-12-08
Time           :00:03:35.811

