"1","Afghanistan","AF","+93",NULL,NULL
"2","Aland Islands","AX","+358",NULL,NULL
"3","Albania","AL","+355",NULL,NULL
"4","Algeria","DZ","+213",NULL,NULL
"5","AmericanSamoa","AS","+1 684",NULL,NULL
"6","Andorra","AD","+376",NULL,NULL
"7","Angola","AO","+244",NULL,NULL
"8","Anguilla","AI","+1 264",NULL,NULL
"9","Antarctica","AQ","+672",NULL,NULL
"10","Antigua and Barbuda","AG","+1268",NULL,NULL
"11","Argentina","AR","+54",NULL,NULL
"12","Armenia","AM","+374",NULL,NULL
"13","Aruba","AW","+297",NULL,NULL
"14","Australia","AU","+61",NULL,NULL
"15","Austria","AT","+43",NULL,NULL
"16","Azerbaijan","AZ","+994",NULL,NULL
"17","Bahamas","BS","+1 242",NULL,NULL
"18","Bahrain","BH","+973",NULL,NULL
"19","Bangladesh","BD","+880",NULL,NULL
"20","Barbados","BB","+1 246",NULL,NULL
"21","Belarus","BY","+375",NULL,NULL
"22","Belgium","BE","+32",NULL,NULL
"23","Belize","BZ","+501",NULL,NULL
"24","Benin","BJ","+229",NULL,NULL
"25","Bermuda","BM","+1 441",NULL,NULL
"26","Bhutan","BT","+975",NULL,NULL
"27","Bolivia, Plurinational State of","BO","+591",NULL,NULL
"28","Bosnia and Herzegovina","BA","+387",NULL,NULL
"29","Botswana","BW","+267",NULL,NULL
"30","Brazil","BR","+55",NULL,NULL
"31","British Indian Ocean Territory","IO","+246",NULL,NULL
"32","Brunei Darussalam","BN","+673",NULL,NULL
"33","Bulgaria","BG","+359",NULL,NULL
"34","Burkina Faso","BF","+226",NULL,NULL
"35","Burundi","BI","+257",NULL,NULL
"36","Cambodia","KH","+855",NULL,NULL
"37","Cameroon","CM","+237",NULL,NULL
"38","Canada","CA","+1",NULL,NULL
"39","Cape Verde","CV","+238",NULL,NULL
"40","Cayman Islands","KY","+ 345",NULL,NULL
"41","Central African Republic","CF","+236",NULL,NULL
"42","Chad","TD","+235",NULL,NULL
"43","Chile","CL","+56",NULL,NULL
"44","China","CN","+86",NULL,NULL
"45","Christmas Island","CX","+61",NULL,NULL
"46","Cocos (Keeling) Islands","CC","+61",NULL,NULL
"47","Colombia","CO","+57",NULL,NULL
"48","Comoros","KM","+269",NULL,NULL
"49","Congo","CG","+242",NULL,NULL
"50","Congo, The Democratic Republic of the Congo","CD","+243",NULL,NULL
"51","Cook Islands","CK","+682",NULL,NULL
"52","Costa Rica","CR","+506",NULL,NULL
"53","Cote d'Ivoire","CI","+225",NULL,NULL
"54","Croatia","HR","+385",NULL,NULL
"55","Cuba","CU","+53",NULL,NULL
"56","Cyprus","CY","+357",NULL,NULL
"57","Czech Republic","CZ","+420",NULL,NULL
"58","Denmark","DK","+45",NULL,NULL
"59","Djibouti","DJ","+253",NULL,NULL
"60","Dominica","DM","+1 767",NULL,NULL
"61","Dominican Republic","DO","+1 849",NULL,NULL
"62","Ecuador","EC","+593",NULL,NULL
"63","Egypt","EG","+20",NULL,NULL
"64","El Salvador","SV","+503",NULL,NULL
"65","Equatorial Guinea","GQ","+240",NULL,NULL
"66","Eritrea","ER","+291",NULL,NULL
"67","Estonia","EE","+372",NULL,NULL
"68","Ethiopia","ET","+251",NULL,NULL
"69","Falkland Islands (Malvinas)","FK","+500",NULL,NULL
"70","Faroe Islands","FO","+298",NULL,NULL
"71","Fiji","FJ","+679",NULL,NULL
"72","Finland","FI","+358",NULL,NULL
"73","France","FR","+33",NULL,NULL
"74","French Guiana","GF","+594",NULL,NULL
"75","French Polynesia","PF","+689",NULL,NULL
"76","Gabon","GA","+241",NULL,NULL
"77","Gambia","GM","+220",NULL,NULL
"78","Georgia","GE","+995",NULL,NULL
"79","Germany","DE","+49",NULL,NULL
"80","Ghana","GH","+233",NULL,NULL
"81","Gibraltar","GI","+350",NULL,NULL
"82","Greece","GR","+30",NULL,NULL
"83","Greenland","GL","+299",NULL,NULL
"84","Grenada","GD","+1 473",NULL,NULL
"85","Guadeloupe","GP","+590",NULL,NULL
"86","Guam","GU","+1 671",NULL,NULL
"87","Guatemala","GT","+502",NULL,NULL
"88","Guernsey","GG","+44",NULL,NULL
"89","Guinea","GN","+224",NULL,NULL
"90","Guinea-Bissau","GW","+245",NULL,NULL
"91","Guyana","GY","+595",NULL,NULL
"92","Haiti","HT","+509",NULL,NULL
"93","Holy See (Vatican City State)","VA","+379",NULL,NULL
"94","Honduras","HN","+504",NULL,NULL
"95","Hong Kong","HK","+852",NULL,NULL
"96","Hungary","HU","+36",NULL,NULL
"97","Iceland","IS","+354",NULL,NULL
"98","India","IN","+91",NULL,NULL
"99","Indonesia","ID","+62",NULL,NULL
"100","Iran, Islamic Republic of Persian Gulf","IR","+98",NULL,NULL
"101","Iraq","IQ","+964",NULL,NULL
"102","Ireland","IE","+353",NULL,NULL
"103","Isle of Man","IM","+44",NULL,NULL
"104","Israel","IL","+972",NULL,NULL
"105","Italy","IT","+39",NULL,NULL
"106","Jamaica","JM","+1 876",NULL,NULL
"107","Japan","JP","+81",NULL,NULL
"108","Jersey","JE","+44",NULL,NULL
"109","Jordan","JO","+962",NULL,NULL
"110","Kazakhstan","KZ","+7 7",NULL,NULL
"111","Kenya","KE","+254",NULL,NULL
"112","Kiribati","KI","+686",NULL,NULL
"113","Korea, Democratic People's Republic of Korea","KP","+850",NULL,NULL
"114","Korea, Republic of South Korea","KR","+82",NULL,NULL
"115","Kuwait","KW","+965",NULL,NULL
"116","Kyrgyzstan","KG","+996",NULL,NULL
"117","Laos","LA","+856",NULL,NULL
"118","Latvia","LV","+371",NULL,NULL
"119","Lebanon","LB","+961",NULL,NULL
"120","Lesotho","LS","+266",NULL,NULL
"121","Liberia","LR","+231",NULL,NULL
"122","Libyan Arab Jamahiriya","LY","+218",NULL,NULL
"123","Liechtenstein","LI","+423",NULL,NULL
"124","Lithuania","LT","+370",NULL,NULL
"125","Luxembourg","LU","+352",NULL,NULL
"126","Macao","MO","+853",NULL,NULL
"127","Macedonia","MK","+389",NULL,NULL
"128","Madagascar","MG","+261",NULL,NULL
"129","Malawi","MW","+265",NULL,NULL
"130","Malaysia","MY","+60",NULL,NULL
"131","Maldives","MV","+960",NULL,NULL
"132","Mali","ML","+223",NULL,NULL
"133","Malta","MT","+356",NULL,NULL
"134","Marshall Islands","MH","+692",NULL,NULL
"135","Martinique","MQ","+596",NULL,NULL
"136","Mauritania","MR","+222",NULL,NULL
"137","Mauritius","MU","+230",NULL,NULL
"138","Mayotte","YT","+262",NULL,NULL
"139","Mexico","MX","+52",NULL,NULL
"140","Micronesia, Federated States of Micronesia","FM","+691",NULL,NULL
"141","Moldova","MD","+373",NULL,NULL
"142","Monaco","MC","+377",NULL,NULL
"143","Mongolia","MN","+976",NULL,NULL
"144","Montenegro","ME","+382",NULL,NULL
"145","Montserrat","MS","+1664",NULL,NULL
"146","Morocco","MA","+212",NULL,NULL
"147","Mozambique","MZ","+258",NULL,NULL
"148","Myanmar","MM","+95",NULL,NULL
"149","Namibia","NA","+264",NULL,NULL
"150","Nauru","NR","+674",NULL,NULL
"151","Nepal","NP","+977",NULL,NULL
"152","Netherlands","NL","+31",NULL,NULL
"153","Netherlands Antilles","AN","+599",NULL,NULL
"154","New Caledonia","NC","+687",NULL,NULL
"155","New Zealand","NZ","+64",NULL,NULL
"156","Nicaragua","NI","+505",NULL,NULL
"157","Niger","NE","+227",NULL,NULL
"158","Nigeria","NG","+234",NULL,NULL
"159","Niue","NU","+683",NULL,NULL
"160","Norfolk Island","NF","+672",NULL,NULL
"161","Northern Mariana Islands","MP","+1 670",NULL,NULL
"162","Norway","NO","+47",NULL,NULL
"163","Oman","OM","+968",NULL,NULL
"164","Pakistan","PK","+92",NULL,NULL
"165","Palau","PW","+680",NULL,NULL
"166","Palestinian Territory, Occupied","PS","+970",NULL,NULL
"167","Panama","PA","+507",NULL,NULL
"168","Papua New Guinea","PG","+675",NULL,NULL
"169","Paraguay","PY","+595",NULL,NULL
"170","Peru","PE","+51",NULL,NULL
"171","Philippines","PH","+63",NULL,NULL
"172","Pitcairn","PN","+872",NULL,NULL
"173","Poland","PL","+48",NULL,NULL
"174","Portugal","PT","+351",NULL,NULL
"175","Puerto Rico","PR","+1 939",NULL,NULL
"176","Qatar","QA","+974",NULL,NULL
"177","Romania","RO","+40",NULL,NULL
"178","Russia","RU","+7",NULL,NULL
"179","Rwanda","RW","+250",NULL,NULL
"180","Reunion","RE","+262",NULL,NULL
"181","Saint Barthelemy","BL","+590",NULL,NULL
"182","Saint Helena, Ascension and Tristan Da Cunha","SH","+290",NULL,NULL
"183","Saint Kitts and Nevis","KN","+1 869",NULL,NULL
"184","Saint Lucia","LC","+1 758",NULL,NULL
"185","Saint Martin","MF","+590",NULL,NULL
"186","Saint Pierre and Miquelon","PM","+508",NULL,NULL
"187","Saint Vincent and the Grenadines","VC","+1 784",NULL,NULL
"188","Samoa","WS","+685",NULL,NULL
"189","San Marino","SM","+378",NULL,NULL
"190","Sao Tome and Principe","ST","+239",NULL,NULL
"191","Saudi Arabia","SA","+966",NULL,NULL
"192","Senegal","SN","+221",NULL,NULL
"193","Serbia","RS","+381",NULL,NULL
"194","Seychelles","SC","+248",NULL,NULL
"195","Sierra Leone","SL","+232",NULL,NULL
"196","Singapore","SG","+65",NULL,NULL
"197","Slovakia","SK","+421",NULL,NULL
"198","Slovenia","SI","+386",NULL,NULL
"199","Solomon Islands","SB","+677",NULL,NULL
"200","Somalia","SO","+252",NULL,NULL
"201","South Africa","ZA","+27",NULL,NULL
"202","South Georgia and the South Sandwich Islands","GS","+500",NULL,NULL
"203","Spain","ES","+34",NULL,NULL
"204","Sri Lanka","LK","+94",NULL,NULL
"205","Sudan","SD","+249",NULL,NULL
"206","Suriname","SR","+597",NULL,NULL
"207","Svalbard and Jan Mayen","SJ","+47",NULL,NULL
"208","Swaziland","SZ","+268",NULL,NULL
"209","Sweden","SE","+46",NULL,NULL
"210","Switzerland","CH","+41",NULL,NULL
"211","Syrian Arab Republic","SY","+963",NULL,NULL
"212","Taiwan","TW","+886",NULL,NULL
"213","Tajikistan","TJ","+992",NULL,NULL
"214","Tanzania, United Republic of Tanzania","TZ","+255",NULL,NULL
"215","Thailand","TH","+66",NULL,NULL
"216","Timor-Leste","TL","+670",NULL,NULL
"217","Togo","TG","+228",NULL,NULL
"218","Tokelau","TK","+690",NULL,NULL
"219","Tonga","TO","+676",NULL,NULL
"220","Trinidad and Tobago","TT","+1 868",NULL,NULL
"221","Tunisia","TN","+216",NULL,NULL
"222","Turkey","TR","+90",NULL,NULL
"223","Turkmenistan","TM","+993",NULL,NULL
"224","Turks and Caicos Islands","TC","+1 649",NULL,NULL
"225","Tuvalu","TV","+688",NULL,NULL
"226","Uganda","UG","+256",NULL,NULL
"227","Ukraine","UA","+380",NULL,NULL
"228","United Arab Emirates","AE","+971",NULL,NULL
"229","United Kingdom","GB","+44",NULL,NULL
"230","United States","US","+1",NULL,NULL
"231","Uruguay","UY","+598",NULL,NULL
"232","Uzbekistan","UZ","+998",NULL,NULL
"233","Vanuatu","VU","+678",NULL,NULL
"234","Venezuela, Bolivarian Republic of Venezuela","VE","+58",NULL,NULL
"235","Vietnam","VN","+84",NULL,NULL
"236","Virgin Islands, British","VG","+1 284",NULL,NULL
"237","Virgin Islands, U.S.","VI","+1 340",NULL,NULL
"238","Wallis and Futuna","WF","+681",NULL,NULL
"239","Yemen","YE","+967",NULL,NULL
"240","Zambia","ZM","+260",NULL,NULL
"241","Zimbabwe","ZW","+263",NULL,NULL
