<svg width="116" height="57" viewBox="0 0 116 57" fill="none" xmlns="http://www.w3.org/2000/svg">
<path d="M17.376 29.608L32.304 49H26.976L14.592 32.68H14.352L9.024 38.2V49H4.656V15.496H9.024V32.632H9.168L25.344 15.496H31.056L17.376 29.608ZM62.6843 44.872V46.024C62.6843 47.048 62.9563 47.976 63.5003 48.808V49H58.9883C58.5403 48.264 58.3163 47.4 58.3163 46.408V45.64C58.3163 42.696 58.0123 40.68 57.4043 39.592C57.1163 39.016 56.7323 38.408 56.2523 37.768C55.2603 36.552 53.5483 35.944 51.1163 35.944H41.1803V49H36.8123V15.496H50.1563C54.5083 15.496 57.7723 16.392 59.9483 18.184C62.1243 19.976 63.2123 22.328 63.2123 25.24C63.2123 27.192 62.6843 28.952 61.6283 30.52C60.5723 32.056 59.0363 33.176 57.0203 33.88V33.976C60.7963 34.968 62.6843 38.6 62.6843 44.872ZM49.8683 31.816C52.6203 31.816 54.7963 31.272 56.3962 30.184C58.0283 29.096 58.8443 27.576 58.8443 25.624C58.8443 23.672 58.1403 22.184 56.7323 21.16C55.3563 20.136 52.9883 19.624 49.6283 19.624H41.1803V31.816H49.8683ZM101.224 15.496H108.04V49H103.672V20.104H103.576L91.7681 49H87.2561L75.4001 20.104H75.3521V49H70.9841V15.496H77.8001L89.4641 44.152H89.5601L101.224 15.496Z" fill="black"/>
<line x1="2" y1="55" x2="112" y2="55" stroke="#E54040" stroke-width="4"/>
</svg>
