<svg width="90%" height="140px"
    aria-labelledby="proportions-title proportions-desc" role="img">
    <title id="proportions-title">Productive vs lost time</title>
    <desc id="proportions-desc">Bar chart representing the proportions of a developer's productive vs lost time in a day.</desc>
    <g text-anchor="middle">
        <line x1="0%" y1="35" x2="100%" y2="35"></line>
        <line x1="0%" y1="30" x2="0%" y2="40"></line>
        <line x1="100%" y1="30" x2="100%" y2="40"></line>
        <text x="50%" y="27">What you pay for</text>
    </g>
    <rect class="fill fill-neutral" y="55" width="100%" height="20"></rect>
    <g text-anchor="middle" class="focus">
        <rect class="fill fill-accent" y="55" x="0%" width="85.37%" height="20"></rect>
        <line class="stroke stroke-accent" x1="0%" y1="110" x2="85.3%" y2="110"></line>
        <line class="stroke stroke-accent" x1="0%" y1="105" x2="0%" y2="115"></line>
        <line class="stroke stroke-accent" x1="85.3%" y1="105" x2="85.3%" y2="115"></line>
        <text class="fill fill-accent" x="42.6%" y="130">Productive time</text>
    </g>
    <g text-anchor="middle" class="focus">
        <rect class="fill fill-contrast" y="55" x="85.37%" width="100%" height="20"></rect>
        <line class="stroke stroke-contrast" x1="85.4%" y1="110" x2="100%" y2="110"></line>
        <line class="stroke stroke-contrast" x1="85.4%" y1="105" x2="85.4%" y2="115"></line>
        <line class="stroke stroke-contrast" x1="100%" y1="105" x2="100%" y2="115"></line>
        <text class="fill fill-contrast" x="92.7%" y="130">Lost time</text>
    </g>
    <g>
        <line x1="0%" y1="50" x2="0%" y2="80"></line>
        <line x1="10%" y1="50" x2="10%" y2="80"></line>
        <line x1="20%" y1="50" x2="20%" y2="80"></line>
        <line x1="30%" y1="50" x2="30%" y2="80"></line>
        <line x1="40%" y1="50" x2="40%" y2="80"></line>
        <line x1="50%" y1="50" x2="50%" y2="80"></line>
        <line x1="60%" y1="50" x2="60%" y2="80"></line>
        <line x1="70%" y1="50" x2="70%" y2="80"></line>
        <line x1="80%" y1="50" x2="80%" y2="80"></line>
        <line x1="90%" y1="50" x2="90%" y2="80"></line>
        <line x1="100%" y1="50" x2="100%" y2="80"></line>
    </g>
    <g>
        <text text-anchor="start" x="0" y="100">0%</text>
        <text text-anchor="middle" x="50%" y="100">50%</text>
        <text text-anchor="end" x="100%" y="100">100%</text>
    </g>
</svg>
