....
----------------------------------------------------------------------
Ran 4 tests in 0.001s

OK
Name               Stmts   Miss Branch BrPart  Cover   Missing
--------------------------------------------------------------
Diplomacy.py          70      4     40      1    92%   68-72, 64->68
TestDiplomacy.py      25      0      2      1    96%   41->exit
--------------------------------------------------------------
TOTAL                 95      4     42      2    93%
