Name             Stmts   Miss Branch BrPart  Cover   Missing
------------------------------------------------------------
Collatz.py          47      3     22      2    90%   29->30, 30-32, 33->35
TestCollatz.py      72      6      0      0    92%   49-50, 62, 67-68, 99
------------------------------------------------------------
TOTAL              119      9     22      2    91%
