......................
----------------------------------------------------------------------
Ran 22 tests in 4.640s

OK
Name             Stmts   Miss Branch BrPart  Cover   Missing
------------------------------------------------------------
Collatz.py          25      0     14      0   100%
TestCollatz.py      95      0      0      0   100%
------------------------------------------------------------
TOTAL              120      0     14      0   100%
