........................
----------------------------------------------------------------------
Ran 24 tests in 249.676s

OK
Name             Stmts   Miss Branch BrPart  Cover   Missing
------------------------------------------------------------
Collatz.py          36      0     12      0   100%
TestCollatz.py     100      0      0      0   100%
------------------------------------------------------------
TOTAL              136      0     12      0   100%
