<?xml version="1.0" encoding="UTF-8" standalone="no"?>
<!-- Created with Inkscape (http://www.inkscape.org/) -->

<svg
   xmlns:dc="http://purl.org/dc/elements/1.1/"
   xmlns:cc="http://creativecommons.org/ns#"
   xmlns:rdf="http://www.w3.org/1999/02/22-rdf-syntax-ns#"
   xmlns:svg="http://www.w3.org/2000/svg"
   xmlns="http://www.w3.org/2000/svg"
   xmlns:sodipodi="http://sodipodi.sourceforge.net/DTD/sodipodi-0.dtd"
   xmlns:inkscape="http://www.inkscape.org/namespaces/inkscape"
   width="58.261707mm"
   height="30.313047mm"
   viewBox="0 0 58.261707 30.313047"
   version="1.1"
   id="svg8"
   inkscape:version="0.92.4 (5da689c313, 2019-01-14)"
   sodipodi:docname="sad_android.svg">
  <defs
     id="defs2" />
  <sodipodi:namedview
     id="base"
     pagecolor="#ffffff"
     bordercolor="#666666"
     borderopacity="1.0"
     inkscape:pageopacity="0.0"
     inkscape:pageshadow="2"
     inkscape:zoom="0.35"
     inkscape:cx="392.95801"
     inkscape:cy="-439.85836"
     inkscape:document-units="mm"
     inkscape:current-layer="layer1"
     showgrid="false"
     inkscape:window-width="1920"
     inkscape:window-height="1001"
     inkscape:window-x="-9"
     inkscape:window-y="-9"
     inkscape:window-maximized="1" />
  <metadata
     id="metadata5">
    <rdf:RDF>
      <cc:Work
         rdf:about="">
        <dc:format>image/svg+xml</dc:format>
        <dc:type
           rdf:resource="http://purl.org/dc/dcmitype/StillImage" />
        <dc:title></dc:title>
      </cc:Work>
    </rdf:RDF>
  </metadata>
  <g
     inkscape:label="Calque 1"
     inkscape:groupmode="layer"
     id="layer1"
     transform="translate(-1.8631933,-2.1410949)">
    <g
       id="g3747"
       transform="matrix(0.26458333,0,0,0.26458333,-2.9135119,-35.27919)">
      <path
         id="path3713"
         d="m 184.117,171.899 16.052,-22.236 c 1.205,-1.67 0.828,-4.006 -0.844,-5.211 -1.675,-1.207 -4.006,-0.832 -5.214,0.841 l -16.082,22.276 c -0.207,0.291 -0.354,0.605 -0.471,0.928 -14.802,-7.064 -31.592,-11.072 -49.403,-11.072 -17.497,0 -34.004,3.871 -48.613,10.705 -0.092,-0.192 -0.197,-0.383 -0.325,-0.561 L 63.135,145.293 c -1.206,-1.673 -3.537,-2.046 -5.213,-0.845 -1.674,1.209 -2.05,3.543 -0.843,5.215 l 15.777,21.852 C 42.373,188.378 21.647,218.75 20.368,253.686 h 215.575 c -1.272,-34.681 -21.711,-64.853 -51.826,-81.787 z"
         inkscape:connector-curvature="0"
         style="fill:#b6d152" />
      <path
         id="path3715"
         d="m 76.021,182.548 c -0.534,0 -1.053,-0.277 -1.339,-0.775 -0.424,-0.738 -0.169,-1.682 0.571,-2.105 2.11,-1.209 4.304,-2.363 6.519,-3.429 0.769,-0.37 1.691,-0.046 2.06,0.722 0.369,0.768 0.045,1.689 -0.722,2.059 -2.148,1.033 -4.276,2.151 -6.323,3.325 -0.242,0.138 -0.505,0.203 -0.766,0.203 z"
         inkscape:connector-curvature="0"
         style="fill:#f1f2f2" />
      <path
         id="path3717"
         d="m 40.554,218.337 c -0.249,0 -0.502,-0.061 -0.737,-0.188 -0.746,-0.408 -1.024,-1.344 -0.617,-2.092 6.967,-12.796 17.294,-24.045 29.861,-32.531 0.709,-0.477 1.666,-0.291 2.144,0.416 0.476,0.705 0.291,1.664 -0.416,2.141 -12.16,8.211 -22.148,19.086 -28.88,31.449 -0.279,0.514 -0.808,0.805 -1.355,0.805 z"
         inkscape:connector-curvature="0"
         style="fill:#f1f2f2" />
      <g
         id="g3721">
        <path
           id="path3719"
           d="m 162.703,205.37 c 0,20.41 -10.768,38.299 -26.926,48.315 h 100.166 c -1.272,-34.681 -21.711,-64.853 -51.826,-81.786 l 16.052,-22.236 c 1.205,-1.67 0.828,-4.006 -0.844,-5.211 -1.675,-1.207 -4.006,-0.832 -5.214,0.841 l -16.082,22.276 c -0.207,0.291 -0.354,0.605 -0.471,0.928 -12.363,-5.902 -26.114,-9.659 -40.687,-10.741 15.546,10.138 25.832,27.669 25.832,47.614 z"
           inkscape:connector-curvature="0"
           style="fill:#9fb543" />
      </g>
      <path
         id="path3723"
         d="M 235.943,256 H 20.368 c -0.628,0 -1.229,-0.255 -1.667,-0.708 -0.435,-0.453 -0.667,-1.063 -0.646,-1.691 1.244,-33.959 20.405,-64.736 51.413,-82.822 l -14.266,-19.76 c -1.952,-2.705 -1.339,-6.494 1.365,-8.445 1.042,-0.748 2.264,-1.143 3.538,-1.143 1.938,0 3.773,0.938 4.905,2.509 l 15.355,21.269 c 14.983,-6.701 31.051,-10.098 47.788,-10.098 17.023,0 33.327,3.502 48.499,10.411 l 15.581,-21.583 c 1.135,-1.57 2.968,-2.508 4.905,-2.508 1.275,0 2.498,0.396 3.538,1.144 1.312,0.946 2.173,2.344 2.434,3.939 0.257,1.595 -0.121,3.194 -1.066,4.504 l -14.553,20.157 c 30.61,18.139 49.529,48.77 50.763,82.426 0.022,0.628 -0.212,1.238 -0.646,1.691 -0.435,0.453 -1.036,0.708 -1.665,0.708 z M 22.799,251.372 h 210.713 c -2.017,-31.896 -20.765,-60.719 -50.529,-77.457 -0.572,-0.323 -0.983,-0.876 -1.124,-1.52 -0.142,-0.644 -0.002,-1.318 0.384,-1.852 l 16.052,-22.234 c 0.221,-0.306 0.31,-0.682 0.249,-1.058 -0.06,-0.374 -0.264,-0.702 -0.569,-0.923 -0.311,-0.223 -0.625,-0.271 -0.833,-0.271 -0.462,0 -0.883,0.214 -1.154,0.589 l -16.081,22.275 c -0.052,0.072 -0.109,0.193 -0.173,0.365 -0.223,0.613 -0.694,1.104 -1.297,1.351 -0.605,0.246 -1.285,0.228 -1.874,-0.054 -15.076,-7.197 -31.363,-10.847 -48.406,-10.847 -16.728,0 -32.754,3.528 -47.633,10.487 -1.153,0.537 -2.518,0.049 -3.066,-1.096 -0.032,-0.066 -0.063,-0.137 -0.109,-0.199 L 61.261,146.644 c -0.271,-0.374 -0.69,-0.588 -1.152,-0.588 -0.21,0 -0.524,0.048 -0.834,0.271 -0.632,0.454 -0.776,1.346 -0.316,1.98 l 15.776,21.852 c 0.388,0.536 0.527,1.214 0.382,1.86 -0.145,0.646 -0.56,1.198 -1.137,1.519 -30.162,16.686 -49.152,45.649 -51.181,77.834 z"
         inkscape:connector-curvature="0"
         style="fill:#594a42" />
      <path
         id="path3725"
         d="m 165.86,215.954 c -6.942,0 -12.59,-5.648 -12.59,-12.59 0,-0.664 0.053,-1.335 0.157,-1.996 0.201,-1.262 1.379,-2.119 2.649,-1.922 1.26,0.199 2.121,1.385 1.922,2.646 -0.066,0.423 -0.102,0.852 -0.102,1.271 0,4.389 3.572,7.963 7.963,7.963 2.271,0 4.439,-0.975 5.952,-2.673 0.848,-0.95 2.313,-1.04 3.265,-0.188 0.956,0.85 1.04,2.313 0.19,3.266 -2.387,2.684 -5.817,4.223 -9.406,4.223 z"
         inkscape:connector-curvature="0"
         style="fill:#594a42" />
      <path
         id="path3727"
         d="m 89.223,215.954 c -3.591,0 -7.02,-1.539 -9.408,-4.223 -0.85,-0.953 -0.766,-2.416 0.19,-3.266 0.953,-0.853 2.417,-0.765 3.265,0.188 1.514,1.698 3.682,2.673 5.953,2.673 4.39,0 7.963,-3.574 7.963,-7.963 0,-0.42 -0.036,-0.849 -0.102,-1.271 -0.201,-1.262 0.662,-2.447 1.921,-2.646 1.271,-0.199 2.449,0.66 2.649,1.922 0.105,0.661 0.158,1.332 0.158,1.996 0.001,6.942 -5.648,12.59 -12.589,12.59 z"
         inkscape:connector-curvature="0"
         style="fill:#594a42" />
      <path
         id="path3729"
         d="m 137.378,233.368 c -1.007,0 -1.935,-0.665 -2.224,-1.684 -0.62,-2.185 -2.146,-4.004 -4.191,-4.993 -3.951,-1.914 -8.726,-0.255 -10.636,3.698 -0.186,0.385 -0.34,0.783 -0.461,1.181 -0.365,1.226 -1.66,1.921 -2.877,1.556 -1.225,-0.365 -1.921,-1.653 -1.557,-2.878 0.189,-0.633 0.435,-1.263 0.726,-1.872 3.026,-6.249 10.568,-8.876 16.818,-5.851 3.235,1.563 5.651,4.442 6.631,7.898 0.348,1.229 -0.367,2.508 -1.596,2.856 -0.209,0.06 -0.422,0.089 -0.633,0.089 z"
         inkscape:connector-curvature="0"
         style="fill:#594a42" />
    </g>
  </g>
</svg>
