<mxfile host="app.diagrams.net" modified="2021-04-14T11:25:12.743Z" agent="5.0 (Windows NT 10.0; Win64; x64) AppleWebKit/537.36 (KHTML, like Gecko) Chrome/89.0.4389.72 Safari/537.36 Edg/89.0.774.45" etag="fNAj-45doBnxwbUts2JN" version="14.6.0" type="gitlab">
  <diagram id="AstFH2ZL_ywyFGTWUJ4x" name="Page-1">
    <mxGraphModel dx="1422" dy="794" grid="1" gridSize="10" guides="1" tooltips="1" connect="1" arrows="1" fold="1" page="1" pageScale="1" pageWidth="850" pageHeight="1100" math="0" shadow="0">
      <root>
        <mxCell id="0" />
        <mxCell id="1" parent="0" />
        <mxCell id="gZ4J8YPwYg1U6b-qEgUV-1" value="" style="verticalLabelPosition=bottom;verticalAlign=top;html=1;shape=card;whiteSpace=wrap;size=20;arcSize=12;" parent="1" vertex="1">
          <mxGeometry x="360" y="260" width="190" height="50" as="geometry" />
        </mxCell>
        <mxCell id="gZ4J8YPwYg1U6b-qEgUV-2" value="W now contains the index of the position read from PORTD." style="text;html=1;strokeColor=none;fillColor=none;align=center;verticalAlign=middle;whiteSpace=wrap;rounded=0;" parent="1" vertex="1">
          <mxGeometry x="370" y="265" width="170" height="40" as="geometry" />
        </mxCell>
        <mxCell id="gZ4J8YPwYg1U6b-qEgUV-3" value="" style="verticalLabelPosition=bottom;verticalAlign=top;html=1;shape=card;whiteSpace=wrap;size=20;arcSize=12;" parent="1" vertex="1">
          <mxGeometry x="350" y="260" width="210" height="50" as="geometry" />
        </mxCell>
        <mxCell id="gZ4J8YPwYg1U6b-qEgUV-4" value="W now contains the index of the position read from PORTD." style="text;html=1;strokeColor=none;fillColor=none;align=center;verticalAlign=middle;whiteSpace=wrap;rounded=0;" parent="1" vertex="1">
          <mxGeometry x="360" y="265" width="190" height="40" as="geometry" />
        </mxCell>
        <mxCell id="gZ4J8YPwYg1U6b-qEgUV-5" value="" style="verticalLabelPosition=bottom;verticalAlign=top;html=1;shape=card;whiteSpace=wrap;size=20;arcSize=12;" parent="1" vertex="1">
          <mxGeometry x="350" y="700" width="210" height="50" as="geometry" />
        </mxCell>
        <mxCell id="gZ4J8YPwYg1U6b-qEgUV-6" value="W now contains the next position value to write to PORTD." style="text;html=1;strokeColor=none;fillColor=none;align=center;verticalAlign=middle;whiteSpace=wrap;rounded=0;" parent="1" vertex="1">
          <mxGeometry x="365" y="705" width="190" height="40" as="geometry" />
        </mxCell>
        <mxCell id="gZ4J8YPwYg1U6b-qEgUV-7" value="" style="edgeStyle=orthogonalEdgeStyle;rounded=0;orthogonalLoop=1;jettySize=auto;html=1;entryX=0.5;entryY=0;entryDx=0;entryDy=0;" parent="1" source="gZ4J8YPwYg1U6b-qEgUV-8" target="gZ4J8YPwYg1U6b-qEgUV-10" edge="1">
          <mxGeometry relative="1" as="geometry">
            <mxPoint x="100" as="targetPoint" />
          </mxGeometry>
        </mxCell>
        <mxCell id="gZ4J8YPwYg1U6b-qEgUV-8" value="INIT" style="strokeWidth=2;html=1;shape=mxgraph.flowchart.start_1;whiteSpace=wrap;" parent="1" vertex="1">
          <mxGeometry x="50" y="10" width="100" height="60" as="geometry" />
        </mxCell>
        <mxCell id="gZ4J8YPwYg1U6b-qEgUV-9" value="" style="edgeStyle=orthogonalEdgeStyle;rounded=0;orthogonalLoop=1;jettySize=auto;html=1;" parent="1" source="gZ4J8YPwYg1U6b-qEgUV-10" target="gZ4J8YPwYg1U6b-qEgUV-13" edge="1">
          <mxGeometry relative="1" as="geometry" />
        </mxCell>
        <mxCell id="gZ4J8YPwYg1U6b-qEgUV-10" value="CheckButton" style="rounded=1;whiteSpace=wrap;html=1;absoluteArcSize=1;arcSize=14;strokeWidth=2;" parent="1" vertex="1">
          <mxGeometry x="50" y="100" width="100" height="60" as="geometry" />
        </mxCell>
        <mxCell id="gZ4J8YPwYg1U6b-qEgUV-11" value="Yes" style="edgeStyle=orthogonalEdgeStyle;rounded=0;orthogonalLoop=1;jettySize=auto;html=1;" parent="1" source="gZ4J8YPwYg1U6b-qEgUV-13" target="gZ4J8YPwYg1U6b-qEgUV-17" edge="1">
          <mxGeometry x="-0.6667" y="10" relative="1" as="geometry">
            <mxPoint as="offset" />
          </mxGeometry>
        </mxCell>
        <mxCell id="gZ4J8YPwYg1U6b-qEgUV-12" value="No" style="edgeStyle=orthogonalEdgeStyle;rounded=0;orthogonalLoop=1;jettySize=auto;html=1;entryX=0.5;entryY=0;entryDx=0;entryDy=0;entryPerimeter=0;exitX=0.5;exitY=1;exitDx=0;exitDy=0;exitPerimeter=0;" parent="1" source="gZ4J8YPwYg1U6b-qEgUV-13" target="gZ4J8YPwYg1U6b-qEgUV-15" edge="1">
          <mxGeometry x="-1" y="-20" relative="1" as="geometry">
            <Array as="points">
              <mxPoint x="250" y="210" />
              <mxPoint x="100" y="210" />
            </Array>
            <mxPoint as="offset" />
          </mxGeometry>
        </mxCell>
        <mxCell id="gZ4J8YPwYg1U6b-qEgUV-13" value="Button&lt;br&gt;Pressed" style="strokeWidth=2;html=1;shape=mxgraph.flowchart.decision;whiteSpace=wrap;" parent="1" vertex="1">
          <mxGeometry x="190" y="70" width="120" height="120" as="geometry" />
        </mxCell>
        <mxCell id="gZ4J8YPwYg1U6b-qEgUV-14" value="" style="edgeStyle=orthogonalEdgeStyle;rounded=0;orthogonalLoop=1;jettySize=auto;html=1;" parent="1" source="gZ4J8YPwYg1U6b-qEgUV-15" target="gZ4J8YPwYg1U6b-qEgUV-26" edge="1">
          <mxGeometry relative="1" as="geometry" />
        </mxCell>
        <mxCell id="gZ4J8YPwYg1U6b-qEgUV-15" value="Delay 50 ms" style="strokeWidth=2;html=1;shape=mxgraph.flowchart.delay;whiteSpace=wrap;" parent="1" vertex="1">
          <mxGeometry x="50" y="240" width="100" height="60" as="geometry" />
        </mxCell>
        <mxCell id="gZ4J8YPwYg1U6b-qEgUV-16" value="" style="edgeStyle=orthogonalEdgeStyle;rounded=0;orthogonalLoop=1;jettySize=auto;html=1;" parent="1" source="gZ4J8YPwYg1U6b-qEgUV-17" target="gZ4J8YPwYg1U6b-qEgUV-20" edge="1">
          <mxGeometry relative="1" as="geometry" />
        </mxCell>
        <mxCell id="gZ4J8YPwYg1U6b-qEgUV-17" value="&lt;font face=&quot;Courier New&quot;&gt;(mode)&lt;br&gt;=&lt;br&gt;(mode) + 1&lt;/font&gt;" style="rounded=1;whiteSpace=wrap;html=1;absoluteArcSize=1;arcSize=14;strokeWidth=2;" parent="1" vertex="1">
          <mxGeometry x="350" y="100" width="100" height="60" as="geometry" />
        </mxCell>
        <mxCell id="gZ4J8YPwYg1U6b-qEgUV-18" value="Yes" style="edgeStyle=orthogonalEdgeStyle;rounded=0;orthogonalLoop=1;jettySize=auto;html=1;" parent="1" source="gZ4J8YPwYg1U6b-qEgUV-20" target="gZ4J8YPwYg1U6b-qEgUV-22" edge="1">
          <mxGeometry x="-0.6667" y="10" relative="1" as="geometry">
            <mxPoint as="offset" />
          </mxGeometry>
        </mxCell>
        <mxCell id="gZ4J8YPwYg1U6b-qEgUV-19" value="No" style="edgeStyle=orthogonalEdgeStyle;rounded=0;orthogonalLoop=1;jettySize=auto;html=1;" parent="1" source="gZ4J8YPwYg1U6b-qEgUV-20" edge="1">
          <mxGeometry x="-0.7576" y="-20" relative="1" as="geometry">
            <mxPoint x="250" y="210" as="targetPoint" />
            <Array as="points">
              <mxPoint x="550" y="210" />
            </Array>
            <mxPoint as="offset" />
          </mxGeometry>
        </mxCell>
        <mxCell id="gZ4J8YPwYg1U6b-qEgUV-20" value="&lt;font face=&quot;Courier New&quot;&gt;(mode) - 1&lt;br&gt;==&lt;br&gt;MODE_MAX&lt;/font&gt;" style="strokeWidth=2;html=1;shape=mxgraph.flowchart.decision;whiteSpace=wrap;" parent="1" vertex="1">
          <mxGeometry x="490" y="70" width="120" height="120" as="geometry" />
        </mxCell>
        <mxCell id="gZ4J8YPwYg1U6b-qEgUV-21" style="edgeStyle=orthogonalEdgeStyle;rounded=0;orthogonalLoop=1;jettySize=auto;html=1;" parent="1" source="gZ4J8YPwYg1U6b-qEgUV-22" edge="1">
          <mxGeometry relative="1" as="geometry">
            <mxPoint x="550" y="210" as="targetPoint" />
            <Array as="points">
              <mxPoint x="715" y="210" />
            </Array>
          </mxGeometry>
        </mxCell>
        <mxCell id="gZ4J8YPwYg1U6b-qEgUV-22" value="&lt;font face=&quot;Courier New&quot;&gt;(mode)&lt;br&gt;=&lt;br&gt;MODE_MIN&lt;/font&gt;" style="rounded=1;whiteSpace=wrap;html=1;absoluteArcSize=1;arcSize=14;strokeWidth=2;" parent="1" vertex="1">
          <mxGeometry x="650" y="100" width="130" height="60" as="geometry" />
        </mxCell>
        <mxCell id="gZ4J8YPwYg1U6b-qEgUV-23" value="&lt;div style=&quot;color: rgb(0 , 0 , 0) ; float: left ; line-height: 1 ; background: rgb(215 , 215 , 215)&quot;&gt;&lt;font face=&quot;Courier New&quot; style=&quot;font-size: 12px&quot;&gt;&lt;span class=&quot;sc5&quot;&gt;MODE_CCW&lt;/span&gt;&lt;span class=&quot;sc0&quot;&gt;&amp;nbsp;&amp;nbsp;&lt;/span&gt;&lt;span class=&quot;sc9&quot; style=&quot;color: rgb(0 , 128 , 255)&quot;&gt;equ&lt;/span&gt;&lt;span class=&quot;sc0&quot;&gt;   &lt;/span&gt;&lt;span class=&quot;sc2&quot; style=&quot;color: rgb(255 , 128 , 0)&quot;&gt;0xFF&lt;/span&gt;&lt;span class=&quot;sc0&quot;&gt;&lt;br&gt;&lt;/span&gt;&lt;span class=&quot;sc5&quot;&gt;MODE_STOP&lt;/span&gt;&lt;span class=&quot;sc0&quot;&gt; &lt;/span&gt;&lt;span class=&quot;sc9&quot; style=&quot;color: rgb(0 , 128 , 255)&quot;&gt;equ&lt;/span&gt;&lt;span class=&quot;sc0&quot;&gt;   &lt;/span&gt;&lt;span class=&quot;sc2&quot; style=&quot;color: rgb(255 , 128 , 0)&quot;&gt;0x00&lt;/span&gt;&lt;span class=&quot;sc0&quot;&gt;&lt;br&gt;&lt;/span&gt;&lt;span class=&quot;sc5&quot;&gt;MODE_CW&lt;/span&gt;&lt;span class=&quot;sc0&quot;&gt;&amp;nbsp; &amp;nbsp;&lt;/span&gt;&lt;span class=&quot;sc9&quot; style=&quot;color: rgb(0 , 128 , 255)&quot;&gt;equ&lt;/span&gt;&lt;span class=&quot;sc0&quot;&gt;   &lt;/span&gt;&lt;span class=&quot;sc2&quot; style=&quot;color: rgb(255 , 128 , 0)&quot;&gt;0x01&lt;/span&gt;&lt;span class=&quot;sc0&quot;&gt;&lt;br&gt;#&lt;/span&gt;&lt;span class=&quot;sc5&quot;&gt;define&lt;/span&gt;&lt;span class=&quot;sc0&quot;&gt;     &lt;/span&gt;&lt;span class=&quot;sc5&quot;&gt;MODE_MIN&lt;/span&gt;&lt;span class=&quot;sc0&quot;&gt;  &lt;/span&gt;&lt;span class=&quot;sc5&quot;&gt;MODE_CCW&lt;/span&gt;&lt;span class=&quot;sc0&quot;&gt;&lt;br&gt;#&lt;/span&gt;&lt;span class=&quot;sc5&quot;&gt;define&lt;/span&gt;&lt;span class=&quot;sc0&quot;&gt;     &lt;/span&gt;&lt;span class=&quot;sc5&quot;&gt;MODE_MAX&lt;/span&gt;&lt;span class=&quot;sc0&quot;&gt;  &lt;/span&gt;&lt;span class=&quot;sc5&quot;&gt;MODE_CW&lt;/span&gt;&lt;/font&gt;&lt;/div&gt;" style="text;html=1;strokeColor=none;fillColor=#d7d7d7;align=left;verticalAlign=middle;whiteSpace=wrap;rounded=0;" parent="1" vertex="1">
          <mxGeometry x="570" y="230" width="200" height="70" as="geometry" />
        </mxCell>
        <mxCell id="gZ4J8YPwYg1U6b-qEgUV-24" value="&lt;div style=&quot;color: rgb(0 , 0 , 0) ; float: left ; line-height: 1 ; background: rgb(215 , 215 , 215)&quot;&gt;&lt;font face=&quot;Courier New&quot; style=&quot;font-size: 12px&quot;&gt;&lt;span class=&quot;sc0&quot;&gt;#&lt;/span&gt;&lt;span class=&quot;sc5&quot;&gt;define&lt;/span&gt;&lt;span class=&quot;sc0&quot;&gt;     &lt;/span&gt;&lt;span class=&quot;sc5&quot;&gt;POSITION_IDX_MIN&lt;/span&gt;&lt;span class=&quot;sc0&quot;&gt;  &lt;/span&gt;&lt;span class=&quot;sc2&quot; style=&quot;color: rgb(255 , 128 , 0)&quot;&gt;0&lt;/span&gt;&lt;span class=&quot;sc0&quot;&gt;&lt;br&gt;#&lt;/span&gt;&lt;span class=&quot;sc5&quot;&gt;define&lt;/span&gt;&lt;span class=&quot;sc0&quot;&gt;     &lt;/span&gt;&lt;span class=&quot;sc5&quot;&gt;POSITION_IDX_MAX&lt;/span&gt;&lt;span class=&quot;sc0&quot;&gt;  &lt;/span&gt;&lt;span class=&quot;sc2&quot; style=&quot;color: rgb(255 , 128 , 0)&quot;&gt;3&lt;/span&gt;&lt;/font&gt;&lt;/div&gt;" style="text;html=1;strokeColor=none;fillColor=#d7d7d7;align=left;verticalAlign=middle;whiteSpace=wrap;rounded=0;" parent="1" vertex="1">
          <mxGeometry x="860" y="500" width="200" height="30" as="geometry" />
        </mxCell>
        <mxCell id="gZ4J8YPwYg1U6b-qEgUV-25" value="" style="edgeStyle=orthogonalEdgeStyle;rounded=0;orthogonalLoop=1;jettySize=auto;html=1;" parent="1" source="gZ4J8YPwYg1U6b-qEgUV-26" target="gZ4J8YPwYg1U6b-qEgUV-32" edge="1">
          <mxGeometry relative="1" as="geometry" />
        </mxCell>
        <mxCell id="gZ4J8YPwYg1U6b-qEgUV-26" value="&lt;font face=&quot;Courier New&quot;&gt;(W)&lt;br&gt;=&lt;br&gt;(PORTD)&lt;/font&gt;" style="shape=parallelogram;html=1;strokeWidth=2;perimeter=parallelogramPerimeter;whiteSpace=wrap;rounded=1;arcSize=12;size=0.23;" parent="1" vertex="1">
          <mxGeometry x="50" y="340" width="100" height="60" as="geometry" />
        </mxCell>
        <mxCell id="gZ4J8YPwYg1U6b-qEgUV-27" style="edgeStyle=orthogonalEdgeStyle;rounded=0;orthogonalLoop=1;jettySize=auto;html=1;entryX=1;entryY=0.5;entryDx=0;entryDy=0;" parent="1" source="gZ4J8YPwYg1U6b-qEgUV-28" target="gZ4J8YPwYg1U6b-qEgUV-52" edge="1">
          <mxGeometry relative="1" as="geometry" />
        </mxCell>
        <mxCell id="gZ4J8YPwYg1U6b-qEgUV-28" value="&lt;font face=&quot;Courier New&quot;&gt;IndexToPosition&lt;/font&gt;" style="strokeWidth=2;html=1;shape=mxgraph.flowchart.stored_data;whiteSpace=wrap;align=center;" parent="1" vertex="1">
          <mxGeometry x="390" y="770" width="140" height="60" as="geometry" />
        </mxCell>
        <mxCell id="gZ4J8YPwYg1U6b-qEgUV-29" value="" style="edgeStyle=orthogonalEdgeStyle;rounded=0;orthogonalLoop=1;jettySize=auto;html=1;" parent="1" source="gZ4J8YPwYg1U6b-qEgUV-30" target="gZ4J8YPwYg1U6b-qEgUV-34" edge="1">
          <mxGeometry relative="1" as="geometry" />
        </mxCell>
        <mxCell id="gZ4J8YPwYg1U6b-qEgUV-30" value="&lt;font face=&quot;Courier New&quot;&gt;PositionToIndex&lt;/font&gt;" style="strokeWidth=2;html=1;shape=mxgraph.flowchart.stored_data;whiteSpace=wrap;align=center;" parent="1" vertex="1">
          <mxGeometry x="390" y="340" width="140" height="60" as="geometry" />
        </mxCell>
        <mxCell id="gZ4J8YPwYg1U6b-qEgUV-31" value="" style="edgeStyle=orthogonalEdgeStyle;rounded=0;orthogonalLoop=1;jettySize=auto;html=1;" parent="1" source="gZ4J8YPwYg1U6b-qEgUV-32" target="gZ4J8YPwYg1U6b-qEgUV-30" edge="1">
          <mxGeometry relative="1" as="geometry" />
        </mxCell>
        <mxCell id="gZ4J8YPwYg1U6b-qEgUV-32" value="&lt;font face=&quot;Courier New&quot;&gt;(W)&lt;br&gt;=&lt;br&gt;(W) XOR B&#39;00001111&#39;&lt;/font&gt;" style="rounded=1;whiteSpace=wrap;html=1;absoluteArcSize=1;arcSize=14;strokeWidth=2;" parent="1" vertex="1">
          <mxGeometry x="200" y="340" width="140" height="60" as="geometry" />
        </mxCell>
        <mxCell id="gZ4J8YPwYg1U6b-qEgUV-33" value="" style="edgeStyle=orthogonalEdgeStyle;rounded=0;orthogonalLoop=1;jettySize=auto;html=1;" parent="1" source="gZ4J8YPwYg1U6b-qEgUV-34" target="gZ4J8YPwYg1U6b-qEgUV-38" edge="1">
          <mxGeometry relative="1" as="geometry" />
        </mxCell>
        <mxCell id="gZ4J8YPwYg1U6b-qEgUV-34" value="&lt;font face=&quot;Courier New&quot;&gt;(nextIndex)&lt;br&gt;=&lt;br&gt;(mode) + (W)&lt;/font&gt;" style="rounded=1;whiteSpace=wrap;html=1;absoluteArcSize=1;arcSize=14;strokeWidth=2;" parent="1" vertex="1">
          <mxGeometry x="580" y="340" width="100" height="60" as="geometry" />
        </mxCell>
        <mxCell id="gZ4J8YPwYg1U6b-qEgUV-35" value="" style="strokeWidth=2;html=1;shape=mxgraph.flowchart.annotation_2;align=left;labelPosition=right;pointerEvents=1;rotation=90;" parent="1" vertex="1">
          <mxGeometry x="435" y="245" width="50" height="170" as="geometry" />
        </mxCell>
        <mxCell id="gZ4J8YPwYg1U6b-qEgUV-36" value="Yes" style="edgeStyle=orthogonalEdgeStyle;rounded=0;orthogonalLoop=1;jettySize=auto;html=1;" parent="1" source="gZ4J8YPwYg1U6b-qEgUV-38" target="gZ4J8YPwYg1U6b-qEgUV-40" edge="1">
          <mxGeometry x="-0.5" y="10" relative="1" as="geometry">
            <mxPoint as="offset" />
          </mxGeometry>
        </mxCell>
        <mxCell id="gZ4J8YPwYg1U6b-qEgUV-37" value="No" style="edgeStyle=orthogonalEdgeStyle;rounded=0;orthogonalLoop=1;jettySize=auto;html=1;" parent="1" source="gZ4J8YPwYg1U6b-qEgUV-38" target="gZ4J8YPwYg1U6b-qEgUV-43" edge="1">
          <mxGeometry x="-1" y="-20" relative="1" as="geometry">
            <mxPoint as="offset" />
          </mxGeometry>
        </mxCell>
        <mxCell id="gZ4J8YPwYg1U6b-qEgUV-38" value="&lt;font face=&quot;Courier New&quot;&gt;(nextIndex) + 1&lt;br&gt;==&lt;br&gt;POSITION_IDX_MIN&lt;/font&gt;" style="strokeWidth=2;html=1;shape=mxgraph.flowchart.decision;whiteSpace=wrap;" parent="1" vertex="1">
          <mxGeometry x="730" y="290" width="160" height="160" as="geometry" />
        </mxCell>
        <mxCell id="gZ4J8YPwYg1U6b-qEgUV-39" style="edgeStyle=orthogonalEdgeStyle;rounded=0;orthogonalLoop=1;jettySize=auto;html=1;" parent="1" source="gZ4J8YPwYg1U6b-qEgUV-40" edge="1">
          <mxGeometry relative="1" as="geometry">
            <mxPoint x="810" y="480" as="targetPoint" />
            <Array as="points">
              <mxPoint x="995" y="480" />
              <mxPoint x="810" y="480" />
            </Array>
          </mxGeometry>
        </mxCell>
        <mxCell id="gZ4J8YPwYg1U6b-qEgUV-40" value="&lt;font face=&quot;Courier New&quot;&gt;(nextIndex)&lt;br&gt;=&lt;br&gt;POSITION_IDX_MAX&lt;/font&gt;" style="rounded=1;whiteSpace=wrap;html=1;absoluteArcSize=1;arcSize=14;strokeWidth=2;" parent="1" vertex="1">
          <mxGeometry x="930" y="340" width="130" height="60" as="geometry" />
        </mxCell>
        <mxCell id="gZ4J8YPwYg1U6b-qEgUV-41" value="Yes" style="edgeStyle=orthogonalEdgeStyle;rounded=0;orthogonalLoop=1;jettySize=auto;html=1;" parent="1" source="gZ4J8YPwYg1U6b-qEgUV-43" target="gZ4J8YPwYg1U6b-qEgUV-45" edge="1">
          <mxGeometry x="-0.5" y="10" relative="1" as="geometry">
            <mxPoint as="offset" />
          </mxGeometry>
        </mxCell>
        <mxCell id="gZ4J8YPwYg1U6b-qEgUV-42" value="No" style="edgeStyle=orthogonalEdgeStyle;rounded=0;orthogonalLoop=1;jettySize=auto;html=1;entryX=1;entryY=0.5;entryDx=0;entryDy=0;exitX=0.5;exitY=1;exitDx=0;exitDy=0;exitPerimeter=0;" parent="1" source="gZ4J8YPwYg1U6b-qEgUV-43" target="gZ4J8YPwYg1U6b-qEgUV-47" edge="1">
          <mxGeometry x="-1" y="-20" relative="1" as="geometry">
            <mxPoint x="810" y="690" as="sourcePoint" />
            <mxPoint x="710" y="710" as="targetPoint" />
            <Array as="points">
              <mxPoint x="810" y="800" />
            </Array>
            <mxPoint as="offset" />
          </mxGeometry>
        </mxCell>
        <mxCell id="gZ4J8YPwYg1U6b-qEgUV-43" value="&lt;font face=&quot;Courier New&quot;&gt;(nextIndex) - 1&lt;br&gt;==&lt;br&gt;POSITION_IDX_MAX&lt;/font&gt;" style="strokeWidth=2;html=1;shape=mxgraph.flowchart.decision;whiteSpace=wrap;" parent="1" vertex="1">
          <mxGeometry x="730" y="520" width="160" height="160" as="geometry" />
        </mxCell>
        <mxCell id="gZ4J8YPwYg1U6b-qEgUV-44" style="edgeStyle=orthogonalEdgeStyle;rounded=0;orthogonalLoop=1;jettySize=auto;html=1;exitX=0.5;exitY=1;exitDx=0;exitDy=0;" parent="1" source="gZ4J8YPwYg1U6b-qEgUV-45" edge="1">
          <mxGeometry relative="1" as="geometry">
            <mxPoint x="810" y="800" as="targetPoint" />
            <mxPoint x="995" y="640" as="sourcePoint" />
            <Array as="points">
              <mxPoint x="995" y="800" />
            </Array>
          </mxGeometry>
        </mxCell>
        <mxCell id="gZ4J8YPwYg1U6b-qEgUV-45" value="&lt;font face=&quot;Courier New&quot;&gt;(nextIndex)&lt;br&gt;=&lt;br&gt;POSITION_IDX_MIN&lt;/font&gt;" style="rounded=1;whiteSpace=wrap;html=1;absoluteArcSize=1;arcSize=14;strokeWidth=2;" parent="1" vertex="1">
          <mxGeometry x="930" y="570" width="130" height="60" as="geometry" />
        </mxCell>
        <mxCell id="gZ4J8YPwYg1U6b-qEgUV-46" value="" style="edgeStyle=orthogonalEdgeStyle;rounded=0;orthogonalLoop=1;jettySize=auto;html=1;" parent="1" source="gZ4J8YPwYg1U6b-qEgUV-47" target="gZ4J8YPwYg1U6b-qEgUV-28" edge="1">
          <mxGeometry relative="1" as="geometry" />
        </mxCell>
        <mxCell id="gZ4J8YPwYg1U6b-qEgUV-47" value="&lt;span style=&quot;font-family: &amp;#34;courier new&amp;#34;&quot;&gt;(W)&lt;br&gt;&lt;/span&gt;&lt;font face=&quot;Courier New&quot;&gt;=&lt;br&gt;(nextIndex)&lt;br&gt;&lt;/font&gt;" style="rounded=1;whiteSpace=wrap;html=1;absoluteArcSize=1;arcSize=14;strokeWidth=2;" parent="1" vertex="1">
          <mxGeometry x="580" y="770" width="100" height="60" as="geometry" />
        </mxCell>
        <mxCell id="gZ4J8YPwYg1U6b-qEgUV-48" value="&lt;div style=&quot;color: rgb(0 , 0 , 0) ; float: left ; line-height: 1 ; background: rgb(215 , 215 , 215)&quot;&gt;&lt;font face=&quot;Courier New&quot; style=&quot;font-size: 12px&quot;&gt;&lt;span class=&quot;sc1&quot; style=&quot;color: rgb(0 , 128 , 0)&quot;&gt;;*******************************************&lt;/span&gt;&lt;span class=&quot;sc0&quot;&gt;&lt;br&gt;&lt;/span&gt;&lt;span class=&quot;sc5&quot;&gt;IndexToPosition&lt;/span&gt;&lt;span class=&quot;sc0&quot;&gt;&lt;br&gt;&lt;/span&gt;&lt;span class=&quot;sc1&quot; style=&quot;color: rgb(0 , 128 , 0)&quot;&gt;;*******************************************&lt;/span&gt;&lt;span class=&quot;sc0&quot;&gt;&lt;br&gt; &lt;/span&gt;&lt;span class=&quot;sc1&quot; style=&quot;color: rgb(0 , 128 , 0)&quot;&gt;; Lookup table for Stepper Motor position&lt;/span&gt;&lt;span class=&quot;sc0&quot;&gt;&lt;br&gt; &lt;/span&gt;&lt;span class=&quot;sc5&quot;&gt;&amp;nbsp;addwf&lt;/span&gt;&lt;span class=&quot;sc0&quot;&gt;  &lt;/span&gt;&lt;span class=&quot;sc5&quot;&gt;PCL&lt;/span&gt;&lt;span class=&quot;sc4&quot; style=&quot;color: rgb(0 , 0 , 128) ; font-weight: bold&quot;&gt;,&lt;/span&gt;&lt;span class=&quot;sc0&quot;&gt; &lt;/span&gt;&lt;span class=&quot;sc5&quot;&gt;F&lt;/span&gt;&lt;span class=&quot;sc0&quot;&gt;  &lt;/span&gt;&lt;span class=&quot;sc1&quot; style=&quot;color: rgb(0 , 128 , 0)&quot;&gt;; PCL = PCL + W&lt;/span&gt;&lt;span class=&quot;sc0&quot;&gt;&lt;br&gt; &lt;/span&gt;&lt;span class=&quot;sc5&quot;&gt;&amp;nbsp;retlw&lt;/span&gt;&lt;span class=&quot;sc0&quot;&gt;  &lt;/span&gt;&lt;span class=&quot;sc5&quot;&gt;b&lt;/span&gt;&lt;span class=&quot;sc12&quot; style=&quot;color: rgb(128 , 128 , 0)&quot;&gt;&#39;0101&#39;&lt;/span&gt;&lt;span class=&quot;sc0&quot;&gt; &lt;/span&gt;&lt;span class=&quot;sc1&quot; style=&quot;color: rgb(0 , 128 , 0)&quot;&gt;; W =  0, POSITION_0&lt;/span&gt;&lt;span class=&quot;sc0&quot;&gt;&lt;br&gt; &lt;/span&gt;&lt;span class=&quot;sc5&quot;&gt;&amp;nbsp;retlw&lt;/span&gt;&lt;span class=&quot;sc0&quot;&gt;  &lt;/span&gt;&lt;span class=&quot;sc5&quot;&gt;b&lt;/span&gt;&lt;span class=&quot;sc12&quot; style=&quot;color: rgb(128 , 128 , 0)&quot;&gt;&#39;1001&#39;&lt;/span&gt;&lt;span class=&quot;sc0&quot;&gt; &lt;/span&gt;&lt;span class=&quot;sc1&quot; style=&quot;color: rgb(0 , 128 , 0)&quot;&gt;; W =  1, POSITION_1&lt;/span&gt;&lt;span class=&quot;sc0&quot;&gt;&lt;br&gt; &lt;/span&gt;&lt;span class=&quot;sc5&quot;&gt;&amp;nbsp;retlw&lt;/span&gt;&lt;span class=&quot;sc0&quot;&gt;  &lt;/span&gt;&lt;span class=&quot;sc5&quot;&gt;b&lt;/span&gt;&lt;span class=&quot;sc12&quot; style=&quot;color: rgb(128 , 128 , 0)&quot;&gt;&#39;1010&#39;&lt;/span&gt;&lt;span class=&quot;sc0&quot;&gt; &lt;/span&gt;&lt;span class=&quot;sc1&quot; style=&quot;color: rgb(0 , 128 , 0)&quot;&gt;; W =  2, POSITION_2&lt;/span&gt;&lt;span class=&quot;sc0&quot;&gt;&lt;br&gt; &lt;/span&gt;&lt;span class=&quot;sc5&quot;&gt;&amp;nbsp;retlw&lt;/span&gt;&lt;span class=&quot;sc0&quot;&gt;  &lt;/span&gt;&lt;span class=&quot;sc5&quot;&gt;b&lt;/span&gt;&lt;span class=&quot;sc12&quot; style=&quot;color: rgb(128 , 128 , 0)&quot;&gt;&#39;0110&#39;&lt;/span&gt;&lt;span class=&quot;sc0&quot;&gt; &lt;/span&gt;&lt;span class=&quot;sc1&quot; style=&quot;color: rgb(0 , 128 , 0)&quot;&gt;; W =  3, POSITION_3&lt;/span&gt;&lt;/font&gt;&lt;/div&gt;" style="text;html=1;strokeColor=none;fillColor=#d7d7d7;align=left;verticalAlign=middle;whiteSpace=wrap;rounded=0;" parent="1" vertex="1">
          <mxGeometry x="350" y="840" width="330" height="120" as="geometry" />
        </mxCell>
        <mxCell id="gZ4J8YPwYg1U6b-qEgUV-49" value="&lt;div style=&quot;color: rgb(0 , 0 , 0) ; float: left ; line-height: 1 ; background: rgb(215 , 215 , 215)&quot;&gt;&lt;font style=&quot;font-size: 12px&quot; face=&quot;Courier New&quot;&gt;&lt;span class=&quot;sc1&quot; style=&quot;color: rgb(0 , 128 , 0)&quot;&gt;;*************************************************&lt;/span&gt;&lt;span class=&quot;sc0&quot;&gt;&lt;br&gt;&lt;/span&gt;&lt;span class=&quot;sc5&quot;&gt;PositionToIndex&lt;/span&gt;&lt;span class=&quot;sc0&quot;&gt;&lt;br&gt;&lt;/span&gt;&lt;span class=&quot;sc1&quot; style=&quot;color: rgb(0 , 128 , 0)&quot;&gt;;*************************************************&lt;/span&gt;&lt;span class=&quot;sc0&quot;&gt;&lt;br&gt;&lt;/span&gt;&lt;span class=&quot;sc1&quot; style=&quot;color: rgb(0 , 128 , 0)&quot;&gt;; Translate read Port D value to numeric position&lt;/span&gt;&lt;span class=&quot;sc0&quot;&gt;&lt;br&gt; &lt;/span&gt;&lt;span class=&quot;sc5&quot;&gt;&amp;nbsp;addwf&lt;/span&gt;&lt;span class=&quot;sc0&quot;&gt;  &lt;/span&gt;&lt;span class=&quot;sc5&quot;&gt;PCL&lt;/span&gt;&lt;span class=&quot;sc4&quot; style=&quot;color: rgb(0 , 0 , 128) ; font-weight: bold&quot;&gt;,&lt;/span&gt;&lt;span class=&quot;sc0&quot;&gt; &lt;/span&gt;&lt;span class=&quot;sc5&quot;&gt;F&lt;/span&gt;&lt;span class=&quot;sc0&quot;&gt;  &lt;/span&gt;&lt;span class=&quot;sc1&quot; style=&quot;color: rgb(0 , 128 , 0)&quot;&gt;; PCL = PCL + W&lt;/span&gt;&lt;span class=&quot;sc0&quot;&gt;&lt;br&gt; &lt;/span&gt;&lt;span class=&quot;sc5&quot;&gt;&amp;nbsp;retlw&lt;/span&gt;&lt;span class=&quot;sc0&quot;&gt;  &lt;/span&gt;&lt;span class=&quot;sc5&quot;&gt;D&lt;/span&gt;&lt;span class=&quot;sc12&quot; style=&quot;color: rgb(128 , 128 , 0)&quot;&gt;&#39;0&#39;&lt;/span&gt;&lt;span class=&quot;sc0&quot;&gt; &lt;/span&gt;&lt;span class=&quot;sc1&quot; style=&quot;color: rgb(0 , 128 , 0)&quot;&gt;; W = D&#39;00&#39; = B&#39;0000&#39;&lt;/span&gt;&lt;span class=&quot;sc0&quot;&gt;&lt;br&gt; &lt;/span&gt;&lt;span class=&quot;sc5&quot;&gt;&amp;nbsp;retlw&lt;/span&gt;&lt;span class=&quot;sc0&quot;&gt;  &lt;/span&gt;&lt;span class=&quot;sc5&quot;&gt;D&lt;/span&gt;&lt;span class=&quot;sc12&quot; style=&quot;color: rgb(128 , 128 , 0)&quot;&gt;&#39;0&#39;&lt;/span&gt;&lt;span class=&quot;sc0&quot;&gt; &lt;/span&gt;&lt;span class=&quot;sc1&quot; style=&quot;color: rgb(0 , 128 , 0)&quot;&gt;; W = D&#39;01&#39; = B&#39;0001&#39;&lt;/span&gt;&lt;span class=&quot;sc0&quot;&gt;&lt;br&gt; &lt;/span&gt;&lt;span class=&quot;sc5&quot;&gt;&amp;nbsp;retlw&lt;/span&gt;&lt;span class=&quot;sc0&quot;&gt;  &lt;/span&gt;&lt;span class=&quot;sc5&quot;&gt;D&lt;/span&gt;&lt;span class=&quot;sc12&quot; style=&quot;color: rgb(128 , 128 , 0)&quot;&gt;&#39;0&#39;&lt;/span&gt;&lt;span class=&quot;sc0&quot;&gt; &lt;/span&gt;&lt;span class=&quot;sc1&quot; style=&quot;color: rgb(0 , 128 , 0)&quot;&gt;; W = D&#39;02&#39; = B&#39;0010&#39;&lt;/span&gt;&lt;span class=&quot;sc0&quot;&gt;&lt;br&gt; &lt;/span&gt;&lt;span class=&quot;sc5&quot;&gt;&amp;nbsp;retlw&lt;/span&gt;&lt;span class=&quot;sc0&quot;&gt;  &lt;/span&gt;&lt;span class=&quot;sc5&quot;&gt;D&lt;/span&gt;&lt;span class=&quot;sc12&quot; style=&quot;color: rgb(128 , 128 , 0)&quot;&gt;&#39;0&#39;&lt;/span&gt;&lt;span class=&quot;sc0&quot;&gt; &lt;/span&gt;&lt;span class=&quot;sc1&quot; style=&quot;color: rgb(0 , 128 , 0)&quot;&gt;; W = D&#39;03&#39; = B&#39;0011&#39;&lt;/span&gt;&lt;span class=&quot;sc0&quot;&gt;&lt;br&gt; &lt;/span&gt;&lt;span class=&quot;sc5&quot;&gt;&amp;nbsp;retlw&lt;/span&gt;&lt;span class=&quot;sc0&quot;&gt;  &lt;/span&gt;&lt;span class=&quot;sc5&quot;&gt;D&lt;/span&gt;&lt;span class=&quot;sc12&quot; style=&quot;color: rgb(128 , 128 , 0)&quot;&gt;&#39;0&#39;&lt;/span&gt;&lt;span class=&quot;sc0&quot;&gt; &lt;/span&gt;&lt;span class=&quot;sc1&quot; style=&quot;color: rgb(0 , 128 , 0)&quot;&gt;; W = D&#39;04&#39; = B&#39;0100&#39;&lt;/span&gt;&lt;span class=&quot;sc0&quot;&gt;&lt;br&gt; &lt;/span&gt;&lt;span class=&quot;sc5&quot;&gt;&amp;nbsp;retlw&lt;/span&gt;&lt;span class=&quot;sc0&quot;&gt;  &lt;/span&gt;&lt;span class=&quot;sc5&quot;&gt;D&lt;/span&gt;&lt;span class=&quot;sc12&quot; style=&quot;color: rgb(128 , 128 , 0)&quot;&gt;&#39;0&#39;&lt;/span&gt;&lt;span class=&quot;sc0&quot;&gt; &lt;/span&gt;&lt;span class=&quot;sc1&quot; style=&quot;color: rgb(0 , 128 , 0)&quot;&gt;; W = D&#39;05&#39; = B&#39;0101&#39;, POSITION_0&lt;/span&gt;&lt;span class=&quot;sc0&quot;&gt;&lt;br&gt; &lt;/span&gt;&lt;span class=&quot;sc5&quot;&gt;&amp;nbsp;retlw&lt;/span&gt;&lt;span class=&quot;sc0&quot;&gt;  &lt;/span&gt;&lt;span class=&quot;sc5&quot;&gt;D&lt;/span&gt;&lt;span class=&quot;sc12&quot; style=&quot;color: rgb(128 , 128 , 0)&quot;&gt;&#39;3&#39;&lt;/span&gt;&lt;span class=&quot;sc0&quot;&gt; &lt;/span&gt;&lt;span class=&quot;sc1&quot; style=&quot;color: rgb(0 , 128 , 0)&quot;&gt;; W = D&#39;06&#39; = B&#39;0110&#39;, POSITION_3&lt;/span&gt;&lt;span class=&quot;sc0&quot;&gt;&lt;br&gt; &lt;/span&gt;&lt;span class=&quot;sc5&quot;&gt;&amp;nbsp;retlw&lt;/span&gt;&lt;span class=&quot;sc0&quot;&gt;  &lt;/span&gt;&lt;span class=&quot;sc5&quot;&gt;D&lt;/span&gt;&lt;span class=&quot;sc12&quot; style=&quot;color: rgb(128 , 128 , 0)&quot;&gt;&#39;0&#39;&lt;/span&gt;&lt;span class=&quot;sc0&quot;&gt; &lt;/span&gt;&lt;span class=&quot;sc1&quot; style=&quot;color: rgb(0 , 128 , 0)&quot;&gt;; W = D&#39;07&#39; = B&#39;0111&#39;&lt;/span&gt;&lt;span class=&quot;sc0&quot;&gt;&lt;br&gt; &lt;/span&gt;&lt;span class=&quot;sc5&quot;&gt;&amp;nbsp;retlw&lt;/span&gt;&lt;span class=&quot;sc0&quot;&gt;  &lt;/span&gt;&lt;span class=&quot;sc5&quot;&gt;D&lt;/span&gt;&lt;span class=&quot;sc12&quot; style=&quot;color: rgb(128 , 128 , 0)&quot;&gt;&#39;0&#39;&lt;/span&gt;&lt;span class=&quot;sc0&quot;&gt; &lt;/span&gt;&lt;span class=&quot;sc1&quot; style=&quot;color: rgb(0 , 128 , 0)&quot;&gt;; W = D&#39;08&#39; = B&#39;1000&#39;&lt;/span&gt;&lt;span class=&quot;sc0&quot;&gt;&lt;br&gt; &lt;/span&gt;&lt;span class=&quot;sc5&quot;&gt;&amp;nbsp;retlw&lt;/span&gt;&lt;span class=&quot;sc0&quot;&gt;  &lt;/span&gt;&lt;span class=&quot;sc5&quot;&gt;D&lt;/span&gt;&lt;span class=&quot;sc12&quot; style=&quot;color: rgb(128 , 128 , 0)&quot;&gt;&#39;1&#39;&lt;/span&gt;&lt;span class=&quot;sc0&quot;&gt; &lt;/span&gt;&lt;span class=&quot;sc1&quot; style=&quot;color: rgb(0 , 128 , 0)&quot;&gt;; W = D&#39;09&#39; = B&#39;1001&#39;, POSITION_1&lt;/span&gt;&lt;span class=&quot;sc0&quot;&gt;&lt;br&gt; &lt;/span&gt;&lt;span class=&quot;sc5&quot;&gt;&amp;nbsp;retlw&lt;/span&gt;&lt;span class=&quot;sc0&quot;&gt;  &lt;/span&gt;&lt;span class=&quot;sc5&quot;&gt;D&lt;/span&gt;&lt;span class=&quot;sc12&quot; style=&quot;color: rgb(128 , 128 , 0)&quot;&gt;&#39;2&#39;&lt;/span&gt;&lt;span class=&quot;sc0&quot;&gt; &lt;/span&gt;&lt;span class=&quot;sc1&quot; style=&quot;color: rgb(0 , 128 , 0)&quot;&gt;; W = D&#39;10&#39; = B&#39;1010&#39;, POSITION_2&lt;/span&gt;&lt;span class=&quot;sc0&quot;&gt;&lt;br&gt; &lt;/span&gt;&lt;span class=&quot;sc5&quot;&gt;&amp;nbsp;retlw&lt;/span&gt;&lt;span class=&quot;sc0&quot;&gt;  &lt;/span&gt;&lt;span class=&quot;sc5&quot;&gt;D&lt;/span&gt;&lt;span class=&quot;sc12&quot; style=&quot;color: rgb(128 , 128 , 0)&quot;&gt;&#39;0&#39;&lt;/span&gt;&lt;span class=&quot;sc0&quot;&gt; &lt;/span&gt;&lt;span class=&quot;sc1&quot; style=&quot;color: rgb(0 , 128 , 0)&quot;&gt;; W = D&#39;11&#39; = B&#39;1011&#39;&lt;/span&gt;&lt;span class=&quot;sc0&quot;&gt;&lt;br&gt; &lt;/span&gt;&lt;span class=&quot;sc5&quot;&gt;&amp;nbsp;retlw&lt;/span&gt;&lt;span class=&quot;sc0&quot;&gt;  &lt;/span&gt;&lt;span class=&quot;sc5&quot;&gt;D&lt;/span&gt;&lt;span class=&quot;sc12&quot; style=&quot;color: rgb(128 , 128 , 0)&quot;&gt;&#39;0&#39;&lt;/span&gt;&lt;span class=&quot;sc0&quot;&gt; &lt;/span&gt;&lt;span class=&quot;sc1&quot; style=&quot;color: rgb(0 , 128 , 0)&quot;&gt;; W = D&#39;12&#39; = B&#39;1100&#39;&lt;/span&gt;&lt;span class=&quot;sc0&quot;&gt;&lt;br&gt; &lt;/span&gt;&lt;span class=&quot;sc5&quot;&gt;&amp;nbsp;retlw&lt;/span&gt;&lt;span class=&quot;sc0&quot;&gt;  &lt;/span&gt;&lt;span class=&quot;sc5&quot;&gt;D&lt;/span&gt;&lt;span class=&quot;sc12&quot; style=&quot;color: rgb(128 , 128 , 0)&quot;&gt;&#39;0&#39;&lt;/span&gt;&lt;span class=&quot;sc0&quot;&gt; &lt;/span&gt;&lt;span class=&quot;sc1&quot; style=&quot;color: rgb(0 , 128 , 0)&quot;&gt;; W = D&#39;13&#39; = B&#39;1101&#39;&lt;/span&gt;&lt;span class=&quot;sc0&quot;&gt;&lt;br&gt; &lt;/span&gt;&lt;span class=&quot;sc5&quot;&gt;&amp;nbsp;retlw&lt;/span&gt;&lt;span class=&quot;sc0&quot;&gt;  &lt;/span&gt;&lt;span class=&quot;sc5&quot;&gt;D&lt;/span&gt;&lt;span class=&quot;sc12&quot; style=&quot;color: rgb(128 , 128 , 0)&quot;&gt;&#39;0&#39;&lt;/span&gt;&lt;span class=&quot;sc0&quot;&gt; &lt;/span&gt;&lt;span class=&quot;sc1&quot; style=&quot;color: rgb(0 , 128 , 0)&quot;&gt;; W = D&#39;14&#39; = B&#39;1110&#39;&lt;/span&gt;&lt;span class=&quot;sc0&quot;&gt;&lt;br&gt; &lt;/span&gt;&lt;span class=&quot;sc5&quot;&gt;&amp;nbsp;retlw&lt;/span&gt;&lt;span class=&quot;sc0&quot;&gt;  &lt;/span&gt;&lt;span class=&quot;sc5&quot;&gt;D&lt;/span&gt;&lt;span class=&quot;sc12&quot; style=&quot;color: rgb(128 , 128 , 0)&quot;&gt;&#39;0&#39;&lt;/span&gt;&lt;span class=&quot;sc0&quot;&gt; &lt;/span&gt;&lt;span class=&quot;sc1&quot; style=&quot;color: rgb(0 , 128 , 0)&quot;&gt;; W = D&#39;15&#39; = B&#39;1111&#39;&lt;/span&gt;&lt;/font&gt;&lt;/div&gt;" style="text;html=1;strokeColor=none;fillColor=#d7d7d7;align=left;verticalAlign=middle;whiteSpace=wrap;rounded=0;" parent="1" vertex="1">
          <mxGeometry x="350" y="415" width="370" height="275" as="geometry" />
        </mxCell>
        <mxCell id="gZ4J8YPwYg1U6b-qEgUV-50" value="" style="strokeWidth=2;html=1;shape=mxgraph.flowchart.annotation_2;align=left;labelPosition=right;pointerEvents=1;rotation=90;" parent="1" vertex="1">
          <mxGeometry x="435" y="680" width="50" height="170" as="geometry" />
        </mxCell>
        <mxCell id="gZ4J8YPwYg1U6b-qEgUV-51" style="edgeStyle=orthogonalEdgeStyle;rounded=0;orthogonalLoop=1;jettySize=auto;html=1;entryX=0;entryY=0.5;entryDx=0;entryDy=0;" parent="1" source="gZ4J8YPwYg1U6b-qEgUV-52" target="gZ4J8YPwYg1U6b-qEgUV-10" edge="1">
          <mxGeometry relative="1" as="geometry">
            <Array as="points">
              <mxPoint x="20" y="800" />
              <mxPoint x="20" y="130" />
            </Array>
          </mxGeometry>
        </mxCell>
        <mxCell id="gZ4J8YPwYg1U6b-qEgUV-52" value="&lt;font face=&quot;Courier New&quot;&gt;(PORTD)&lt;br&gt;=&lt;br&gt;(W)&lt;br&gt;&lt;/font&gt;" style="shape=parallelogram;html=1;strokeWidth=2;perimeter=parallelogramPerimeter;whiteSpace=wrap;rounded=1;arcSize=12;size=0.23;" parent="1" vertex="1">
          <mxGeometry x="50" y="770" width="100" height="60" as="geometry" />
        </mxCell>
      </root>
    </mxGraphModel>
  </diagram>
</mxfile>
