"année","15-24ans","25-29ans","30-34ans","35-39ans","40-50ans","ICF","age moyen des mères"
2002,3.3,13.0,11.6,5.2,0.6,1.88,29.4
2008,3.3,12.9,12.9,6.2,0.7,2.00,29.8
2010,3.3,12.9,13.3,6.4,0.7,2.02,29.9
2013,3.0,12.4,13.0,6.7,0.8,1.98,30.2
2014,2.9,12.3,13.1,7.0,0.8,1.99,30.3
2015,2.7,11.9,12.9,7.0,0.8,1.95,30.4
2016,2.6,11.5,12.9,7.0,0.8,1.92,30.5
2017,2.4,11.2,12.8,6.9,0.9,1.89,30.5
2018,2.3,11.0,12.7,7.0,0.9,1.87,30.6