"année","population","evolution population %"
2008,63.962,0.54  
2009,64.305,0.48       
2010,64.613,0.50      
2011,64.933,0.47           
2012,65.241,0.50       
2013,65.565,0.52	      
2014,65.907,0.43            
2015,66.422,0.37
2016,66.603,0.37
2017,66.768,0.33
2018,66.891,0.30