{
    "data" : [
        {
            "id" : 1,
            "name" : "John Doe",
            "payload" : [{
                "book" : "Know the Numbers",
                "book_id": 1,
                "total_chapters": 12,
                "chapters" : [
                    {
                        "id" : 1,
                        "segment" : "Count to Ten",
                        "segment_chapter": 5,
                        "segment_number" : 5
                    },
                    {
                        "id" : 2,
                        "segment" : "Count to infinity",
                        "segment_chapter": 8,
                        "segment_number" : 7
                    }
                ]
            }]
        },
        {
            "id" : 2,
            "name" : "Sheldon Cooper",
            "payload" : [{
                "book" : "Know the Numbers",
                "total_chapters": 12,
                "book_id": 2,
                "chapters" : [
                {
                    "id" : 1,
                    "segment" : "Count to Ten",
                    "content" : "Lorem ipsum dolor sit amet, consectetur adipiscing elit, sed do eiusmod tempor incididunt ut labore et dolore magna aliqua. Ut enim ad minim veniam, quis nostrud exercitation ullamco laboris nisi ut aliquip ex ea commodo consequat. Duis aute irure dolor in reprehenderit in voluptate velit esse cillum dolore eu fugiat nulla pariatur. Excepteur sint occaecat cupidatat non proident, sunt in culpa qui officia deserunt mollit anim id est laborum.",
                    "segment_chapter": 5,
                    "segment_number" : 6
                },
                {
                    "id" : 2,
                    "segment" : "Small Worlds and Large Worlds",
                    "content" : "true definition small. It’s like saying that the probability of rain and cold on the same day is equal to the probability that it’s cold, when it’s raining, times the probability of rain. Compare this statement to the one in the previous paragraph. Now since both right-hand sides above are equal to the same thing, Pr(W, L, p), they are also equal to one another: Pr(W, L|p) Pr(p) = Pr(p|W, L) Pr(W, L) So we can now solve for the thing that we want, Pr(p|W, L): Pr(p|W, L) = Pr(W, L|p) Pr(p) Pr(W, L) And this is Bayes’ theorem. It says that the probability of any particular value of p, considering the data, is equal to the product of the relative plausibility of the data, conditional on p, and the prior plausibility of p, divided by this thing Pr(W, L), which I’ll call the average probability of the data. In word form: Posterior = Probability of the data × Prior Average probability of the data The average probability of the data, Pr(W, L), can be confusing. It is commonly called the “evidence” or the “average likelihood,” neither of which is a transparent name. The probability Pr(W, L)is literally the average probability of the data. Averaged over what? Averaged over the prior. It’s job is just to standardize the posterior, to ensure it sums (integrates) to one. In mathematical form: Pr(W, L) = E Pr(W, L|p)   = Z Pr(W, L|p) Pr(p)dp The operator E means to take an expectation. Such averages are commonly called marginals in mathematical statistics, and so you may also see this same probability called a marginal likelihood. And the integral above just defines the proper way to compute the average over a continuous distribution of values, like the infinite possible values of p. The key lesson is that the posterior is proportional to the product of the prior and the probability of the data. Why? Because for each specific value of p, the number of paths through the garden of forking data is the product of the prior number of paths and the new number of paths. Multiplication is just compressed counting. The average probability on the bottom just standardizes the counts so they sum to one. So while Bayes’ theorem looks complicated, because the relationship with counting paths is obscured,"
                },
                {
                    "id" : 3,
                    "segment" : "Sampling the Imaginary",
                    "content" : "scenario. To repeat the structure of common examples, suppose there is a blood test that correctly detects vampirism 95% of the time. In more precise and mathematical notation, Pr(positive test result|vampire) = 0.95. It’s a very accurate test, nearly always catching real vampires. It also make mistakes, though, in the form of false positives. One percent of the time, it incorrectly diagnoses normal people as vampires, Pr(positive test result|mortal) = 0.01. The final bit of information we are told is that vampires are rather rare, being only 0.1% of the population, implying Pr(vampire) = 0.001. Suppose now that someone tests positive for vampirism. What’s the probability that he or she is a bloodsucking immortal? The correct approach is just to use Bayes’ theorem to invert the probability, to compute Pr(vampire|positive). The calculation can be presented as: Pr(vampire|positive) = Pr(positive|vampire) Pr(vampire) Pr(positive) where Pr(positive) is the average probability of a positive test result, that is, Pr(positive) = Pr(positive|vampire) Pr(vampire) + Pr(positive|mortal) 1 − Pr(vampire) Overthinking: Counting with sum. In the R code examples just above, I used the function sum to effectively count up how many samples fulfill a logical criterion. Why does this work? It works because R internally converts a logical expression, like samples < 0.5, to a vector of TRUE and FALSE results, one for each element of samples, saying whether or not each element matches the criterion. Go ahead and enter samples < 0.5 on the R prompt, to see this for yourself. Then when you sum this vector of TRUE and FALSE, R counts each TRUE as 1 and each FALSE as 0. So it ends up counting how many TRUE values are in the vector, which is the same as the number of elements in samples that match the logical criterion. 3.2.2. Intervals of defined"
                },
                {
                    "id" : 4,
                    "segment" : "Count to infinity",
                    "content" : "Sed ut perspiciatis unde omnis iste natus error sit voluptatem accusantium doloremque laudantium, totam rem aperiam, eaque ipsa quae ab illo inventore veritatis et quasi architecto beatae vitae dicta sunt explicabo. Nemo enim ipsam voluptatem quia voluptas sit aspernatur aut odit aut fugit, sed quia consequuntur magni dolores eos qui ratione voluptatem sequi nesciunt. Neque porro quisquam est, qui dolorem ipsum quia dolor sit amet, consectetur, adipisci velit, sed quia non numquam eius modi tempora incidunt ut labore et dolore magnam aliquam quaerat voluptatem. Ut enim ad minima veniam, quis nostrum exercitationem ullam corporis suscipit laboriosam, nisi ut aliquid ex ea commodi consequatur? Quis autem vel eum iure reprehenderit qui in ea voluptate velit esse quam nihil molestiae consequatur, vel illum qui dolorem eum fugiat quo voluptas nulla pariatur?",
                    "segment_chapter": 8,
                    "segment_number" : 6
                }
                ]
            },
            {
                "book" : "No Numbers Allowed",
                "total_chapters": 34,
                "book_id": 3,
                "chapters" : [
                {
                    "id" : 1,
                    "segment" : "Count to Ten",
                    "content" : "Mxnasdjiansdjnasjd",
                    "segment_chapter": 5,
                    "segment_number" : 14
                },
                {
                    "id" : 2,
                    "segment" : "Count to infinity",
                    "content" : "NXNN jnsdjn SUFJNSJKNAKN najdnfujNF",
                    "segment_chapter": 8,
                    "segment_number" : 20
                }
                ]
            },
            {
                "book" : "All the number minus 5",
                "total_chapters": 56,
                "book_id": 4,
                "chapters" : [
                {
                    "id" : 1,
                    "segment" : "Count to Ten",
                    "content" : "NXZXCVNVCBNN XZCV ASD najdnfujNF",
                    "segment_chapter": 5,
                    "segment_number" : 26
                },
                {
                    "id" : 2,
                    "segment" : "Count to infinity",
                    "content" : "XCV jnsdjCVBn XZV naNM,jdnfujNF",
                    "segment_chapter": 8,
                    "segment_number" : 30
                }
                ]
            }]
        }
    ]
}