{
  "npmScope": "reign-task",
  "affected": { "defaultBase": "master" },
  "implicitDependencies": {
    "workspace.json": "*",
    "package.json": { "dependencies": "*", "devDependencies": "*" },
    "tsconfig.base.json": "*",
    "tslint.json": "*",
    ".eslintrc.json": "*",
    "nx.json": "*"
  },
  "tasksRunnerOptions": {
    "default": {
      "runner": "@nrwl/workspace/tasks-runners/default",
      "options": { "cacheableOperations": ["build", "lint", "test", "e2e"] }
    }
  },
  "projects": {
    "reign-front": { "tags": [] },
    "reign-front-e2e": { "tags": [], "implicitDependencies": ["reign-front"] },
    "api": { "tags": [] },
    "data": { "tags": ["scope:public", "type:util", "target:all"] }
  }
}
