{
    "#v": [
        {
            "label": "Jira Ticket Event",
            "selectionLabel": "jiraTicket.jiraTicketEvent",
            "id": {
                "relationshipPath": [
                    "acb7bab2-8b3d-4ec2-a37c-8e0a1bca764e",
                    "2c7aecfa-ab40-4f94-acb0-2981f57126dc"
                ],
                "recordTypeUuid": "dc15939c-6a89-4ca2-afe4-1eeb102c0df8",
                "baseRecordTypeUuid": "dc15939c-6a89-4ca2-eeee-1eeb102c0df8",
                "#t": "Map"
            },
            "selectable": false,
            "hasChildren": true
        },
        {
            "label": "Jira Ticket Event Status",
            "selectionLabel": "jiraTicket.jiraTicketEventStatus",
            "id": {
                "relationshipPath": [
                    "acb7bab2-8b3d-4ec2-a37c-8e0a1bca764e",
                    "c0e09dfe-1e89-4905-a6f4-e06f41d15b57"
                ],
                "recordTypeUuid": "20a99751-4b55-47b1-b1de-cda8baa35c57",
                "baseRecordTypeUuid": "dc15939c-6a89-4ca2-afe4-1eeb102c0df8",
                "#t": "Map"
            },
            "selectable": false,
            "hasChildren": true
        }
    ],
    "#t": "NestedChoice?list",
    "#s": {
        "#v": [
            {
                "id": 252,
                "uuid": "{http://www.appian.com/ae/types/2009}Map",
                "namespace": "http://www.appian.com/ae/types/2009",
                "localPart": "Map",
                "description": "Map",
                "base": 252,
                "foundation": 252,
                "typeof": 252,
                "list": 253,
                "flags": 8,
                "instanceProperties": [],
                "typeProperties": [],
                "listViewMapping": ""
            },
            {
                "id": 253,
                "uuid": "{http://www.appian.com/ae/types/2009}Map?list",
                "namespace": "http://www.appian.com/ae/types/2009",
                "localPart": "Map?list",
                "description": "List of Map",
                "base": 93,
                "foundation": 93,
                "typeof": 252,
                "flags": 8,
                "instanceProperties": [],
                "typeProperties": [],
                "listViewMapping": ""
            },
            {
                "id": 2953,
                "uuid": "{http://www.appian.com/ae/types/2009}NestedChoice?list",
                "namespace": "http://www.appian.com/ae/types/2009",
                "localPart": "NestedChoice?list",
                "description": "List of NestedChoice",
                "base": 93,
                "foundation": 93,
                "typeof": 2952,
                "flags": 8,
                "instanceProperties": [],
                "typeProperties": [
                    {
                        "name": "autoGenerated",
                        "value": {
                            "#v": true,
                            "#t": "boolean"
                        }
                    }
                ],
                "listViewMapping": ""
            },
            {
                "id": 2952,
                "uuid": "{http://www.appian.com/ae/types/2009}NestedChoice",
                "namespace": "http://www.appian.com/ae/types/2009",
                "localPart": "NestedChoice",
                "description": "",
                "base": 95,
                "foundation": 95,
                "typeof": 2952,
                "list": 2953,
                "flags": 12,
                "instanceProperties": [
                    {
                        "name": "label",
                        "value": {
                            "#t": "string"
                        }
                    },
                    {
                        "name": "selectionLabel",
                        "value": {
                            "#t": "string"
                        }
                    },
                    {
                        "name": "selectionImage",
                        "value": {
                            "#t": "Variant"
                        }
                    },
                    {
                        "name": "id",
                        "value": {
                            "#t": "Variant"
                        }
                    },
                    {
                        "name": "nestedChoices",
                        "value": {
                            "#t": "NestedChoice?list"
                        }
                    },
                    {
                        "name": "selectable",
                        "value": {
                            "#t": "boolean"
                        }
                    },
                    {
                        "name": "typeId",
                        "value": {
                            "#t": "int"
                        }
                    },
                    {
                        "name": "hasChildren",
                        "value": {
                            "#t": "boolean"
                        }
                    }
                ],
                "typeProperties": [
                    {
                        "name": "namespaces",
                        "value": {
                            "#v": [
                                "http://www.appian.com/ae/types/2009",
                                "http://www.appian.com/ae/types/2009",
                                "http://www.appian.com/ae/types/2009",
                                "http://www.appian.com/ae/types/2009",
                                "http://www.appian.com/ae/types/2009",
                                "http://www.appian.com/ae/types/2009",
                                "http://www.appian.com/ae/types/2009",
                                "http://www.appian.com/ae/types/2009"
                            ],
                            "#t": "Text?list"
                        }
                    },
                    {
                        "name": "isNillable",
                        "value": {
                            "#v": [
                                false,
                                false,
                                false,
                                false,
                                false,
                                false,
                                false,
                                false
                            ],
                            "#t": "Boolean?list"
                        }
                    }
                ],
                "listViewMapping": ""
            },
            {
                "id": 97,
                "uuid": "{http://www.appian.com/ae/types/2009}Variant",
                "namespace": "http://www.appian.com/ae/types/2009",
                "localPart": "Variant",
                "description": "Any type and value.",
                "base": 97,
                "foundation": 97,
                "typeof": 97,
                "list": 197,
                "flags": 12,
                "instanceProperties": [
                    {
                        "name": "data",
                        "value": {
                            "#t": "Variant"
                        }
                    },
                    {
                        "name": "type",
                        "value": {
                            "#t": "int"
                        }
                    }
                ],
                "typeProperties": [],
                "listViewMapping": ""
            },
            {
                "id": 95,
                "uuid": "{http://www.appian.com/ae/types/2009}Record",
                "namespace": "http://www.appian.com/ae/types/2009",
                "localPart": "Record",
                "description": "Record is a list of named values.",
                "base": 95,
                "foundation": 95,
                "typeof": 0,
                "list": 195,
                "flags": 12,
                "instanceProperties": [],
                "typeProperties": [],
                "listViewMapping": ""
            },
            {
                "id": 103,
                "uuid": "{http://www.appian.com/ae/types/2009}Text?list",
                "namespace": "http://www.appian.com/ae/types/2009",
                "localPart": "Text?list",
                "description": "List of Text String",
                "base": 93,
                "foundation": 93,
                "typeof": 3,
                "flags": 8,
                "instanceProperties": [],
                "typeProperties": [],
                "listViewMapping": ""
            },
            {
                "id": 197,
                "uuid": "{http://www.appian.com/ae/types/2009}Variant?list",
                "namespace": "http://www.appian.com/ae/types/2009",
                "localPart": "Variant?list",
                "description": "List of Variant",
                "base": 93,
                "foundation": 93,
                "typeof": 97,
                "flags": 12,
                "instanceProperties": [],
                "typeProperties": [],
                "listViewMapping": ""
            },
            {
                "id": 126,
                "uuid": "{http://www.appian.com/ae/types/2009}Boolean?list",
                "namespace": "http://www.appian.com/ae/types/2009",
                "localPart": "Boolean?list",
                "description": "List of Boolean",
                "base": 93,
                "foundation": 93,
                "typeof": 26,
                "flags": 8,
                "instanceProperties": [],
                "typeProperties": [],
                "listViewMapping": ""
            },
            {
                "id": 101,
                "uuid": "{http://www.appian.com/ae/types/2009}Integer?list",
                "namespace": "http://www.appian.com/ae/types/2009",
                "localPart": "Integer?list",
                "description": "List of Number (Integer)",
                "base": 93,
                "foundation": 93,
                "typeof": 1,
                "flags": 8,
                "instanceProperties": [],
                "typeProperties": [],
                "listViewMapping": ""
            },
            {
                "id": 195,
                "uuid": "{http://www.appian.com/ae/types/2009}Record?list",
                "namespace": "http://www.appian.com/ae/types/2009",
                "localPart": "Record?list",
                "description": "List of Record",
                "base": 93,
                "foundation": 93,
                "typeof": 95,
                "flags": 12,
                "instanceProperties": [],
                "typeProperties": [],
                "listViewMapping": ""
            }
        ],
        "#t": "DataType?list"
    },
    "shortcuts": [],
    "#u": ""
}