{
    "description": "Decendants of the main House of the Patriarchal line in Game of Thrones",
    "source": "https://awoiaf.westeros.org/index.php/Houses_of_Westeros",
    "houses": [
        {
            "family": "Targaryen",
            "colR": 120,
            "colG": 83,
            "colB": 83,
            "members": [
                "Aegon the Conqueror",
                "Aenys",
                "Jaehaerys the Concilliator",
                "Baelon",
                "Daemon",
                "Viserys II",
                "Aegon the Unworthy",
                "Daeron the Good",
                "Maekar I",
                "Aegon the Unlikely",
                "Jaehaerys II",
                "Aerys the Mad King",
                "Rhaegar",
                "Jon"
            ]
        },
        {
            "family": "Baratheon",
            "colR": 246,
            "colG": 239,
            "colB": 76,
            "members": [
                "Orys One-Hand",
                "Axel",
                "Reginald",
                "Boremund",
                "Davos",
                "Corwen",
                "Arion",
                "Lyonel",
                "Symond",
                "Lyonel",
                "Steffon",
                "Robert the Usurper",
                "Joffrey the Boy King"
            ]
        },
        {
            "family": "Stark",
            "colR": 210,
            "colG": 198,
            "colB": 182,
            "members": [
                "Torrhen the King who Knelt",
                "Rickon",
                "Cregan the Wolf of the North",
                "Donnel",
                "Donner",
                "Artos",
                "Edwyle",
                "Rickard",
                "Eddard 'Ned'",
                "Robb the King in the North"
            ] 
        },
        {
            "family": "Arryn",
            "colR": 83,
            "colG": 158,
            "colB": 204,
            "members": [
                "Ronnel",
                "Joffrey",
                "Jonotior",
                "Eldred",
                "Jasper",
                "Jon",
                "Robert"
            ] 
        },
        {
            "family": "Lannister",
            "colR": 234,
            "colG": 182,
            "colB": 77,
            "members": [
                "Loren",
                "Lyman",
                "Tymond",
                "Jason",
                "Loreon",
                "Jonn",
                "Damon",
                "Gerold",
                "Tytos",
                "Tywin",
                "Jaime the Kingslayer"
            ] 
        },
        {
            "family": "Tully",
            "colR": 52,
            "colG": 95,
            "colB": 109,
            "members": [
                "Edmyn",
                "Edwyn",
                "Elmo",
                "Kermit",
                "Edmure",
                "Medgar",
                "Hoster",
                "Edmure"
            ] 
        },
        {
            "family": "Tyrell",
            "colR": 203,
            "colG": 225,
            "colB": 141,
            "members": [
                "Harlen",
                "Loras",
                "Lyonel",
                "Luthor",
                "Mace",
                "Willas"
            ] 
        },
        {
            "family": "Arryn",
            "colR": 83,
            "colG": 158,
            "colB": 204,
            "members": [
                "Ronnel",
                "Joffrey",
                "Jonotior",
                "Eldred",
                "Jasper",
                "Jon",
                "Robert"
            ] 
        },
        {
            "family": "Greyjoy",
            "colR": 50,
            "colG": 50,
            "colB": 50,
            "members": [
                "Vickon Last King of the Iron Islands",
                "Vickon",
                "Urron",
                "Dagon",
                "Quellon",
                "Euron"
            ] 
        }
    ]
}
