module testing-with-ginkgo

go 1.21.0

require (
	github.com/onsi/ginkgo/v2 v2.13.0
	github.com/onsi/gomega v1.29.0
	go.uber.org/mock v0.3.0
)

require (
	github.com/go-logr/logr v1.3.0 // indirect
	github.com/go-task/slim-sprig v0.0.0-20230315185526-52ccab3ef572 // indirect
	github.com/google/go-cmp v0.6.0 // indirect
	github.com/google/pprof v0.0.0-20231023181126-ff6d637d2a7b // indirect
	golang.org/x/net v0.17.0 // indirect
	golang.org/x/sys v0.13.0 // indirect
	golang.org/x/text v0.13.0 // indirect
	golang.org/x/tools v0.14.0 // indirect
	gopkg.in/yaml.v3 v3.0.1 // indirect
)
