{
  "articles": [
    {
      "author": "From Scratch",
      "content": "      Lorem, ipsum dolor sit amet consectetur adipisicing elit. Sapiente doloribus vel sunt laborum eos enim odit maxime corporis vero nihil voluptatum a, ullam delectus ad sit. Odit quis adipisci illo sit porro recusandae? Sequi, dolorum repellendus doloremque qui tempora beatae.",
      "date": 1621530288602,
      "id": 1
    },
    {
      "author": "Bill Gates",
      "content": "Lorem, ipsum dolor sit amet consectetur adipisicing elit. Sapiente doloribus vel sunt laborum eos enim odit maxime corporis vero nihil voluptatum a, ullam delectus ad sit. Odit quis adipisci illo sit porro recusandae? Sequi, dolorum repellendus doloremque qui tempora beatae.\n\nLorem, ipsum dolor sit amet consectetur adipisicing elit. Sapiente doloribus vel sunt laborum eos enim odit maxime corporis vero nihil voluptatum a, ullam delectus ad sit. Odit quis adipisci illo sit porro recusandae? Sequi, dolorum repellendus doloremque qui tempora beatae.",
      "date": 1621536029778,
      "id": 2
    },
    {
      "author": "Mark Zuckerberg",
      "content": "Lorem, ipsum dolor sit amet consectetur adipisicing elit. Sapiente doloribus vel sunt laborum eos enim odit maxime corporis vero nihil voluptatum a, ullam delectus ad sit. Odit quis adipisci illo sit porro recusandae? Sequi, dolorum repellendus doloremque qui tempora beatae.Lorem, ipsum dolor sit amet consectetur adipisicing elit. Sapiente doloribus vel sunt laborum eos enim odit maxime corporis vero nihil voluptatum a, ullam delectus ad sit. ",
      "date": 1621536056135,
      "id": 3
    },
    {
      "author": "dwc",
      "content": "vdvdvqdvvdsvd vds v dsvdsv dvds v ds vds v svdvdvqdvvdsvd vds v dsvdsv dvds v ds vds v svdvdvqdvvdsvd vds v dsvdsv dvds v ds vds v svdvdvqdvvdsvd vds v dsvdsv dvds v ds vds v svdvdvqdvvdsvd vds v dsvdsv dvds v ds vds v svdvdvqdvvdsvd vds v dsvdsv dvds v ds vds v s",
      "date": 1635702630728,
      "id": 4
    },
    {
      "author": "fzef",
      "content": "Lorem, ipsum dolor sit amet consectetur adipisicing elit. Sapiente doloribus vel sunt laborum eos enim odit maxime corporis vero nihil voluptatum a, ullam delectus ad sit. Odit quis adipisci illo sit porro recusandae? Sequi, dolorum repellendus doloremque qui tempora beatae.Lorem, ipsum dolor sit amet consectetur adipisicing elit. Sapiente doloribus vel sunt laborum eos enim odit maxime corporis vero nihil voluptatum a, ullam delectus ad sit",
      "date": 1635970774179,
      "id": 5
    },
    {
      "author": "frfrfrfr",
      "content": "em, ipsum dolor sit amet consectetur adipisicing elit. Sapiente doloribus vel sunt laborum eos enim odit maxime corporis vero nihil voluptatum a, ullam delectus ad sit. Odit quis adipisci illo sit porro recusandae? Sequi, dolorum repellendus doloremque qui tempora beatae.Lorem, ipsum dolor sit amet consectetur adipisicing elit. Sapiente doloribus vel sunt laborum eos enim odit maxime corporis vero nihil voluptatum a, ullam delectus ad sit",
      "date": 1635970852293,
      "id": 6
    },
    {
      "author": "zefzefez",
      "content": "el sunt laborum eos enim odit maxime corporis vero nihil voluptatum a, ullam delectus ad sit. Odit quis adipisci illo sit porro recusandae? Sequi, dolorum repellendus doloremque qui tempora beatae.Lorem, ipsum dolor sit amet consectetur adipisicing elit. Sapiente doloribus vel sunt laborum eos enim odit maxime co",
      "date": 1635971306531,
      "id": 7
    },
    {
      "author": "fezvds",
      "content": " laborum eos enim odit maxime corporis vero nihil voluptatum a, ullam delectus ad sit. Odit quis adipisci illo sit porro recusandae? Sequi, dolorum repellendus doloremque qui tempora beatae.Lorem, ipsum dolor sit amet conse laborum eos enim odit maxime corporis vero nihil voluptatum a, ullam delectus ad sit. Odit quis adipisci illo sit porro recusandae? Sequi, dolorum repellendus doloremque qui tempora beatae.Lorem, ipsum dolor sit amet conse",
      "date": 1635971981070,
      "id": 8
    },
    {
      "author": "fzef",
      "content": "maxime corporis vero nihil voluptatum a, ullam delectus ad sit. Odit quis adipisci illo sit porro recusandae? Sequi, dolorum repellendus doloremque qui tempora beatae.Lorem, ipsum dolor sit amet conse laborum eos enim odit maxime corporis vero nihil voluptatum a, ullam delectus ad sit. Odit quis adipisci illo sit porro recusandae? Sequi, dolorum repellendus doloremque qui tempora beatae.Lore",
      "date": 1636024834722,
      "id": 9
    },
    {
      "author": "frferggrerg",
      "content": "ermaxime corporis vero nihil voluptatum a, ullam delectus ad sit. Odit quis adipisci illo sit porro recusandae? Sequi, dolorum repellendus doloremque qui tempora beatae.Lorem, ipsum dolor sit amet conse laborum eos enim odit maxime corporis vero nihil voluptatum a, ullam delectus ad sit. Odit quis adipisci illo sit porro recusandae? Sequi, dolorum repellendus doloremque qui tempora beatae.Lore",
      "date": 1636024847961,
      "id": 10
    },
    {
      "author": "tttttttttt",
      "content": "maxime corporis vero nihil voluptatum a, ullam delectus ad sit. Odit quis adipisci illo sit porro recusandae? Sequi, dolorum repellendus doloremque qui tempora beatae.Lorem, ipsum dolor sit amet conse laborum eos enim odit maxime corporis vero nihil voluptatum a, ullam delectus ad sit. Odit quis adipisci illo sit porro recusandae? Sequi, dolorum repellendus doloremque qui tempora beatae.Lore",
      "date": 1636024863386,
      "id": 11
    }
  ]
}