module gitlab.com/kevin.harnanta/corona-prometheus-exporter

go 1.13

require (
	github.com/guaychou/corona-api v1.0.2
	github.com/prometheus/client_golang v1.5.1
	github.com/sirupsen/logrus v1.4.2
)
