module gitlab.com/kevin.harnanta/bot-telegram

go 1.13

require (
	github.com/go-telegram-bot-api/telegram-bot-api v4.6.4+incompatible
	github.com/gomodule/redigo v2.0.0+incompatible
	github.com/guaychou/corona-api v1.0.2
	github.com/guaychou/exchangeAPI v1.0.2
	github.com/guaychou/openweatherapi v1.0.0
	github.com/guaychou/redisClient v0.0.0-20200315025029-309397dbfd87
	github.com/robfig/cron/v3 v3.0.1
	github.com/sirupsen/logrus v1.5.0
	github.com/technoweenie/multipartstreamer v1.0.1 // indirect
)
