module gitlab.com/guaychou/SIAM-api

go 1.14

require (
	github.com/PuerkitoBio/goquery v1.5.1 // indirect
	github.com/antchfx/htmlquery v1.2.3 // indirect
	github.com/antchfx/xmlquery v1.2.4 // indirect
	github.com/gin-gonic/gin v1.6.3
	github.com/gobwas/glob v0.2.3 // indirect
	github.com/gocolly/colly v1.2.0 // indirect
	github.com/kennygrant/sanitize v1.2.4 // indirect
	github.com/saintfish/chardet v0.0.0-20120816061221-3af4cd4741ca // indirect
	github.com/sirupsen/logrus v1.6.0 // indirect
	github.com/temoto/robotstxt v1.1.1 // indirect
	gitlab.com/kevin.harnanta/siam-scraper v0.0.0-20200610055021-8c08a48232e2
	golang.org/x/net v0.0.0-20200602114024-627f9648deb9 // indirect
	google.golang.org/appengine v1.6.6 // indirect
)
