^D:\DOCUMENTS\JIN\MER\RENDU\TESTPROJECT\OPENGL\DEBUG\CAMERA.OBJ|D:\DOCUMENTS\JIN\MER\RENDU\TESTPROJECT\OPENGL\DEBUG\CONTEXTINITIALIZER.OBJ|D:\DOCUMENTS\JIN\MER\RENDU\TESTPROJECT\OPENGL\DEBUG\DEVICE.OBJ|D:\DOCUMENTS\JIN\MER\RENDU\TESTPROJECT\OPENGL\DEBUG\FRAMEBUFFER.OBJ|D:\DOCUMENTS\JIN\MER\RENDU\TESTPROJECT\OPENGL\DEBUG\KEYBOARDINPUT.OBJ|D:\DOCUMENTS\JIN\MER\RENDU\TESTPROJECT\OPENGL\DEBUG\MAIN.OBJ|D:\DOCUMENTS\JIN\MER\RENDU\TESTPROJECT\OPENGL\DEBUG\MATERIAL.OBJ|D:\DOCUMENTS\JIN\MER\RENDU\TESTPROJECT\OPENGL\DEBUG\MESH.OBJ|D:\DOCUMENTS\JIN\MER\RENDU\TESTPROJECT\OPENGL\DEBUG\MODELIMPORTER.OBJ|D:\DOCUMENTS\JIN\MER\RENDU\TESTPROJECT\OPENGL\DEBUG\MODELRENDERER.OBJ|D:\DOCUMENTS\JIN\MER\RENDU\TESTPROJECT\OPENGL\DEBUG\MOUSEINPUT.OBJ|D:\DOCUMENTS\JIN\MER\RENDU\TESTPROJECT\OPENGL\DEBUG\PROGRAM.OBJ|D:\DOCUMENTS\JIN\MER\RENDU\TESTPROJECT\OPENGL\DEBUG\SCENE.OBJ|D:\DOCUMENTS\JIN\MER\RENDU\TESTPROJECT\OPENGL\DEBUG\SCENEDISPLAYER.OBJ|D:\DOCUMENTS\JIN\MER\RENDU\TESTPROJECT\OPENGL\DEBUG\SCENELOADER.OBJ|D:\DOCUMENTS\JIN\MER\RENDU\TESTPROJECT\OPENGL\DEBUG\SHADER.OBJ|D:\DOCUMENTS\JIN\MER\RENDU\TESTPROJECT\OPENGL\DEBUG\SHADERREPOSITORY.OBJ|D:\DOCUMENTS\JIN\MER\RENDU\TESTPROJECT\OPENGL\DEBUG\TEXTURE.OBJ|D:\DOCUMENTS\JIN\MER\RENDU\TESTPROJECT\OPENGL\DEBUG\TEXTUREREPOSITORY.OBJ|D:\DOCUMENTS\JIN\MER\RENDU\TESTPROJECT\OPENGL\DEBUG\WINDOWINPUT.OBJ
C:\WINDOWS\GLOBALIZATION\SORTING\SORTDEFAULT.NLS
C:\PROGRAM FILES (X86)\WINDOWS KITS\8.1\LIB\WINV6.3\UM\X86\KERNEL32.LIB
C:\PROGRAM FILES (X86)\WINDOWS KITS\8.1\LIB\WINV6.3\UM\X86\USER32.LIB
C:\PROGRAM FILES (X86)\WINDOWS KITS\8.1\LIB\WINV6.3\UM\X86\GDI32.LIB
C:\PROGRAM FILES (X86)\WINDOWS KITS\8.1\LIB\WINV6.3\UM\X86\WINSPOOL.LIB
C:\PROGRAM FILES (X86)\WINDOWS KITS\8.1\LIB\WINV6.3\UM\X86\COMDLG32.LIB
C:\PROGRAM FILES (X86)\WINDOWS KITS\8.1\LIB\WINV6.3\UM\X86\ADVAPI32.LIB
C:\PROGRAM FILES (X86)\WINDOWS KITS\8.1\LIB\WINV6.3\UM\X86\SHELL32.LIB
C:\PROGRAM FILES (X86)\WINDOWS KITS\8.1\LIB\WINV6.3\UM\X86\OLE32.LIB
C:\PROGRAM FILES (X86)\WINDOWS KITS\8.1\LIB\WINV6.3\UM\X86\OLEAUT32.LIB
C:\PROGRAM FILES (X86)\WINDOWS KITS\8.1\LIB\WINV6.3\UM\X86\UUID.LIB
C:\PROGRAM FILES (X86)\WINDOWS KITS\8.1\LIB\WINV6.3\UM\X86\ODBC32.LIB
C:\PROGRAM FILES (X86)\WINDOWS KITS\8.1\LIB\WINV6.3\UM\X86\ODBCCP32.LIB
C:\PROGRAM FILES (X86)\MICROSOFT VISUAL STUDIO 14.0\VC\LIB\SDL2.LIB
C:\PROGRAM FILES (X86)\MICROSOFT VISUAL STUDIO 14.0\VC\LIB\SDL2MAIN.LIB
C:\PROGRAM FILES (X86)\MICROSOFT VISUAL STUDIO 14.0\VC\LIB\SDL2_IMAGE.LIB
C:\PROGRAM FILES (X86)\MICROSOFT VISUAL STUDIO 14.0\VC\LIB\GLEW32.LIB
C:\PROGRAM FILES (X86)\WINDOWS KITS\8.1\LIB\WINV6.3\UM\X86\OPENGL32.LIB
C:\PROGRAM FILES (X86)\MICROSOFT VISUAL STUDIO 14.0\VC\LIB\ASSIMP-VC120-MT.LIB
D:\DOCUMENTS\JIN\MER\RENDU\TESTPROJECT\OPENGL\DEBUG\CAMERA.OBJ
D:\DOCUMENTS\JIN\MER\RENDU\TESTPROJECT\OPENGL\DEBUG\MAIN.OBJ
D:\DOCUMENTS\JIN\MER\RENDU\TESTPROJECT\OPENGL\DEBUG\CONTEXTINITIALIZER.OBJ
D:\DOCUMENTS\JIN\MER\RENDU\TESTPROJECT\OPENGL\DEBUG\DEVICE.OBJ
D:\DOCUMENTS\JIN\MER\RENDU\TESTPROJECT\OPENGL\DEBUG\FRAMEBUFFER.OBJ
D:\DOCUMENTS\JIN\MER\RENDU\TESTPROJECT\OPENGL\DEBUG\KEYBOARDINPUT.OBJ
D:\DOCUMENTS\JIN\MER\RENDU\TESTPROJECT\OPENGL\DEBUG\MOUSEINPUT.OBJ
D:\DOCUMENTS\JIN\MER\RENDU\TESTPROJECT\OPENGL\DEBUG\WINDOWINPUT.OBJ
D:\DOCUMENTS\JIN\MER\RENDU\TESTPROJECT\OPENGL\DEBUG\MATERIAL.OBJ
D:\DOCUMENTS\JIN\MER\RENDU\TESTPROJECT\OPENGL\DEBUG\MESH.OBJ
D:\DOCUMENTS\JIN\MER\RENDU\TESTPROJECT\OPENGL\DEBUG\MODELIMPORTER.OBJ
D:\DOCUMENTS\JIN\MER\RENDU\TESTPROJECT\OPENGL\DEBUG\MODELRENDERER.OBJ
D:\DOCUMENTS\JIN\MER\RENDU\TESTPROJECT\OPENGL\DEBUG\PROGRAM.OBJ
D:\DOCUMENTS\JIN\MER\RENDU\TESTPROJECT\OPENGL\DEBUG\SHADER.OBJ
D:\DOCUMENTS\JIN\MER\RENDU\TESTPROJECT\OPENGL\DEBUG\SHADERREPOSITORY.OBJ
D:\DOCUMENTS\JIN\MER\RENDU\TESTPROJECT\OPENGL\DEBUG\TEXTURE.OBJ
D:\DOCUMENTS\JIN\MER\RENDU\TESTPROJECT\OPENGL\DEBUG\TEXTUREREPOSITORY.OBJ
D:\DOCUMENTS\JIN\MER\RENDU\TESTPROJECT\OPENGL\DEBUG\SCENE.OBJ
D:\DOCUMENTS\JIN\MER\RENDU\TESTPROJECT\OPENGL\DEBUG\SCENEDISPLAYER.OBJ
D:\DOCUMENTS\JIN\MER\RENDU\TESTPROJECT\OPENGL\DEBUG\SCENELOADER.OBJ
C:\WINDOWS\SYSTEM32\TZRES.DLL
C:\PROGRAM FILES (X86)\MICROSOFT VISUAL STUDIO 14.0\VC\LIB\MSVCPRTD.LIB
C:\PROGRAM FILES (X86)\MICROSOFT VISUAL STUDIO 14.0\VC\LIB\MSVCRTD.LIB
C:\PROGRAM FILES (X86)\MICROSOFT VISUAL STUDIO 14.0\VC\LIB\OLDNAMES.LIB
C:\PROGRAM FILES (X86)\MICROSOFT VISUAL STUDIO 14.0\VC\LIB\VCRUNTIMED.LIB
C:\PROGRAM FILES (X86)\WINDOWS KITS\10\LIB\10.0.10240.0\UCRT\X86\UCRTD.LIB
^D:\DOCUMENTS\JIN\MER\RENDU\PROJET\OPENGL_GAME\OPENGL\DEBUG\CAMERA.OBJ|D:\DOCUMENTS\JIN\MER\RENDU\PROJET\OPENGL_GAME\OPENGL\DEBUG\CONTEXTINITIALIZER.OBJ|D:\DOCUMENTS\JIN\MER\RENDU\PROJET\OPENGL_GAME\OPENGL\DEBUG\DEVICE.OBJ|D:\DOCUMENTS\JIN\MER\RENDU\PROJET\OPENGL_GAME\OPENGL\DEBUG\FRAMEBUFFER.OBJ|D:\DOCUMENTS\JIN\MER\RENDU\PROJET\OPENGL_GAME\OPENGL\DEBUG\KEYBOARDINPUT.OBJ|D:\DOCUMENTS\JIN\MER\RENDU\PROJET\OPENGL_GAME\OPENGL\DEBUG\MAIN.OBJ|D:\DOCUMENTS\JIN\MER\RENDU\PROJET\OPENGL_GAME\OPENGL\DEBUG\MATERIAL.OBJ|D:\DOCUMENTS\JIN\MER\RENDU\PROJET\OPENGL_GAME\OPENGL\DEBUG\MESH.OBJ|D:\DOCUMENTS\JIN\MER\RENDU\PROJET\OPENGL_GAME\OPENGL\DEBUG\MODELIMPORTER.OBJ|D:\DOCUMENTS\JIN\MER\RENDU\PROJET\OPENGL_GAME\OPENGL\DEBUG\MODELRENDERER.OBJ|D:\DOCUMENTS\JIN\MER\RENDU\PROJET\OPENGL_GAME\OPENGL\DEBUG\MOUSEINPUT.OBJ|D:\DOCUMENTS\JIN\MER\RENDU\PROJET\OPENGL_GAME\OPENGL\DEBUG\PROGRAM.OBJ|D:\DOCUMENTS\JIN\MER\RENDU\PROJET\OPENGL_GAME\OPENGL\DEBUG\SCENE.OBJ|D:\DOCUMENTS\JIN\MER\RENDU\PROJET\OPENGL_GAME\OPENGL\DEBUG\SCENEDISPLAYER.OBJ|D:\DOCUMENTS\JIN\MER\RENDU\PROJET\OPENGL_GAME\OPENGL\DEBUG\SCENELOADER.OBJ|D:\DOCUMENTS\JIN\MER\RENDU\PROJET\OPENGL_GAME\OPENGL\DEBUG\SHADER.OBJ|D:\DOCUMENTS\JIN\MER\RENDU\PROJET\OPENGL_GAME\OPENGL\DEBUG\SHADERREPOSITORY.OBJ|D:\DOCUMENTS\JIN\MER\RENDU\PROJET\OPENGL_GAME\OPENGL\DEBUG\TEXTURE.OBJ|D:\DOCUMENTS\JIN\MER\RENDU\PROJET\OPENGL_GAME\OPENGL\DEBUG\TEXTUREREPOSITORY.OBJ|D:\DOCUMENTS\JIN\MER\RENDU\PROJET\OPENGL_GAME\OPENGL\DEBUG\WINDOWINPUT.OBJ
C:\WINDOWS\GLOBALIZATION\SORTING\SORTDEFAULT.NLS
C:\PROGRAM FILES (X86)\WINDOWS KITS\8.1\LIB\WINV6.3\UM\X86\KERNEL32.LIB
C:\PROGRAM FILES (X86)\WINDOWS KITS\8.1\LIB\WINV6.3\UM\X86\USER32.LIB
C:\PROGRAM FILES (X86)\WINDOWS KITS\8.1\LIB\WINV6.3\UM\X86\GDI32.LIB
C:\PROGRAM FILES (X86)\WINDOWS KITS\8.1\LIB\WINV6.3\UM\X86\WINSPOOL.LIB
C:\PROGRAM FILES (X86)\WINDOWS KITS\8.1\LIB\WINV6.3\UM\X86\COMDLG32.LIB
C:\PROGRAM FILES (X86)\WINDOWS KITS\8.1\LIB\WINV6.3\UM\X86\ADVAPI32.LIB
C:\PROGRAM FILES (X86)\WINDOWS KITS\8.1\LIB\WINV6.3\UM\X86\SHELL32.LIB
C:\PROGRAM FILES (X86)\WINDOWS KITS\8.1\LIB\WINV6.3\UM\X86\OLE32.LIB
C:\PROGRAM FILES (X86)\WINDOWS KITS\8.1\LIB\WINV6.3\UM\X86\OLEAUT32.LIB
C:\PROGRAM FILES (X86)\WINDOWS KITS\8.1\LIB\WINV6.3\UM\X86\UUID.LIB
C:\PROGRAM FILES (X86)\WINDOWS KITS\8.1\LIB\WINV6.3\UM\X86\ODBC32.LIB
C:\PROGRAM FILES (X86)\WINDOWS KITS\8.1\LIB\WINV6.3\UM\X86\ODBCCP32.LIB
C:\PROGRAM FILES (X86)\MICROSOFT VISUAL STUDIO 14.0\VC\LIB\SDL2.LIB
C:\PROGRAM FILES (X86)\MICROSOFT VISUAL STUDIO 14.0\VC\LIB\SDL2MAIN.LIB
C:\PROGRAM FILES (X86)\MICROSOFT VISUAL STUDIO 14.0\VC\LIB\SDL2_IMAGE.LIB
C:\PROGRAM FILES (X86)\MICROSOFT VISUAL STUDIO 14.0\VC\LIB\GLEW32.LIB
C:\PROGRAM FILES (X86)\WINDOWS KITS\8.1\LIB\WINV6.3\UM\X86\OPENGL32.LIB
C:\PROGRAM FILES (X86)\MICROSOFT VISUAL STUDIO 14.0\VC\LIB\ASSIMP-VC120-MT.LIB
D:\DOCUMENTS\JIN\MER\RENDU\PROJET\OPENGL_GAME\OPENGL\DEBUG\CAMERA.OBJ
D:\DOCUMENTS\JIN\MER\RENDU\PROJET\OPENGL_GAME\OPENGL\DEBUG\MAIN.OBJ
D:\DOCUMENTS\JIN\MER\RENDU\PROJET\OPENGL_GAME\OPENGL\DEBUG\CONTEXTINITIALIZER.OBJ
D:\DOCUMENTS\JIN\MER\RENDU\PROJET\OPENGL_GAME\OPENGL\DEBUG\DEVICE.OBJ
D:\DOCUMENTS\JIN\MER\RENDU\PROJET\OPENGL_GAME\OPENGL\DEBUG\FRAMEBUFFER.OBJ
D:\DOCUMENTS\JIN\MER\RENDU\PROJET\OPENGL_GAME\OPENGL\DEBUG\KEYBOARDINPUT.OBJ
D:\DOCUMENTS\JIN\MER\RENDU\PROJET\OPENGL_GAME\OPENGL\DEBUG\MOUSEINPUT.OBJ
D:\DOCUMENTS\JIN\MER\RENDU\PROJET\OPENGL_GAME\OPENGL\DEBUG\WINDOWINPUT.OBJ
D:\DOCUMENTS\JIN\MER\RENDU\PROJET\OPENGL_GAME\OPENGL\DEBUG\MATERIAL.OBJ
D:\DOCUMENTS\JIN\MER\RENDU\PROJET\OPENGL_GAME\OPENGL\DEBUG\MESH.OBJ
D:\DOCUMENTS\JIN\MER\RENDU\PROJET\OPENGL_GAME\OPENGL\DEBUG\MODELIMPORTER.OBJ
D:\DOCUMENTS\JIN\MER\RENDU\PROJET\OPENGL_GAME\OPENGL\DEBUG\MODELRENDERER.OBJ
D:\DOCUMENTS\JIN\MER\RENDU\PROJET\OPENGL_GAME\OPENGL\DEBUG\PROGRAM.OBJ
D:\DOCUMENTS\JIN\MER\RENDU\PROJET\OPENGL_GAME\OPENGL\DEBUG\SHADER.OBJ
D:\DOCUMENTS\JIN\MER\RENDU\PROJET\OPENGL_GAME\OPENGL\DEBUG\SHADERREPOSITORY.OBJ
D:\DOCUMENTS\JIN\MER\RENDU\PROJET\OPENGL_GAME\OPENGL\DEBUG\TEXTURE.OBJ
D:\DOCUMENTS\JIN\MER\RENDU\PROJET\OPENGL_GAME\OPENGL\DEBUG\TEXTUREREPOSITORY.OBJ
D:\DOCUMENTS\JIN\MER\RENDU\PROJET\OPENGL_GAME\OPENGL\DEBUG\SCENE.OBJ
D:\DOCUMENTS\JIN\MER\RENDU\PROJET\OPENGL_GAME\OPENGL\DEBUG\SCENEDISPLAYER.OBJ
D:\DOCUMENTS\JIN\MER\RENDU\PROJET\OPENGL_GAME\OPENGL\DEBUG\SCENELOADER.OBJ
C:\WINDOWS\SYSTEM32\TZRES.DLL
C:\PROGRAM FILES (X86)\MICROSOFT VISUAL STUDIO 14.0\VC\LIB\MSVCPRTD.LIB
C:\PROGRAM FILES (X86)\WINDOWS KITS\8.1\LIB\WINV6.3\UM\X86\WINMM.LIB
C:\PROGRAM FILES (X86)\MICROSOFT VISUAL STUDIO 14.0\VC\LIB\MSVCRTD.LIB
C:\PROGRAM FILES (X86)\MICROSOFT VISUAL STUDIO 14.0\VC\LIB\OLDNAMES.LIB
C:\PROGRAM FILES (X86)\MICROSOFT VISUAL STUDIO 14.0\VC\LIB\VCRUNTIMED.LIB
C:\PROGRAM FILES (X86)\WINDOWS KITS\10\LIB\10.0.10240.0\UCRT\X86\UCRTD.LIB
