// Jest Snapshot v1, https://goo.gl/fbAQLP

exports[`Testing footer snapshot 1`] = `
<div>
  <div
    className="bg-dark footer text-white text-center"
  >
    Music For Everyone to Enjoy!
  </div>
</div>
`;
