hw
hw
hw
hw
hw
hw
hw
hw
hw
hw
hw
hw
hw
hw
hw
hw
hw
hw
hw
hw
hw
s
s
sw
s
s
s
s
s
s
s
s
s
s
s
s
s
s
hw
hw
hw
s
s
sw
s
s
s
s
s
s
s
s
s
s
s
s
s
s
hw
hw
hw
s
s
hw
s
s
s
t
t
t
s
s
s
s
s
s
s
s
hw
hw
hw
hw
hw
hw
hw
s
s
s
s
s
s
p
s
s
s
s
s
s
hw
hw
hw
hw
hw
hw
s
s
s
s
s
s
p
p
s
s
hw
hw
s
s
hw
hw
hw
s
s
s
s
s
p
p
s
s
p
p
s
s
s
s
s
s
hw
hw
hw
s
s
s
s
s
p
p
p
s
s
s
s
s
s
s
s
s
hw
hw
hw
s
s
s
s
s
hw
s
s
s
s
s
s
s
s
s
s
s
hw
hw
hw
s
s
s
sw
hw
hw
s
s
s
s
s
hw
hw
s
s
s
s
hw
hw
hw
s
s
s
s
s
s
s
s
s
hw
hw
hw
hw
s
s
s
s
hw
hw
hw
s
s
s
sw
s
s
s
s
s
hw
s
s
s
s
s
s
s
hw
hw
hw
p
sw
sw
sw
s
s
s
s
s
hw
s
s
s
s
s
p
p
hw
hw
hw
p
s
s
sw
s
s
s
s
s
hw
sw
sw
sw
sw
sw
sw
sw
hw
hw
hw
p
hw
hw
sw
s
s
s
s
s
hw
s
s
s
s
s
s
s
hw
hw
hw
hw
hw
s
p
p
s
s
s
s
hw
s
s
s
s
s
s
s
hw
hw
hw
s
hw
s
p
p
s
s
s
s
hw
s
s
s
s
s
s
s
hw
hw
hw
s
hw
hw
p
p
sw
sw
sw
hw
hw
hw
hw
s
s
s
s
s
hw
hw
hw
s
s
s
sw
sw
s
s
s
s
s
s
hw
s
s
s
s
s
hw
hw
hw
s
s
s
sw
sw
s
s
s
s
s
s
hw
s
s
s
s
s
hw
hw
hw
s
s
s
sw
sw
s
s
s
s
s
s
hw
hw
hw
hw
hw
hw
hw
hw
hw
s
s
s
sw
sw
s
s
s
s
s
s
s
s
s
s
s
s
hw
hw
hw
s
s
s
sw
sw
s
s
s
s
s
s
s
s
s
s
s
s
hw
hw
hw
s
s
s
sw
sw
s
s
s
s
s
s
s
s
s
s
s
s
hw
hw
hw
hw
hw
hw
hw
hw
hw
hw
hw
hw
hw
hw
hw
hw
hw
hw
hw
hw
hw
hw
1
1088
0
