{"itemCount":10976,"md5Checksum":"JdBe4Ic9Cttykl4xEBRJIQ==","etag":"e1863c61dff4aa125a156efcdfcc5bc0-1","dataFileS3Key":"AWSDynamoDB/01646106241138-2192a781/data/anfilgmr2qybtfsbnrey4vt3qm.json.gz"}
{"itemCount":11246,"md5Checksum":"s9prW4OZtqPb9JyuKAJW0g==","etag":"9bfc13918f9e4adc79cab5f107a3b3c6-1","dataFileS3Key":"AWSDynamoDB/01646106241138-2192a781/data/ktg7xm7c3e45xj6t5ozauipmoa.json.gz"}
{"itemCount":11251,"md5Checksum":"Rq0JhA6jSH5qeBZ+PAX6XA==","etag":"31afb05ae041c4bc94f4a221fda86b42-1","dataFileS3Key":"AWSDynamoDB/01646106241138-2192a781/data/zljfz37fxuz4jlupsorpj7xpfi.json.gz"}
{"itemCount":11160,"md5Checksum":"RJB6KiSe+SxRbdo3fB7y4Q==","etag":"a1ce6a7ca72dcd5a0a52ef5002054391-1","dataFileS3Key":"AWSDynamoDB/01646106241138-2192a781/data/e44zdiz4t46drgpzwmmjbnsbwy.json.gz"}
