{"itemCount":11383,"md5Checksum":"W31DNKBxvZltuDFTwNrWrA==","etag":"27d879652dd9dbb7676e82bbcc0af8db-1","dataFileS3Key":"AWSDynamoDB/01647057718781-e6d93ea5/data/rmr2fluf5myf7cosafnajosguu.json.gz"}
{"itemCount":11619,"md5Checksum":"mr8oevIh4M7iKySq30VAVg==","etag":"3fb9f3cb698195c3086c99829eb7f1d5-1","dataFileS3Key":"AWSDynamoDB/01647057718781-e6d93ea5/data/bv72r4c7say2rpm3wjwzzau3jy.json.gz"}
{"itemCount":11645,"md5Checksum":"zQfQORFBTvQiNX3bMAm+Hw==","etag":"54b366b9cf35cdcc12e0fc917ec2dbcf-1","dataFileS3Key":"AWSDynamoDB/01647057718781-e6d93ea5/data/jqg4p2mucmzuxicspdnltyw6tm.json.gz"}
{"itemCount":11529,"md5Checksum":"E68e8ptcDP/zb4tXIHNHbQ==","etag":"0ae81c14e973d91978189271c8ed40f6-1","dataFileS3Key":"AWSDynamoDB/01647057718781-e6d93ea5/data/n6xao4i2tq365nisw2knfanbui.json.gz"}
