{"itemCount":11867,"md5Checksum":"bzo50w4CaLlhz6BjGpynzA==","etag":"a2827029176ea861752d023cd78170cc-1","dataFileS3Key":"AWSDynamoDB/01648697992845-7dba888f/data/e4wjysdinm4o7ji3lqyu2kfh7y.json.gz"}
{"itemCount":12103,"md5Checksum":"wzJVOZdoxIOX6VjSmIzQUQ==","etag":"ac440a5f3038769eead7555bf5bfcbe6-1","dataFileS3Key":"AWSDynamoDB/01648697992845-7dba888f/data/wxbpta3erezpbgz5k2brei2wry.json.gz"}
{"itemCount":12117,"md5Checksum":"3/RLcFepWMI2AE1jsyiiGw==","etag":"77ab6d108119ffa94c69e3513a7a9000-1","dataFileS3Key":"AWSDynamoDB/01648697992845-7dba888f/data/a4w5wye7e43wxl6msave26ya2m.json.gz"}
{"itemCount":12026,"md5Checksum":"bOY8tAcKalmyTNGj0qEeIQ==","etag":"ca092dc64797a4accaa36c3851c878ec-1","dataFileS3Key":"AWSDynamoDB/01648697992845-7dba888f/data/lo4jwvbotezwvhshck5nogv7yq.json.gz"}
