{"itemCount":10816,"md5Checksum":"Fo46vNNagBDEAqZ60g9LMA==","etag":"d236e25ebcfdcba76b81d8f361d2e914-1","dataFileS3Key":"AWSDynamoDB/01645773551310-83cac956/data/jf7riyjhr43mznghjvpt3htnm4.json.gz"}
{"itemCount":11099,"md5Checksum":"1w36BzUHtfTLIqBEeivwQQ==","etag":"6a3c582bd6e0056a275c3666cd02ddf6-1","dataFileS3Key":"AWSDynamoDB/01645773551310-83cac956/data/e2aps3r7zyy2bfkds33zzxrybm.json.gz"}
{"itemCount":11081,"md5Checksum":"JrwT1M0kA9u46IdG6766yQ==","etag":"40e4899bdddea9824ee7b55e9675da1a-1","dataFileS3Key":"AWSDynamoDB/01645773551310-83cac956/data/uycwhwpkgy3frmo4qccrjkjntm.json.gz"}
{"itemCount":10995,"md5Checksum":"lYQOLuHde6JLN8MbRakqXw==","etag":"3f11f9d89012a75622e0f723e61154c5-1","dataFileS3Key":"AWSDynamoDB/01645773551310-83cac956/data/lpxiwp2dsm56fe3b7uqpdavk2e.json.gz"}
