,lookup_name,organization_id,employee_id,user_id,monthly_salary
9,rainpay,D2C Org,6aa90fae-e1e6-4bbd-8b7a-fa9d09cb5325,2b8d5355-e248-467c-914e-961ee8f7340c,0.0
104,quess corp limited,D2C Org,c1e0da2e-19d2-42f7-ae78-4056a03ae8c2,4d8cc161-6200-4b25-a652-d35056081e42,9979.0
628,quess corp limited,D2C Org,7869eca7-1798-43ca-9fd3-7d0427d0b39f,10aa3dfe-b273-48ac-9c59-3a9be4f3c35c,5900.0
1003,samsung electronics india pvt ltd,D2C Org,8f842163-4678-4dec-ad77-6323c1b8e70e,561a9552-637a-42da-8544-a471f51cc316,6822.0
1118,quess corp limited,D2C Org,194d2bba-926c-4f9b-91ed-78d676c77cf7,61fd8c7b-d789-4fbb-8cb7-fbef2af1fc89,6642.0
1385,quees corp ltd,D2C Org,9d70dc8e-3f95-4901-980e-0376532a9388,e452f9a7-a2e3-4d89-8cb9-5fded90ca5fa,10886.0
1455,quess corp limited,D2C Org,e8910c70-d27c-4acf-b06a-8d11532b6386,e4d5bb70-5739-4ebf-8e11-d16d7f7d81df,9214.0
1473,quees corp ltd,D2C Org,41d7bc21-4440-46c3-a32a-0b428a016d5a,54fbf820-5869-480c-a92e-a279b5ab5798,8982.0
1477,quees corp ltd,D2C Org,750d7a56-dd0c-43b3-8cc2-63266efd650d,922d30c4-b6e3-4550-a5ab-dd33c22a5a8e,10610.0
1478,quees corp ltd,D2C Org,750d7a56-dd0c-43b3-8cc2-63266efd650d,922d30c4-b6e3-4550-a5ab-dd33c22a5a8e,10610.0
1492,quess corp limited,D2C Org,2271c120-cd58-4cdf-ab7d-4ceb4b827af4,222b332b-cd9a-45d4-be24-1d0d81769204,11151.0
1769,quess corp limited,D2C Org,94a24514-bbe9-4f03-ad62-3819adcecfd2,ce656939-8faf-479f-b347-fb8d54b4db89,9820.0
2101,aikya logistics llp,D2C Org,ef1d30cf-27ac-4412-8447-d64ffe25709d,4aaa62d9-110b-463a-85eb-dac61a434f30,0.0
2162,fiitjee limited,D2C Org,5bb9f6bf-be00-412e-b2cc-02f4eb0e8926,f3297350-dd82-4d12-b7f9-e5ca096e1f48,9900.0
2552,sbi general insurance company limited,D2C Org,31d6fae9-10dc-4526-93c7-6f6b7104dae1,7eb64a13-bb8e-43f2-acf2-e4957121932f,9416.7
3011,gemini consulting & services india private limited,D2C Org,ae35ea58-58dd-499d-8b97-ac4269e54060,cd6640b3-8e77-4c68-a0d4-10372454fedd,8500.0
3602,quess corp limited,D2C Org,5e2cf34b-07b9-42fe-94e5-1c9b01e9ba88,0c5c8808-45d9-49cc-af1e-42ae77fce420,5670.0
3681,quess corp limited,D2C Org,9c263806-a20d-45a3-8c8e-4c4f4b541382,7b9ba1b4-c954-44a2-84bc-b78969b64324,7700.0
4353,quees corp ltd,D2C Org,9bddfa4b-6a32-42cf-a6cc-cf7330b8647c,eda14afa-e601-4e85-9ceb-78fe7a008e13,9294.0
4354,quess corp limited,D2C Org,d45a23db-64e9-44f0-82e1-e37eefb7611c,5fd5e2f9-fd0f-43ff-8b80-d29ec4f64025,10663.0
4410,larsen turbo ltd,D2C Org,1c196fe8-f4d8-45ec-8a37-50011d47eb2f,eebd711e-6638-4f5a-acbf-e40648df698a,10562.0
4839,quess corp limited,D2C Org,7017e3b3-59c9-4f08-9a37-8dc647febc9a,dac2caa8-0af7-45d4-b567-ea79245ff39b,6169.0
4912,quess corp limited,D2C Org,7e5e3b93-7a05-45bc-a7fc-60280546cbb7,c92436f3-be5b-41f0-8290-50c2ee41c524,8528.0
4976,firestop sales and services,D2C Org,a7741a78-9ae7-4376-87f3-25a26c08fefe,2ccd21d0-0436-4d2b-ab7a-0781e0077f79,5129.0
5055,quess corp limited,D2C Org,9dd2e924-7bee-4213-9af1-e282d8e98fd6,787e2b1e-2f9b-4533-b6f4-bfd8ef2fcdc0,11264.0
5209,quess corp limited,D2C Org,09dbb6a1-0cc8-4d5e-b45c-c67c99f32462,1b200cfd-6dc0-43b0-8eca-1311d3ca2ff6,10610.0
5214,manpower group services india pvt ltd,D2C Org,188a86fa-242c-4f1c-a0d0-1b216a749112,b6cac33f-33f6-43ff-b2c0-b89f424b6993,11000.0
5222,quess corp limited,D2C Org,3cd47c81-fb93-45e7-bc76-26890bb24059,7fc5b02a-df6b-4b2f-a1fc-1f167e2b6725,9753.0
5707,quess corp limited,D2C Org,f1ed712b-491a-4d8e-9eed-b9c1909b26d1,b0fd244e-10b6-4521-9457-6708931fe0e8,7046.0
6137,mahindra logistics ltd,D2C Org,c132a3d4-c408-454e-9c00-b018bfc4cd12,05f708ea-f708-4c9e-8e54-c6901b64e080,6421.0
6681,intellect support service pvt ltd,D2C Org,90f3c9fb-3f7a-4689-b752-39ebabf99c3f,a9d7d8eb-8ee7-40e6-81ef-e088eb40a5c3,10257.0
6809,quess corp limited,D2C Org,fbbed8ac-85c7-42d2-b2a6-60faae5a9216,7295acda-1a90-422d-b78d-dfef68f1a736,11666.0
6878,jai bhole enterprises,D2C Org,95947db0-7307-4f15-9a42-1825473fa902,499c13ee-4d6d-41e9-9f06-8a46b8fdd4bb,5000.0
6892,ashok leyland ltd,D2C Org,7409ddbb-b22d-454e-af08-adc826e2a538,c42e34a1-beba-4aca-ba21-1ac073ade4ae,6375.0
6979,genpact india pvt ltd,D2C Org,62b520e3-9184-43d4-9a92-48557cd9f022,9601d057-6fc9-4288-b895-7deb650081ce,8000.0
7021,cipla ltd,D2C Org,339a0310-9e04-4e4d-80d7-f0e812f72ed8,704ca0a1-f0d2-4abe-8267-32068f70a859,10100.0
7037,dmed medical services pvt ltd,D2C Org,f32c6741-467b-4f4a-a391-5fbbb1e86789,65346fd3-cde5-4bcb-a2b6-bab794efb73f,8039.0
7038,dmed medical services pvt ltd,D2C Org,f32c6741-467b-4f4a-a391-5fbbb1e86789,65346fd3-cde5-4bcb-a2b6-bab794efb73f,8039.0
7039,teleperformance global service private limited,D2C Org,43889093-624d-4bed-80b6-2b4310bc6131,a2ec2958-ae12-4a52-9d59-134a6aa43bd1,6000.0
7056,wackytoon studio pvt ltd,D2C Org,3a0843af-c3e1-4b03-bd7e-1bf7bd744e20,064bc8fe-97eb-469c-8eea-481a768c1afe,10830.0
7057,wackytoon studio pvt ltd,D2C Org,35e136b5-ccb5-4a5f-9b1c-fe3067934536,1276080d-74ec-40db-bb6f-4639100354ef,10830.0
7058,concentrix india pvt ltd,D2C Org,ed8d14f5-b2bd-442b-874d-1c4c4fc34af5,405d2a98-6915-4782-a9a0-af3706165f99,9246.0
7060,hardip shipping logistics pvt ltd,D2C Org,85a154a1-acc8-4ece-b551-b76fa0930144,9ce0b314-a29c-44f5-b05e-85cc5d1ee7a1,7300.0
7062,mahindra logistics ltd,D2C Org,90a49b31-bf5d-4849-9851-abc5859241ff,a5a38e87-2369-49f8-a847-59dbf48d2f61,7482.0
7074,reliance jio infocom ltd,D2C Org,62b0529d-83eb-4731-b640-14b6c4064df3,ecf2833b-69ba-43a6-8b8a-1ece8f3331ca,8000.0
7079,paramount products private limited,D2C Org,59c3a4ee-4a66-4bda-aa52-38ceb44faee2,8681f2bc-4cc0-4621-89c1-fbe815e1eb86,6642.0
7080,icici bank ltd,D2C Org,8ae948bd-6984-4ed1-a664-437582c9dc86,f75026b9-6922-4d45-9baa-bf285360e77f,5292.0
7096,cipla ltd,D2C Org,f0c7a15f-f438-4bb6-aabc-53a761c1becc,023c788f-f8cd-46f5-9b62-02ec5e45edd4,5910.0
7104,ashok leyland ltd,D2C Org,90af7c3c-8fb2-40de-9319-69e52ef303fe,36d88569-51b1-4970-9b7b-1749ebed86f8,11336.0
7106,private limited,D2C Org,924b1d32-af0f-4c32-95ab-f19a63e99e6c,a82c6c39-1d67-4837-abcb-0181f384cdcb,10066.0
7107,teamlease services pvt ltd,D2C Org,c818e599-d3f8-4489-ae38-42ac605e7d63,8c7d9716-f562-470f-b950-012d21ad3e45,9032.0
7109,security and intelligence services india pvt limited,D2C Org,d3615dfa-ad1d-4fb6-b187-723489f0b577,8be51c1f-3dcc-4f47-a9ff-e00d96277c87,6824.0
7114,accenture solutions pvt ltd,D2C Org,17345b61-2ad8-43c2-ac7d-367241cca939,1520c9bc-78b7-4038-a0c9-e9ca4598d43a,6270.0
7115,parag milk foods ltd,D2C Org,6d8349b8-de0c-435b-8279-0d45e43e6cd1,5d2371ae-8fc3-41f6-9b08-c1eef39591c9,10419.0
7118,jai bhole enterprises,D2C Org,19a23641-2af3-4737-a5df-18612dd534b0,614beb58-c263-4f4f-9568-a4c250a49c82,11140.0
7215,quess corp limited,D2C Org,32ff63cf-2b32-4a49-9003-f1b5277e2ecb,6fdea3c0-3de6-4dc6-882e-ffb3b63303c2,8315.0
7228,amazon development center india pvt ltd,D2C Org,7c706cd5-2d8d-4b78-a08f-32a27320c39d,34d76e3f-c5a0-4e36-b88d-45f450c989c6,7537.0
7246,bharti airtel limited,D2C Org,ce1405a1-b575-4bc9-ac4b-8ac1b70227f9,643c4c96-3027-4a5d-9de7-13c0f90424fd,8820.0
7262,anandrathi stock broking ltd,D2C Org,77e4b0bb-7eac-4bf8-977c-283a0716d68b,c954fe68-97d9-424d-a749-d36463611df9,10477.0
7273,v5 global services pvt ltd,D2C Org,5585e9f0-7ba1-4944-b2c5-79b96ba667a9,56f44492-9229-4a4b-a8ea-4ae5adce87d7,10540.0
7283,hdfc bank limited,D2C Org,00ee0d8e-d968-4c45-abb4-bcbeb138f4d9,5d89dfed-fac6-4e17-851d-705b9791e421,11521.0
7284,hdfc bank limited,D2C Org,00ee0d8e-d968-4c45-abb4-bcbeb138f4d9,5d89dfed-fac6-4e17-851d-705b9791e421,11521.0
7295,sureit solutions private limited,D2C Org,64b9f514-99bf-4ca4-94c3-d4f07d7def48,e93d9260-3592-4163-b69c-656e3e094766,7692.0
7313,goldmedal electricals pvt ltd,D2C Org,b46defc9-0487-4ab3-8e7a-ee5b85cee40e,9f333ee1-d068-4744-8a99-f0ec145043f0,8997.0
7321,quess corp limited,D2C Org,847cb1f6-0a1d-4ccb-bf2c-6c236d51aa1e,b6cdb670-08bb-49ab-9010-635549a01843,8976.0
7322,quess corp limited,D2C Org,847cb1f6-0a1d-4ccb-bf2c-6c236d51aa1e,b6cdb670-08bb-49ab-9010-635549a01843,8976.0
7323,quess corp limited,D2C Org,847cb1f6-0a1d-4ccb-bf2c-6c236d51aa1e,b6cdb670-08bb-49ab-9010-635549a01843,8976.0
7326,tata consultancy services,D2C Org,22b1f2c6-7f04-4184-b48e-dbee9f63f0ba,1cd3c2d5-eeb3-4435-ac0e-8a6d171c0548,11758.0
7333,suryoday small finance bank ltd,D2C Org,095819ae-0366-4fab-b3ea-c8d08d8b94da,c91209ef-2965-4f93-81e2-adf59317f81e,6790.0
7340,interglobe aviation private limited,D2C Org,31913f3c-4b40-43ab-a326-b2b1470b5f3d,074202fd-a65b-4e09-a2db-369956fde3bf,10584.0
7341,lab2100 digital solutions pvt ltd,D2C Org,8bc42931-1f58-4f3a-a812-be51720953e3,7f534daa-c703-4455-9a72-46d3b0f386d9,9626.0
7344,alkem laboratories ltd,D2C Org,79083e65-5027-4b23-977b-c9f50447115f,e0694f1d-93f5-4599-89fc-6fdec1748b7e,8532.0
7350,vivo mobile india pvt ltd,D2C Org,7ad2752f-4633-45ab-88de-2c86011df039,2aca13e6-fc48-4448-9d20-45eb998f82d6,9398.0
7362,accenture solutions pvt ltd,D2C Org,c6382a42-24e3-4979-85c9-f854ff581a26,02d5f7b1-23fb-4118-bbb9-effd7c703b67,9700.0
7377,hdfc bank ltd,D2C Org,4bdc7c8e-3b3c-40a0-a925-0845050584c6,36d0e920-de1a-4da6-bfaa-fde6fbc4c92c,10738.0
7401,genpact india pvt ltd,D2C Org,2089a97f-fe9f-4cbe-843a-794d326e7b34,7e90801d-5869-4676-8c29-93da204302ad,6519.0
7426,others,D2C Org,5181c237-d0fb-422c-8b39-c7bf7a9665f5,3868927e-27d8-4dd2-84c6-632e89fd38d9,8691.0
7438,tata motors ltd,D2C Org,8023f8d0-009c-41e3-a22b-088eb7ec498d,28065621-964f-4344-85e2-c4c0eee38186,11772.0
7442,genpact india pvt ltd,D2C Org,5d04adac-1b88-47a7-93ba-a068803225f6,7ce21fda-af48-49fa-ac37-cd97148227f6,11370.0
7445,vivo mobile india pvt ltd,D2C Org,a44c6d7d-d82a-4dd6-b538-31c279de312f,c67269cd-21df-498d-aa35-296588012e32,9498.0
7454,nilons enterprises pvt.ltd,D2C Org,6e6a8df1-2171-435b-8f87-84d4a02635bf,7c3648e6-73b4-4f7b-8855-d32fb0f8c105,10000.0
7455,nilons enterprises pvt.ltd,D2C Org,6e6a8df1-2171-435b-8f87-84d4a02635bf,7c3648e6-73b4-4f7b-8855-d32fb0f8c105,10000.0
7535,amazon india pvt ltd,D2C Org,f373dac2-7c61-4b70-8b41-7a3779e62088,85a7f3bc-3341-4e70-bd3d-0cab9093ae2b,6045.0
7539,vivo mobile india pvt ltd,D2C Org,6716e22b-2b48-4474-b801-edbf3802b981,cb04bff0-5caa-4277-aa71-250c1c4f6a1e,10476.0
7570,tata motors ltd,D2C Org,3a1bc515-4a26-43a1-ba62-93fb909c64d9,683fe23b-b423-433f-97d7-9efcbd80bcfc,11600.0
7572,icici bank ltd,D2C Org,4b831ff0-ea34-4c73-8947-c0fd9c1f1f48,f7c6ae82-251c-440d-9183-cded51627e9f,10420.0
7573,icici bank ltd,D2C Org,4b831ff0-ea34-4c73-8947-c0fd9c1f1f48,f7c6ae82-251c-440d-9183-cded51627e9f,10420.0
7575,deep automobiles private limited,D2C Org,7f6e3c12-8cb2-4eea-b9ec-2b9917c25eed,0bbc197b-554b-4049-9493-cb610811857a,5829.0
7612,teleperformance global service private limited,D2C Org,c9d9043a-ab81-43b8-a2d8-a6a7b9d12163,021fd502-8817-4c6f-871a-e3acc049d46f,5144.0
7642,balaji enterprises,D2C Org,df7adc86-c72d-44be-b600-64978309100a,42e78f83-cc3b-483c-a980-5192093e74c0,7078.0
7643,tech mahindra ltd,D2C Org,edcccabd-7c53-4288-a6a6-dc77fdf9a2ce,6d43b19a-ce92-446a-9b7c-8d072bd2d791,5783.0
7644,tech mahindra ltd,D2C Org,edcccabd-7c53-4288-a6a6-dc77fdf9a2ce,6d43b19a-ce92-446a-9b7c-8d072bd2d791,5415.0
7645,tech mahindra ltd,D2C Org,edcccabd-7c53-4288-a6a6-dc77fdf9a2ce,6d43b19a-ce92-446a-9b7c-8d072bd2d791,5783.0
7666,reliance retail limited,D2C Org,fa0e83bc-921e-4e35-8059-4e6425e9ce5d,de0cb5f8-b4ed-4fb1-a6ff-615c121984e6,8513.0
7667,reliance retail limited,D2C Org,fa0e83bc-921e-4e35-8059-4e6425e9ce5d,de0cb5f8-b4ed-4fb1-a6ff-615c121984e6,8513.0
7688,one97 communication paytm services,D2C Org,a0150458-32cd-4c3b-977f-4a3351a790de,833febef-f61e-4ab4-8905-b25b020c52bf,7017.0
7699,sbi general insurance company limited,D2C Org,3ced2d1c-42e5-4508-b682-3e58bcc93ede,ed97c95a-eaa7-496c-b76d-13c979a64f16,11650.0
7700,sbi general insurance company limited,D2C Org,3ced2d1c-42e5-4508-b682-3e58bcc93ede,ed97c95a-eaa7-496c-b76d-13c979a64f16,11650.0
7701,sbi general insurance company limited,D2C Org,3ced2d1c-42e5-4508-b682-3e58bcc93ede,ed97c95a-eaa7-496c-b76d-13c979a64f16,11650.0
7702,sbi general insurance company limited,D2C Org,3ced2d1c-42e5-4508-b682-3e58bcc93ede,ed97c95a-eaa7-496c-b76d-13c979a64f16,11650.0
7715,flipkart private limited,D2C Org,c02857c7-9bc3-4a88-8fe2-7125640bd0a5,84c2344b-759d-46b5-accb-a97fd85b57c0,10499.0
7716,flipkart private limited,D2C Org,c02857c7-9bc3-4a88-8fe2-7125640bd0a5,84c2344b-759d-46b5-accb-a97fd85b57c0,10499.0
7717,flipkart private limited,D2C Org,c02857c7-9bc3-4a88-8fe2-7125640bd0a5,84c2344b-759d-46b5-accb-a97fd85b57c0,8099.0
7723,sterling new  horizons put. ltd,D2C Org,03c0c6a0-5b3c-4967-8392-ca3eaa635457,5d260d82-9d2b-4a6a-ac83-f4fcdb5d07ff,10884.0
7724,sterling new  horizons put. ltd,D2C Org,03c0c6a0-5b3c-4967-8392-ca3eaa635457,5d260d82-9d2b-4a6a-ac83-f4fcdb5d07ff,10884.0
7729,teamlease services ltd,D2C Org,c80bdde5-3bdd-49da-9fd5-bdc80390d41e,19b26f34-36b4-4ff0-9e12-a32eb6df0f7f,10072.0
7803,reliance smsl ltd,D2C Org,116bcf4a-84da-43d3-bfbe-d55a840b787e,dec05ed1-32c3-455b-a7ca-eb7f0ebeab08,11642.0
7807,others,D2C Org,d2e44056-a5bf-4fa2-8b9f-a9d3be8eac36,bc390af6-602f-4617-a13d-6bc76e82bf57,11529.0
7817,team lease services limited,D2C Org,fb4096ca-7f65-4d70-9ffc-0a4857499779,add8477c-3705-4d05-b997-f3f11f328e48,8475.0
7818,aye finance pvt ltd,D2C Org,e3295ed3-f2bf-4ca5-b415-5966c781172d,e84b9b2a-6f62-43c2-b116-f0cab6af5fcd,9600.0
7822,associated switchgears & projects limited,D2C Org,eb3ea3fd-9044-4e52-a4f8-73fbdec8c9c4,2cad8624-8df6-46d9-b185-c945a89e6c89,7379.0
7830,squareyard consulting pvt.ltd,D2C Org,612168dd-0370-4eaa-b50d-b25b1a8a2229,7e659cc2-a93b-4a8d-9de8-594c891b468b,8820.0
7831,innovsource service private limited,D2C Org,6082e8d2-a334-44ab-b64c-92f547d06b48,2e36c95b-bf2f-4e74-b097-0b35cb9c9c28,10271.0
7832,teleperformance global service private limited,D2C Org,9d933c5a-6421-4833-9029-486d063478d5,3726c744-fc2e-4708-90e2-8884a68ba190,9414.0
7836,tata motors ltd,D2C Org,b936ca73-1a74-43ee-bcf4-77bc00325978,09aa243d-b017-431e-a9c6-9458166f217b,11267.0
7840,private limited,D2C Org,c255dea0-87e0-45aa-bc17-5496ce6bce9e,fa8cf683-1afe-467b-a735-0b1b7e6d2220,11590.0
7842,tata motors ltd,D2C Org,7b1cc96f-560a-461f-8c5a-2ced4af870a2,5ab745ee-3aa0-44a6-98d9-f54cd7defe4b,7500.0
7860,aryan aviation pvt ltd,D2C Org,4dba3b2b-56a3-4a43-b30f-10d03c9cb9de,a78b172c-772e-4983-a36a-f32bc5d15e0f,8757.0
7886,pathcare labs pvt ltd,D2C Org,93f4b284-81f6-4823-b0c2-28e184c3eb2f,55911d89-a47d-4e08-b2a8-8760702ef504,10310.0
7887,randstad india private limited,D2C Org,20a4b782-1f61-4ed3-abfb-ab157ab44413,6b10335f-90b7-47e8-8801-af10259aebb4,8944.0
7899,schaeffler india limited,D2C Org,634ab7d5-8327-4c54-a0a0-c7f85d7b55ec,4b9be251-44f2-4d3d-b95d-5cb190dd452f,5160.0
7909,accenture solutions pvt ltd,D2C Org,58ec8947-c905-4976-9d14-600c526cfb48,a82e6a89-5fb8-44a9-a1bf-a9a870474520,7598.0
7934,private limited,D2C Org,d4cba00b-5a8e-425a-b632-c2a058772885,a7ba1ad7-2bbf-40a5-8445-e204ba324052,6195.0
7966,flipkart india pvt ltd,D2C Org,83058f1e-1733-4fee-a8d0-f0b97d42d2a6,1ee6c6f7-7663-46ed-8b6d-b2e6ef87929c,6667.0
7968,tech mahindra ltd,D2C Org,ea78f932-c522-43f3-9290-4ade20465b47,6cc5c545-4442-43d9-97b8-7657e558875b,7111.0
7977,pvt limited,D2C Org,e6ec1ca3-4740-48f9-a4a5-3d51116388e9,8dca5b9e-aa3d-48f7-86d9-e3ba1e677071,5468.0
8002,manpower group services india pvt ltd,D2C Org,e66f1164-8f68-42f2-9139-90006beb5c5f,a6df1bab-06d4-4b2f-af63-c9bfac74a0b9,10000.0
8007,rajasthan state gas limited,D2C Org,1b4f1e28-2e0c-42c2-9b29-82b3f189d3b8,7f17f43f-4a8b-4f4b-8612-8b49b2898f7e,9499.0
8008,teleperformance global service private limited,D2C Org,07a2c3e4-a9e8-4a9e-9296-bc1cb9ddafaf,904f17ff-bd3a-4d2d-8b5f-d64b819baf64,7938.0
8012,think and learn private limited,D2C Org,53a75c75-0abc-48c4-ae3f-5f6e39c84ec0,438c6bf0-4afe-464f-9bde-ee9dcee6835b,5700.0
8020,larsen turbo ltd,D2C Org,8bf3a4c7-9956-4675-a4e5-62f390351f5d,5361880e-7c34-4d04-bc98-30c04ef85e23,8750.0
8022,tata motors ltd,D2C Org,19b0e1bb-014d-4776-8e52-59b11ab4de0a,c1c4b52b-ad4d-4062-a6ab-e4e5cf4486d9,10500.0
8179,satyamicrocapital ltd,D2C Org,9abfea0e-5b6d-4969-881b-6297a2c86c46,546121ec-cb21-4161-b21f-1a313b2df02f,10751.0
8226,wnsglobal service pvt ltd,D2C Org,d87405f1-6dc8-40bb-9ecf-8e4c7a84f5ce,e67be7a0-ef01-4162-8cc9-045dcac09ac0,5000.0
8262,tata consultancy services,D2C Org,09cdc337-f26c-4844-8b49-629196949fb4,e3643c47-8c7a-4990-a085-99147c5f1a59,10786.0
8324,sterling new  horizons put. ltd,D2C Org,4f630eaf-fc7e-461c-9a88-08bb617be67c,48d3ff3b-02b9-4242-97a2-8729f700da67,6115.0
8413,aarthi scans pvt ltd,D2C Org,3b73e878-0e53-4423-b84c-1f397ce19683,17cf2a45-bb0d-45f7-b246-de88eddf639a,5360.0
8644,concentrix india pvt ltd,D2C Org,c5a14ea0-826f-4487-89cb-9462819d79d0,4b96315c-6641-473b-8730-64ba934a2d5e,7155.0
8674,quees corp ltd,D2C Org,17abe5bc-c555-4b1e-9b7b-fc9d9f37839b,cda8b7d0-d898-49c8-9d38-1aa4e717f226,10075.0
8706,apollo pharmacies limited,D2C Org,38bce4ba-1343-4cfe-a1b4-0f3b1e727f67,a3b8a8fc-3449-40dd-a964-9c9825a50d63,8500.0
8707,apollo pharmacies limited,D2C Org,38bce4ba-1343-4cfe-a1b4-0f3b1e727f67,a3b8a8fc-3449-40dd-a964-9c9825a50d63,6000.0
8896,ienergizer it services private limited,D2C Org,99131232-0047-4eeb-9b0e-d5b301efdeda,7a14cbc4-3429-4e9e-8d7d-477a1257e1a4,8952.0
8897,ienergizer it services private limited,D2C Org,99131232-0047-4eeb-9b0e-d5b301efdeda,7a14cbc4-3429-4e9e-8d7d-477a1257e1a4,8952.0
9120,reliance smsl limited,D2C Org,056ef946-78ea-4c9d-b235-a81f9eb26471,10247e6d-2d75-4335-aa3c-0393b386cb18,9000.0
9156,amazon development center india pvt ltd,D2C Org,3befe20a-f66d-4828-a218-43aedfddf9fc,1c951950-d354-4607-806b-a47f064e52e4,5801.0
