{"itemCount":6119,"md5Checksum":"LL1d1yDh0RL9eZ3o/q8AeA==","etag":"1ec8f1b48bfb8153910efbd614764a5f-1","dataFileS3Key":"AWSDynamoDB/01638759325653-02feb3ea/data/jubmvjm27a4a7drr347mno73cu.json.gz"}
{"itemCount":6208,"md5Checksum":"s5BqFhcj5LQg2z8wwBkEOw==","etag":"d2b29cdeb171b7eac6d0159f1cde1e4d-1","dataFileS3Key":"AWSDynamoDB/01638759325653-02feb3ea/data/g4d52s5gyq3ilhxtaowbgzm6me.json.gz"}
{"itemCount":6254,"md5Checksum":"k2MYQvoEd4hMQ48sBHJXtA==","etag":"6c4a3c96d85c61e7ffd6a33a57fc47c6-1","dataFileS3Key":"AWSDynamoDB/01638759325653-02feb3ea/data/hymdv3jd3q46zg3ecou6zvnf5u.json.gz"}
{"itemCount":6168,"md5Checksum":"ucvZ0TA6XJfx4ex9JSnQBA==","etag":"db3869bdb082e4e091b9f057f03c4ff7-1","dataFileS3Key":"AWSDynamoDB/01638759325653-02feb3ea/data/k2ob2uaeumz5xmkw2zjuj26bqi.json.gz"}
