{"itemCount":7620,"md5Checksum":"eOU9KB+kMoF+ycXtLi+u9w==","etag":"1ff3df92fbc9927ba11405de075be10b-1","dataFileS3Key":"AWSDynamoDB/01640711132763-9c305ec8/data/4x5srjhqc43rxduyx3gk24a5ni.json.gz"}
{"itemCount":7757,"md5Checksum":"F0ACwAx4UxL3sX5WqpHUdw==","etag":"fbab05dcc233d707ffb72db061baec08-1","dataFileS3Key":"AWSDynamoDB/01640711132763-9c305ec8/data/tymvw3ztmqy3rgy6r4oiflpdsy.json.gz"}
{"itemCount":7827,"md5Checksum":"+fEXa/tuC/7YpBwG8Qh3ig==","etag":"82582c766c747c3adabda56b20623ba2-1","dataFileS3Key":"AWSDynamoDB/01640711132763-9c305ec8/data/qmatgrfhnu2exlyy76tztgby4u.json.gz"}
{"itemCount":7768,"md5Checksum":"DlWAcrFvoEjhG2BXL9QHMQ==","etag":"74fe3af095ff1d628728bbf94cd7439b-1","dataFileS3Key":"AWSDynamoDB/01640711132763-9c305ec8/data/zkeopigfu42l7gn2p7cjri3f64.json.gz"}
