created_at,employee_id,phone_number,status,updated_at,,reason
2021-09-01,2001244094,9726814751,DECLINED,2021-09-01T08:07:01-03:00,,Invalid Gender Code
2021-09-01,2001540686,6350033730,DECLINED,2021-09-01T08:56:34-03:00,,(Additional Address Mandatory field missing)
2021-09-01,2001079164,9284757919,DECLINED,2021-09-01T08:46:45-03:00,,No
2021-09-01,2001130927,9510547540,DECLINED,2021-09-01T08:06:14-03:00,,(Additional Address Mandatory field missing)
2021-09-01,2001041483,9347556345,DECLINED,2021-09-01T08:45:44-03:00,,Yes
2021-09-01,2001645242,7483914772,DECLINED,2021-09-01T08:18:21-03:00,,(Additional Address Mandatory field missing)
2021-09-01,2001456195,7338911997,DECLINED,2021-09-01T08:10:44-03:00,,(Additional Address Mandatory field missing)
2021-09-01,2001734843,7896722047,DECLINED,2021-09-05T15:46:27-03:00,,(Additional Address Mandatory field missing)
2021-09-01,2001458678,6362822404,DECLINED,2021-09-01T08:05:23-03:00,,(Additional Address Mandatory field missing)
2021-09-01,2000814716,9126373434,DECLINED,2021-09-01T08:17:27-03:00,,No
2021-09-01,2001712714,7004277931,DECLINED,2021-09-01T08:19:00-03:00,,Wrong State Code 
2021-09-01,2001680176,8057519398,DECLINED,2021-09-01T08:19:33-03:00,,(Additional Address Mandatory field missing)
2021-09-01,2001218522,9592727575,DECLINED,2021-09-01T08:19:44-03:00,,(Additional Address Mandatory field missing)
2021-09-01,2001742998,9101705225,DECLINED,2021-09-01T08:20:33-03:00,,(Additional Address Mandatory field missing)
2021-09-01,2000852742,8977743218,DECLINED,2021-09-01T08:22:38-03:00,,(Additional Address Mandatory field missing)
2021-09-01,2001749240,8861115393,DECLINED,2021-09-01T08:29:11-03:00,,(Additional Address Mandatory field missing)
2021-09-01,2001596015,7973001659,DECLINED,2021-09-01T08:30:17-03:00,,(Additional Address Mandatory field missing)
2021-09-01,2001465127,8299017014,DECLINED,2021-09-01T08:30:23-03:00,,Yes
2021-09-01,2001569943,7289015618,DECLINED,2021-09-01T08:31:14-03:00,,(Additional Address Mandatory field missing)
2021-09-01,2000905753,8104609239,DECLINED,2021-09-01T08:32:59-03:00,,Wrong State Code 
2021-09-01,2001462719,8860253557,DECLINED,2021-09-01T08:35:18-03:00,,(Additional Address Mandatory field missing)
2021-09-01,2001465911,9899737469,DECLINED,2021-09-01T08:34:47-03:00,,(Additional Address Mandatory field missing)
2021-09-01,2001386381,9416252845,DECLINED,2021-09-01T08:40:04-03:00,,(Additional Address Mandatory field missing)
2021-09-01,2001106410,7069225292,DECLINED,2021-09-01T08:35:07-03:00,,No
2021-09-01,2001570352,9986290333,DECLINED,2021-09-01T08:35:48-03:00,,Yes
2021-09-01,2001637337,8427050523,DECLINED,2021-09-01T08:36:36-03:00,,(Additional Address Mandatory field missing)
2021-09-01,2001520733,8698420442,DECLINED,2021-09-01T08:37:52-03:00,,(Additional Address Mandatory field missing)
2021-09-01,2001728239,7006573512,DECLINED,2021-09-01T08:37:46-03:00,,(Additional Address Mandatory field missing)
2021-09-01,2001334702,8287399007,DECLINED,2021-09-01T08:38:48-03:00,,(Additional Address Mandatory field missing)
2021-09-01,2001761786,9919797693,DECLINED,2021-09-01T08:39:07-03:00,,(Additional Address Mandatory field missing)
2021-09-01,2000992023,9899504999,DECLINED,2021-09-04T04:22:33-03:00,,(Additional Address Mandatory field missing)
2021-09-01,2000778791,9483606571,DECLINED,2021-09-01T08:43:44-03:00,,(Additional Address Mandatory field missing)
2021-09-01,2001314089,9940253274,DECLINED,2021-09-01T08:46:42-03:00,,(Additional Address Mandatory field missing)
2021-09-01,2001647284,7264924547,DECLINED,2021-09-01T08:43:15-03:00,,(Additional Address Mandatory field missing)
2021-09-01,2001461127,8285029225,DECLINED,2021-09-01T08:47:10-03:00,,(Additional Address Mandatory field missing)
2021-09-01,2001576595,9319355342,DECLINED,2021-09-01T08:45:39-03:00,,(Additional Address Mandatory field missing)
2021-09-01,2001699516,9087983953,DECLINED,2021-09-01T08:44:39-03:00,,(Additional Address Mandatory field missing)
2021-09-01,2000847752,9986250830,DECLINED,2021-09-01T08:45:51-03:00,,No
2021-09-01,2001084604,9418327133,DECLINED,2021-09-01T08:44:59-03:00,,(Additional Address Mandatory field missing)
2021-09-01,2001651753,9152771322,DECLINED,2021-09-01T08:45:39-03:00,,(Additional Address Mandatory field missing)
2021-09-01,2001540574,9814641464,DECLINED,2021-09-01T08:45:36-03:00,,(Additional Address Mandatory field missing)
2021-09-01,2001673102,9145269553,DECLINED,2021-09-01T08:46:07-03:00,,(Additional Address Mandatory field missing)
2021-09-01,2001690048,9479354182,DECLINED,2021-09-01T08:47:08-03:00,,(Additional Address Mandatory field missing)
2021-09-01,2001743846,9082653671,DECLINED,2021-09-01T08:46:50-03:00,,(Additional Address Mandatory field missing)
2021-09-01,2000704399,7676888976,DECLINED,2021-09-01T08:46:35-03:00,,(Additional Address Mandatory field missing)
2021-09-01,2000861972,9500016860,DECLINED,2021-09-01T08:46:55-03:00,,(Additional Address Mandatory field missing)
2021-09-01,2000836395,9933981546,DECLINED,2021-09-01T08:47:07-03:00,,(Additional Address Mandatory field missing)
2021-09-01,2001730520,8602460447,DECLINED,2021-09-01T08:47:15-03:00,,(Additional Address Mandatory field missing)
2021-09-01,2001090801,9714869048,DECLINED,2021-09-01T08:51:38-03:00,,(Additional Address Mandatory field missing)
2021-09-01,2001607986,9510859813,DECLINED,2021-09-01T08:48:16-03:00,,(Additional Address Mandatory field missing)
2021-09-01,2001623652,8143806845,DECLINED,2021-09-01T08:48:13-03:00,,No
2021-09-01,2001625783,8335912101,DECLINED,2021-09-01T08:48:48-03:00,,(Additional Address Mandatory field missing)
2021-09-01,2001602528,7029330918,DECLINED,2021-09-01T08:48:45-03:00,,(Additional Address Mandatory field missing)
2021-09-01,2001535827,8367307604,DECLINED,2021-09-01T08:50:46-03:00,,(Additional Address Mandatory field missing)
2021-09-01,2001703250,6376865077,DECLINED,2021-09-01T08:51:51-03:00,,(Additional Address Mandatory field missing)
2021-09-01,2001692931,7900131714,DECLINED,2021-09-01T08:53:04-03:00,,(Additional Address Mandatory field missing)
2021-09-01,2001526975,7710901204,DECLINED,2021-09-01T08:51:56-03:00,,(Additional Address Mandatory field missing)
2021-09-01,2001609404,7750080850,DECLINED,2021-09-01T08:53:29-03:00,,(Additional Address Mandatory field missing)
2021-09-01,2001761795,9892294124,DECLINED,2021-09-01T08:53:13-03:00,,No
2021-09-01,2001695763,8340646662,DECLINED,2021-09-01T08:54:24-03:00,,No Record Found
2021-09-01,2001628354,7477701344,DECLINED,2021-09-01T08:55:43-03:00,,(Additional Address Mandatory field missing)
2021-09-01,2001762637,8123324516,DECLINED,2021-09-04T01:37:29-03:00,,(Additional Address Mandatory field missing)
2021-09-01,2001757661,9685549952,DECLINED,2021-09-01T08:56:32-03:00,,(Additional Address Mandatory field missing)
2021-09-01,2001621560,8334919891,DECLINED,2021-09-01T08:56:17-03:00,,(Additional Address Mandatory field missing)
2021-09-01,2001471519,8433022725,DECLINED,2021-09-01T08:58:22-03:00,,(Additional Address Mandatory field missing)
2021-09-01,2001631884,9845673961,DECLINED,2021-09-01T09:00:23-03:00,,(Additional Address Mandatory field missing)
2021-09-01,2000353793,9372224543,DECLINED,2021-09-01T09:04:49-03:00,,(Additional Address Mandatory field missing)
2021-09-01,2001197583,8779619496,DECLINED,2021-09-01T09:00:00-03:00,,(Additional Address Mandatory field missing)
2021-09-01,2001130073,7306728880,DECLINED,2021-09-01T09:02:39-03:00,,(Additional Address Mandatory field missing)
2021-09-01,2001764181,9967063881,DECLINED,2021-09-01T09:04:17-03:00,,Invalid Gender Code
2021-09-01,2001080446,9782778532,DECLINED,2021-09-01T09:03:58-03:00,,Wrong State Code
2021-09-01,2001301957,8697658864,DECLINED,2021-09-01T09:04:02-03:00,,Mandatory Field Missing
2021-09-01,2001293396,9161139999,DECLINED,2021-09-01T09:04:45-03:00,,No
2021-09-01,2001382276,9918406115,DECLINED,2021-09-01T09:05:35-03:00,,Invalid Gender Code
2021-09-01,2000697244,9871351260,DECLINED,2021-09-01T09:05:32-03:00,,Invalid Gender Code
2021-09-01,2000684459,7869666780,DECLINED,2021-09-01T09:09:59-03:00,,(Additional Address Mandatory field missing)
2021-09-01,2001701599,9112623395,DECLINED,2021-09-01T09:09:01-03:00,,(Additional Address Mandatory field missing)
2021-09-01,2001772342,9582925063,DECLINED,2021-09-01T09:15:50-03:00,,Invalid Gender Code
2021-09-01,2001046031,9127523049,DECLINED,2021-09-01T09:10:17-03:00,,(Additional Address Mandatory field missing)
2021-09-01,2001269133,9910568972,DECLINED,2021-09-01T09:13:58-03:00,,(Additional Address Mandatory field missing)
2021-09-01,2000977162,9988866996,DECLINED,2021-09-01T09:16:16-03:00,,(Additional Address Mandatory field missing)
2021-09-01,2001463967,9394511070,DECLINED,2021-09-01T09:16:23-03:00,,No
2021-09-01,2001444492,7982244542,DECLINED,2021-09-01T09:21:44-03:00,,(Additional Address Mandatory field missing)
2021-09-01,2000171338,9662233222,DECLINED,2021-09-01T09:30:14-03:00,,(Additional Address Mandatory field missing)
2021-09-01,2001625759,6294513638,DECLINED,2021-09-01T09:31:46-03:00,,(Additional Address Mandatory field missing)
2021-09-01,2001469447,9600423269,DECLINED,2021-09-01T09:32:48-03:00,,No Record Found
2021-09-01,2000733326,9818921800,DECLINED,2021-09-01T09:41:08-03:00,,(Additional Address Mandatory field missing)
2021-09-01,2001075387,7665653589,DECLINED,2021-09-01T09:56:56-03:00,,(Additional Address Mandatory field missing)
2021-09-01,2000935137,9637931131,DECLINED,2021-09-01T10:09:58-03:00,,(Additional Address Mandatory field missing)
2021-09-01,2001732055,7869700424,DECLINED,2021-09-01T10:21:10-03:00,,(Additional Address Mandatory field missing)
2021-09-01,2001475612,8281506343,DECLINED,2021-09-01T10:30:25-03:00,,(Additional Address Mandatory field missing)
2021-09-03,2001772403,9660763895,DECLINED,2021-09-03T09:31:09-03:00,,Yes
2021-09-04,2001638294,9940591404,DECLINED,2021-09-04T05:18:35-03:00,,Wrong State Code
2021-09-04,2001638052,9182104073,DECLINED,2021-09-04T05:31:16-03:00,,(Additional Address Mandatory field missing)
2021-09-04,2001486402,9654406728,DECLINED,2021-09-04T08:00:39-03:00,,Wrong State Code
2021-09-05,2000478461,7008225065,DECLINED,2021-09-05T01:50:03-03:00,No,No
2021-09-05,2001396392,9862058786,DECLINED,2021-09-05T02:08:25-03:00,Wrong State code,(Additional Address Mandatory field missing)
2021-09-05,2000803626,8920443520,DECLINED,2021-09-05T09:31:08-03:00,"(Additional Address Mandatory field missing)""",(Additional Address Mandatory field missing)
2021-09-01,SUJI003,7525023951,DROPOFF,2021-09-01T03:58:58-03:00,,NA
2021-09-01,SUJI007,7019827054,DROPOFF,2021-09-01T04:02:43-03:00,,NA
2021-09-01,2001238004,7053300353,DROPOFF,2021-09-01T04:02:56-03:00,,NA
2021-09-01,2000793692,8860598514,DROPOFF,2021-09-01T04:08:42-03:00,,NA
2021-09-01,2001309644,8208484108,DROPOFF,2021-09-01T04:09:29-03:00,,NA
2021-09-01,2001637400,8368983744,DROPOFF,2021-09-01T04:13:21-03:00,,NA
2021-09-01,2000169255,9003022745,OTP,2021-09-01T08:35:31-03:00,,NA
2021-09-01,808222,8218847196,DROPOFF,2021-09-01T04:14:15-03:00,,NA
2021-09-01,2001586468,9000150853,DROPOFF,2021-09-01T04:14:15-03:00,,NA
2021-09-01,795381,8179234525,OTP,2021-09-01T08:05:00-03:00,,NA
2021-09-01,2001773443,7386730883,DROPOFF,2021-09-01T04:14:38-03:00,,NA
2021-09-01,2001570646,9952722634,DROPOFF,2021-09-01T04:16:00-03:00,,NA
2021-09-01,10008409,8008054569,DROPOFF,2021-09-01T04:16:03-03:00,,NA
2021-09-01,AF337,9567676018,DROPOFF,2021-09-01T04:16:03-03:00,,NA
2021-09-01,2001235255,9051367810,OTP,2021-09-01T08:36:51-03:00,,NA
2021-09-01,2000687913,8240603616,OTP,2021-09-01T08:08:13-03:00,,NA
2021-09-01,10016886,7457051043,DROPOFF,2021-09-01T04:19:40-03:00,,NA
2021-09-01,QS2257272,9585757211,DROPOFF,2021-09-01T04:23:26-03:00,,NA
2021-09-01,T-3383,8904700892,OTP,2021-09-02T13:56:41-03:00,,NA
2021-09-01,2001634808,9528572735,DROPOFF,2021-09-01T04:23:33-03:00,,NA
2021-09-01,2001633283,7742636674,OTP,2021-09-01T08:36:40-03:00,,NA
2021-09-01,2001634920,9877933974,OTP,2021-09-01T08:50:46-03:00,,NA
2021-09-01,2001577744,9640298595,OTP,2021-09-01T07:29:31-03:00,,NA
2021-09-01,2001438213,6281027289,DROPOFF,2021-09-01T04:32:45-03:00,,NA
2021-09-01,2001619501,9175947434,OTP,2021-09-01T08:19:03-03:00,,NA
2021-09-01,QS2266964,8160320264,DROPOFF,2021-09-01T04:42:40-03:00,,NA
2021-09-01,2001692438,9503834303,DROPOFF,2021-09-01T04:44:54-03:00,,NA
2021-09-01,2001694863,8508884105,DROPOFF,2021-09-01T04:46:03-03:00,,NA
2021-09-01,2000855819,7022911831,DROPOFF,2021-09-01T04:48:37-03:00,,NA
2021-09-01,2001200798,8930121733,DROPOFF,2021-09-01T04:49:35-03:00,,NA
2021-09-01,2001539701,9703957317,DROPOFF,2021-09-01T04:50:03-03:00,,NA
2021-09-01,2001645337,8690355144,DROPOFF,2021-09-01T04:50:56-03:00,,NA
2021-09-01,2000992006,9580283091,OTP,2021-09-01T07:49:30-03:00,,NA
2021-09-01,2001765823,9633160659,DROPOFF,2021-09-01T04:55:52-03:00,,NA
2021-09-01,2001466514,8250058313,OTP,2021-09-01T09:07:09-03:00,,NA
2021-09-01,2001212564,7337450463,DROPOFF,2021-09-01T05:00:31-03:00,,NA
2021-09-01,2000010301,9937779192,DROPOFF,2021-09-01T05:04:50-03:00,,NA
2021-09-01,2001575546,7042655869,DROPOFF,2021-09-01T05:05:29-03:00,,NA
2021-09-01,2000828257,8882920731,OTP,2021-09-01T07:21:59-03:00,,NA
2021-09-01,2001601967,9136208547,DROPOFF,2021-09-01T05:07:04-03:00,,NA
2021-09-01,2001614307,7795343472,ACCEPTED,2021-09-01T08:22:09-03:00,,NA
2021-09-01,QS2279827,6261759477,DROPOFF,2021-09-01T05:21:10-03:00,,NA
2021-09-01,2001648480,9087432015,OTP,2021-09-01T08:27:04-03:00,,NA
2021-09-01,202109106,8310901162,DROPOFF,2021-09-01T05:26:46-03:00,,NA
2021-09-01,T-16227,7411156062,DROPOFF,2021-09-01T05:26:51-03:00,,NA
2021-09-01,2001377669,7016223117,DROPOFF,2021-09-01T05:29:38-03:00,,NA
2021-09-01,QS2231707,9130989811,DROPOFF,2021-09-01T05:30:14-03:00,,NA
2021-09-01,2001512205,8586017444,DROPOFF,2021-09-01T05:32:56-03:00,,NA
2021-09-01,202109108,8310901162,DROPOFF,2021-09-01T05:38:24-03:00,,NA
2021-09-01,2001456546,9113292579,DROPOFF,2021-09-01T05:39:05-03:00,,NA
2021-09-01,2000911844,9349501521,DROPOFF,2021-09-01T05:44:33-03:00,,NA
2021-09-01,2000776010,8017249590,OTP,2021-09-01T08:09:06-03:00,,NA
2021-09-01,2001754618,7008196365,DROPOFF,2021-09-01T08:15:52-03:00,,NA
2021-09-01,2001161029,9640867476,DROPOFF,2021-09-01T08:15:53-03:00,,NA
2021-09-01,804120,9901543579,OTP,2021-09-01T08:16:42-03:00,,NA
2021-09-01,765926,9960258834,DROPOFF,2021-09-01T08:15:54-03:00,,NA
2021-09-01,2001316695,8447812134,DROPOFF,2021-09-01T08:16:00-03:00,,NA
2021-09-01,807530,9945454904,OTP,2021-09-03T08:12:12-03:00,,NA
2021-09-01,2001422323,9890904500,ACCEPTED,2021-09-01T08:17:20-03:00,,NA
2021-09-01,QS2262548,9084656147,DROPOFF,2021-09-01T08:16:18-03:00,,NA
2021-09-01,GB241,8003945266,DROPOFF,2021-09-01T08:16:20-03:00,,NA
2021-09-01,QS2267619,7006449099,DROPOFF,2021-09-01T08:16:25-03:00,,NA
2021-09-01,784785,7045061438,DROPOFF,2021-09-01T08:16:31-03:00,,NA
2021-09-01,2000125747,8259855785,OTP,2021-09-01T08:17:07-03:00,,NA
2021-09-01,QS2231921,9929017288,DROPOFF,2021-09-01T08:16:41-03:00,,NA
2021-09-01,SN201,9886220689,DROPOFF,2021-09-01T08:16:44-03:00,,NA
2021-09-01,PC426,9505155422,DROPOFF,2021-09-01T08:16:47-03:00,,NA
2021-09-01,791991,9845094052,OTP,2021-09-01T08:17:47-03:00,,NA
2021-09-01,QS2274773,8396995702,DROPOFF,2021-09-01T08:16:58-03:00,,NA
2021-09-01,2001217844,9550315415,DROPOFF,2021-09-01T08:17:06-03:00,,NA
2021-09-01,QS2253632,9034937180,DROPOFF,2021-09-01T08:17:08-03:00,,NA
2021-09-01,RF317,9148758298,DROPOFF,2021-09-01T08:17:16-03:00,,NA
2021-09-01,2001375618,7448368818,OTP,2021-09-01T08:18:14-03:00,,NA
2021-09-01,807554,9538612640,DROPOFF,2021-09-01T08:17:33-03:00,,NA
2021-09-01,QS2273443,9978683738,DROPOFF,2021-09-01T08:17:37-03:00,,NA
2021-09-01,MF357,8088327441,DROPOFF,2021-09-01T08:17:42-03:00,,NA
2021-09-01,807697,8218197990,DROPOFF,2021-09-01T08:17:44-03:00,,NA
2021-09-01,808115,7066203503,DROPOFF,2021-09-01T08:17:46-03:00,,NA
2021-09-01,SR324,9993814704,DROPOFF,2021-09-01T08:17:46-03:00,,NA
2021-09-01,808113,9844083073,DROPOFF,2021-09-01T08:17:47-03:00,,NA
2021-09-01,MH426,9353319781,DROPOFF,2021-09-01T08:18:11-03:00,,NA
2021-09-01,2000906419,7738984805,ACCEPTED,2021-09-01T08:20:16-03:00,,NA
2021-09-01,2001791695,8529241901,DROPOFF,2021-09-01T08:18:34-03:00,,NA
2021-09-01,JC891,8099919700,DROPOFF,2021-09-01T08:18:34-03:00,,NA
2021-09-01,QS2253809,7069700768,DROPOFF,2021-09-01T08:18:51-03:00,,NA
2021-09-01,807870,8489918929,DROPOFF,2021-09-01T08:18:55-03:00,,NA
2021-09-01,SQ974,8130661093,DROPOFF,2021-09-01T08:19:12-03:00,,NA
2021-09-01,2001772771,8605982298,DROPOFF,2021-09-01T08:19:17-03:00,,NA
2021-09-01,2000011792,9710155842,DROPOFF,2021-09-01T08:19:22-03:00,,NA
2021-09-01,QS2253137,9860269429,DROPOFF,2021-09-01T08:19:23-03:00,,NA
2021-09-01,VC858,9516800273,DROPOFF,2021-09-01T08:19:57-03:00,,NA
2021-09-01,2001325267,8903726481,OTP,2021-09-01T08:24:52-03:00,,NA
2021-09-01,AD666,9114535293,DROPOFF,2021-09-01T08:20:25-03:00,,NA
2021-09-01,808110,8889514932,DROPOFF,2021-09-01T08:20:25-03:00,,NA
2021-09-01,2001101848,7907560566,ACCEPTED,2021-09-01T08:21:01-03:00,,NA
2021-09-01,804617,8056036034,OTP,2021-09-01T08:21:19-03:00,,NA
2021-09-01,2000857925,9686144794,OTP,2021-09-01T08:22:41-03:00,,NA
2021-09-01,2001752479,9824430697,DROPOFF,2021-09-01T08:22:13-03:00,,NA
2021-09-01,2001755864,8527854186,DROPOFF,2021-09-01T08:22:17-03:00,,NA
2021-09-01,2000818563,9861213248,OTP,2021-09-01T08:23:34-03:00,,NA
2021-09-01,2001523200,9881474116,OTP,2021-09-01T08:23:37-03:00,,NA
2021-09-01,2000855994,9632039973,DROPOFF,2021-09-01T08:22:25-03:00,,NA
2021-09-01,806895,9591136493,OTP,2021-09-01T08:23:34-03:00,,NA
2021-09-01,2001202374,8556976987,DROPOFF,2021-09-01T08:22:54-03:00,,NA
2021-09-01,2001439823,9944670656,OTP,2021-09-01T08:24:03-03:00,,NA
2021-09-01,2000944375,7387564820,DROPOFF,2021-09-01T08:23:10-03:00,,NA
2021-09-01,805858,9848382882,OTP,2021-09-01T08:24:04-03:00,,NA
2021-09-01,2001178341,9739252020,DROPOFF,2021-09-01T08:23:30-03:00,,NA
2021-09-01,2001727607,8341055377,DROPOFF,2021-09-01T08:23:44-03:00,,NA
2021-09-01,2001771179,8209549626,DROPOFF,2021-09-01T08:23:45-03:00,,NA
2021-09-01,QS2262864,7893504076,DROPOFF,2021-09-01T08:23:46-03:00,,NA
2021-09-01,788724,9593482146,DROPOFF,2021-09-01T08:24:04-03:00,,NA
2021-09-01,2001297261,8971278752,DROPOFF,2021-09-01T08:24:24-03:00,,NA
2021-09-01,2000802618,9581896240,DROPOFF,2021-09-01T08:24:37-03:00,,NA
2021-09-01,2001591906,9913718708,DROPOFF,2021-09-01T08:25:06-03:00,,NA
2021-09-01,QS2264886,9780696059,DROPOFF,2021-09-01T08:25:18-03:00,,NA
2021-09-01,2001632444,9692107893,OTP,2021-09-01T08:26:21-03:00,,NA
2021-09-01,2001132123,9818930677,DROPOFF,2021-09-01T08:26:31-03:00,,NA
2021-09-01,2001596201,8008446118,DROPOFF,2021-09-01T08:26:47-03:00,,NA
2021-09-01,806351,9342270763,OTP,2021-09-01T08:27:57-03:00,,NA
2021-09-01,806392,9398117901,OTP,2021-09-01T08:28:17-03:00,,NA
2021-09-01,2001071434,9578255571,DROPOFF,2021-09-01T08:28:03-03:00,,NA
2021-09-01,784142,9560097253,DROPOFF,2021-09-01T08:28:25-03:00,,NA
2021-09-01,2001253142,7698071426,DROPOFF,2021-09-01T08:28:43-03:00,,NA
2021-09-01,2001047497,8506981025,DROPOFF,2021-09-01T08:28:47-03:00,,NA
2021-09-01,2000775768,9163179792,DROPOFF,2021-09-01T08:29:14-03:00,,NA
2021-09-01,QS2242816,9911769117,DROPOFF,2021-09-01T08:30:28-03:00,,NA
2021-09-01,QS2285248,8286159964,DROPOFF,2021-09-01T08:30:40-03:00,,NA
2021-09-01,2001183852,7220034436,DROPOFF,2021-09-01T08:30:59-03:00,,NA
2021-09-01,2001667621,9688637797,DROPOFF,2021-09-01T08:32:27-03:00,,NA
2021-09-01,QS2279965,9795162332,DROPOFF,2021-09-01T08:32:42-03:00,,NA
2021-09-01,2001636865,9899865813,OTP,2021-09-01T08:33:22-03:00,,NA
2021-09-01,2000122795,9324466982,OTP,2021-09-01T08:33:36-03:00,,NA
2021-09-01,2000785652,8179700301,OTP,2021-09-01T08:33:21-03:00,,NA
2021-09-01,2001465553,9481638126,DROPOFF,2021-09-01T08:32:52-03:00,,NA
2021-09-01,807411,9168691992,DROPOFF,2021-09-01T08:32:57-03:00,,NA
2021-09-01,2001620790,8590063826,ACCEPTED,2021-09-01T08:33:39-03:00,,NA
2021-09-01,2000612585,8660575862,OTP,2021-09-01T08:33:47-03:00,,NA
2021-09-01,2001635673,9903338777,OTP,2021-09-01T08:35:33-03:00,,NA
2021-09-01,2001623425,7698278397,OTP,2021-09-01T08:34:45-03:00,,NA
2021-09-01,806926,9643548850,DROPOFF,2021-09-01T08:33:06-03:00,,NA
2021-09-01,QS2261253,7411311052,OTP,2021-09-03T02:32:01-03:00,,NA
2021-09-01,QS2222181,7622062750,DROPOFF,2021-09-01T08:33:09-03:00,,NA
2021-09-01,2000768758,7625037161,OTP,2021-09-01T08:35:24-03:00,,NA
2021-09-01,QS2254223,7620574743,DROPOFF,2021-09-01T08:33:34-03:00,,NA
2021-09-01,2001718472,9714441747,OTP,2021-09-01T08:34:13-03:00,,NA
2021-09-01,2001069554,9685143314,OTP,2021-09-01T08:35:06-03:00,,NA
2021-09-01,2001634011,8018660120,OTP,2021-09-01T08:35:09-03:00,,NA
2021-09-01,2001284458,8309615548,OTP,2021-09-01T08:35:03-03:00,,NA
2021-09-01,2001634570,7004571848,OTP,2021-09-01T08:35:10-03:00,,NA
2021-09-01,2001658650,7794916509,OTP,2021-09-01T08:35:09-03:00,,NA
2021-09-01,2001774224,7014228470,DROPOFF,2021-09-01T08:34:28-03:00,,NA
2021-09-01,2001308143,9663888195,DROPOFF,2021-09-01T08:34:33-03:00,,NA
2021-09-01,2001106732,8840320188,OTP,2021-09-01T08:37:05-03:00,,NA
2021-09-01,2001418794,8722713378,OTP,2021-09-01T08:35:20-03:00,,NA
2021-09-01,2001770061,6372718547,DROPOFF,2021-09-01T08:34:39-03:00,,NA
2021-09-01,QS2287813,8722227088,DROPOFF,2021-09-01T08:34:40-03:00,,NA
2021-09-01,2001720469,9078376737,DROPOFF,2021-09-01T08:34:40-03:00,,NA
2021-09-01,2001559201,9900937986,OTP,2021-09-01T08:35:16-03:00,,NA
2021-09-01,2001468540,9052083693,WAITING_LIST,2021-09-01T08:35:56-03:00,,NA
2021-09-01,2001636272,9268330847,OTP,2021-09-01T08:35:55-03:00,,NA
2021-09-01,2001789680,8374222879,DROPOFF,2021-09-01T08:34:43-03:00,,NA
2021-09-01,2001664263,9821770667,DROPOFF,2021-09-01T08:34:43-03:00,,NA
2021-09-01,2001124448,9156121143,OTP,2021-09-01T08:35:24-03:00,,NA
2021-09-01,2001634430,9588892009,OTP,2021-09-01T08:36:38-03:00,,NA
2021-09-01,2001696552,7273958008,DROPOFF,2021-09-01T08:35:03-03:00,,NA
2021-09-01,2001632508,9035212270,DROPOFF,2021-09-01T08:35:14-03:00,,NA
2021-09-01,2001587703,9640461331,WAITING_LIST,2021-09-01T08:38:23-03:00,,NA
2021-09-01,2001019038,7301273012,DROPOFF,2021-09-01T08:35:21-03:00,,NA
2021-09-01,2001549603,9359723232,OTP,2021-09-01T08:36:03-03:00,,NA
2021-09-01,2001632611,7677657542,DROPOFF,2021-09-01T08:35:29-03:00,,NA
2021-09-01,2001602883,7987661998,DROPOFF,2021-09-01T08:35:30-03:00,,NA
2021-09-01,2001742867,9515335692,DROPOFF,2021-09-01T08:35:43-03:00,,NA
2021-09-01,2001666303,9514065585,DROPOFF,2021-09-01T08:35:44-03:00,,NA
2021-09-01,2001672025,9672818315,OTP,2021-09-01T08:38:28-03:00,,NA
2021-09-01,2001159595,8871488009,DROPOFF,2021-09-01T08:35:45-03:00,,NA
2021-09-01,2001395554,9843482834,DROPOFF,2021-09-01T08:35:48-03:00,,NA
2021-09-01,2001556589,9558221354,OTP,2021-09-01T08:37:02-03:00,,NA
2021-09-01,2001657790,7058760748,OTP,2021-09-01T08:37:08-03:00,,NA
2021-09-01,2001415149,8098719860,DROPOFF,2021-09-01T08:35:55-03:00,,NA
2021-09-01,2000757540,8484900910,OTP,2021-09-01T08:37:06-03:00,,NA
2021-09-01,2001637346,9975618782,ACCEPTED,2021-09-01T08:37:48-03:00,,NA
2021-09-01,2000139178,7411101104,OTP,2021-09-01T08:36:37-03:00,,NA
2021-09-01,2000911948,7984072881,OTP,2021-09-01T08:36:52-03:00,,NA
2021-09-01,2001268169,8180040756,DROPOFF,2021-09-01T08:36:07-03:00,,NA
2021-09-01,2001666895,7017221941,DROPOFF,2021-09-01T08:36:09-03:00,,NA
2021-09-01,2000512758,8147315159,OTP,2021-09-01T08:36:41-03:00,,NA
2021-09-01,2001463886,8660888748,WAITING_LIST,2021-09-01T08:36:53-03:00,,NA
2021-09-01,2000857788,9980463839,DROPOFF,2021-09-01T08:36:18-03:00,,NA
2021-09-01,2001622390,8602802786,OTP,2021-09-01T08:37:09-03:00,,NA
2021-09-01,2000497049,8128202278,OTP,2021-09-01T08:36:52-03:00,,NA
2021-09-01,QS2263555,9901169957,DROPOFF,2021-09-01T08:36:23-03:00,,NA
2021-09-01,2001059167,7744800975,DROPOFF,2021-09-01T08:36:24-03:00,,NA
2021-09-01,2001636037,8054209879,DROPOFF,2021-09-01T08:36:25-03:00,,NA
2021-09-01,2001769634,9705446882,DROPOFF,2021-09-01T08:36:26-03:00,,NA
2021-09-01,2000757330,9082771191,OTP,2021-09-01T08:37:33-03:00,,NA
2021-09-01,2001792596,9550796912,DROPOFF,2021-09-01T08:36:31-03:00,,NA
2021-09-01,2000511253,9778515180,OTP,2021-09-01T08:37:08-03:00,,NA
2021-09-01,2001706720,9514141172,DROPOFF,2021-09-01T08:36:45-03:00,,NA
2021-09-01,2000665754,9885927680,OTP,2021-09-01T08:37:22-03:00,,NA
2021-09-01,2001787996,8186848470,DROPOFF,2021-09-01T08:36:56-03:00,,NA
2021-09-01,QS2160144,9755448210,DROPOFF,2021-09-01T08:36:57-03:00,,NA
2021-09-01,QS2251746,9766893246,DROPOFF,2021-09-01T08:36:57-03:00,,NA
2021-09-01,2001229183,7383239704,WAITING_LIST,2021-09-01T08:37:51-03:00,,NA
2021-09-01,2000139078,9655664404,DROPOFF,2021-09-01T08:37:01-03:00,,NA
2021-09-01,2001800357,9588961092,DROPOFF,2021-09-01T08:37:03-03:00,,NA
2021-09-01,2000716746,8409647718,DROPOFF,2021-09-01T08:37:16-03:00,,NA
2021-09-01,2001094894,8291171053,ACCEPTED,2021-09-01T08:38:41-03:00,,NA
2021-09-01,2000704147,8742927612,DROPOFF,2021-09-01T08:37:20-03:00,,NA
2021-09-01,2001583948,7209387517,OTP,2021-09-01T08:37:49-03:00,,NA
2021-09-01,2001553473,7259548061,DROPOFF,2021-09-01T08:37:35-03:00,,NA
2021-09-01,QS2263121,9653400664,DROPOFF,2021-09-01T08:37:38-03:00,,NA
2021-09-01,DE804,9667760520,DROPOFF,2021-09-01T08:37:44-03:00,,NA
2021-09-01,2001635119,9204642098,DROPOFF,2021-09-01T08:37:47-03:00,,NA
2021-09-01,2001648977,9742270663,OTP,2021-09-01T08:38:49-03:00,,NA
2021-09-01,2001038416,7021971475,OTP,2021-09-01T08:38:21-03:00,,NA
2021-09-01,2001071146,9427406265,DROPOFF,2021-09-01T08:37:57-03:00,,NA
2021-09-01,2001010301,7411890474,DROPOFF,2021-09-01T08:38:02-03:00,,NA
2021-09-01,2001701769,8858846011,DROPOFF,2021-09-01T08:38:10-03:00,,NA
2021-09-01,2001672026,9754482000,OTP,2021-09-01T08:38:41-03:00,,NA
2021-09-01,10013897,8688818666,DROPOFF,2021-09-01T08:38:16-03:00,,NA
2021-09-01,2001229830,9059872883,DROPOFF,2021-09-01T08:38:18-03:00,,NA
2021-09-01,2001599892,9897989086,DROPOFF,2021-09-01T08:38:19-03:00,,NA
2021-09-01,KF384,9632982093,DROPOFF,2021-09-01T08:38:25-03:00,,NA
2021-09-01,2001785754,7978661584,DROPOFF,2021-09-01T08:38:25-03:00,,NA
2021-09-01,2001635967,7021037653,DROPOFF,2021-09-01T08:38:45-03:00,,NA
2021-09-01,2001775857,8083710429,DROPOFF,2021-09-01T08:38:46-03:00,,NA
2021-09-01,759798,8123885033,DROPOFF,2021-09-01T08:39:01-03:00,,NA
2021-09-01,QS2219517,9884583636,DROPOFF,2021-09-01T08:39:08-03:00,,NA
2021-09-01,2001696596,9626633989,OTP,2021-09-01T08:40:08-03:00,,NA
2021-09-01,2000172545,9962225228,DROPOFF,2021-09-01T08:39:24-03:00,,NA
2021-09-01,2001369376,9871229166,DROPOFF,2021-09-01T08:39:36-03:00,,NA
2021-09-01,2001694864,8940416732,DROPOFF,2021-09-01T08:39:42-03:00,,NA
2021-09-01,2001635970,9831789998,OTP,2021-09-01T08:41:11-03:00,,NA
2021-09-01,QS2268803,9985292938,DROPOFF,2021-09-01T08:39:48-03:00,,NA
2021-09-01,T-16022,9705493601,DROPOFF,2021-09-01T08:39:49-03:00,,NA
2021-09-01,T-15469,8861621070,DROPOFF,2021-09-01T08:39:50-03:00,,NA
2021-09-01,QS2140039,8919436199,DROPOFF,2021-09-01T08:39:50-03:00,,NA
2021-09-01,QS2277647,9902401009,DROPOFF,2021-09-01T08:40:13-03:00,,NA
2021-09-01,QS2268807,9177797435,DROPOFF,2021-09-01T08:40:25-03:00,,NA
2021-09-01,QS2284496,8939659773,DROPOFF,2021-09-01T08:40:29-03:00,,NA
2021-09-01,QS2241476,9589556118,DROPOFF,2021-09-01T08:40:37-03:00,,NA
2021-09-01,2001023856,9894274946,OTP,2021-09-01T08:41:20-03:00,,NA
2021-09-01,2001701996,9559598232,DROPOFF,2021-09-01T08:40:44-03:00,,NA
2021-09-01,2001401671,9987336701,DROPOFF,2021-09-01T08:40:45-03:00,,NA
2021-09-01,QS2281914,9480632022,DROPOFF,2021-09-01T08:40:45-03:00,,NA
2021-09-01,QS2282837,7904323423,DROPOFF,2021-09-01T08:40:52-03:00,,NA
2021-09-01,2001705146,7504170520,CREATED,2021-09-01T08:41:06-03:00,,NA
2021-09-01,2000786657,7729939783,DROPOFF,2021-09-01T08:40:56-03:00,,NA
2021-09-01,2000140488,9945049786,OTP,2021-09-01T08:41:42-03:00,,NA
2021-09-01,2001548486,7507898323,OTP,2021-09-01T08:41:56-03:00,,NA
2021-09-01,2001701622,8698338306,WAITING_LIST,2021-09-01T08:42:18-03:00,,NA
2021-09-01,2001539847,9164556414,DROPOFF,2021-09-01T08:41:11-03:00,,NA
2021-09-01,QS2239751,7036471654,DROPOFF,2021-09-01T08:41:20-03:00,,NA
2021-09-01,2000511154,9953686638,DROPOFF,2021-09-01T08:41:28-03:00,,NA
2021-09-01,2001724177,8825595915,OTP,2021-09-01T08:42:12-03:00,,NA
2021-09-01,2001719875,9567341542,OTP,2021-09-01T08:43:10-03:00,,NA
2021-09-01,2000125729,9163359398,DROPOFF,2021-09-01T08:41:43-03:00,,NA
2021-09-01,2001755885,9834425845,DROPOFF,2021-09-01T08:42:22-03:00,,NA
2021-09-01,2001650565,9789797997,OTP,2021-09-01T08:43:10-03:00,,NA
2021-09-01,2001457276,7078525151,DROPOFF,2021-09-01T08:42:31-03:00,,NA
2021-09-01,MI258,6282626380,DROPOFF,2021-09-01T08:42:34-03:00,,NA
2021-09-01,2001490482,9398286313,OTP,2021-09-01T08:43:12-03:00,,NA
2021-09-01,2001701631,9822488347,ACCEPTED,2021-09-01T08:43:49-03:00,,NA
2021-09-01,2001783413,8417852106,DROPOFF,2021-09-01T08:42:43-03:00,,NA
2021-09-01,2001449291,8689878425,DROPOFF,2021-09-01T08:42:45-03:00,,NA
2021-09-01,2001735178,9064597403,DROPOFF,2021-09-01T08:42:45-03:00,,NA
2021-09-01,2001235182,9800871871,ACCEPTED,2021-09-01T08:43:19-03:00,,NA
2021-09-01,2001550446,7049786843,DROPOFF,2021-09-01T08:42:50-03:00,,NA
2021-09-01,2001058545,8746966176,OTP,2021-09-01T08:53:26-03:00,,NA
2021-09-01,2001747236,7769041213,OTP,2021-09-01T08:43:28-03:00,,NA
2021-09-01,2001588406,9010900789,DROPOFF,2021-09-01T08:42:56-03:00,,NA
2021-09-01,2001200412,9883276787,DROPOFF,2021-09-01T08:42:57-03:00,,NA
2021-09-01,2001625645,8106318852,DROPOFF,2021-09-01T08:43:02-03:00,,NA
2021-09-01,2001634819,8299011344,OTP,2021-09-01T08:44:20-03:00,,NA
2021-09-01,2001788069,7043597817,DROPOFF,2021-09-01T08:43:07-03:00,,NA
2021-09-01,QS2225797,9123868741,DROPOFF,2021-09-01T08:43:08-03:00,,NA
2021-09-01,QS2281897,7568574704,DROPOFF,2021-09-01T08:43:09-03:00,,NA
2021-09-01,QS2262311,6265475437,DROPOFF,2021-09-01T08:43:24-03:00,,NA
2021-09-01,2001090702,9867250927,DROPOFF,2021-09-01T08:43:28-03:00,,NA
2021-09-01,QS2291767,9503235658,DROPOFF,2021-09-01T08:43:34-03:00,,NA
2021-09-01,2000989527,7218473386,OTP,2021-09-01T08:44:53-03:00,,NA
2021-09-01,2000680348,9870266520,DROPOFF,2021-09-01T08:43:46-03:00,,NA
2021-09-01,QS2268917,9000048242,DROPOFF,2021-09-01T08:43:56-03:00,,NA
2021-09-01,2001691521,9914851604,DROPOFF,2021-09-01T08:43:57-03:00,,NA
2021-09-01,QS2274785,9975316635,DROPOFF,2021-09-01T08:44:01-03:00,,NA
2021-09-01,2000232866,9886887478,DROPOFF,2021-09-01T08:44:01-03:00,,NA
2021-09-01,2000931266,8506023116,DROPOFF,2021-09-01T08:44:01-03:00,,NA
2021-09-01,2001647166,7404353001,OTP,2021-09-01T08:44:38-03:00,,NA
2021-09-01,2001761691,8179093102,OTP,2021-09-01T08:45:01-03:00,,NA
2021-09-01,2001771756,7017665440,DROPOFF,2021-09-01T08:44:06-03:00,,NA
2021-09-01,2001593323,7826963145,DROPOFF,2021-09-01T08:44:08-03:00,,NA
2021-09-01,QS2255292,7972900226,DROPOFF,2021-09-01T08:44:10-03:00,,NA
2021-09-01,2001487581,9841530471,DROPOFF,2021-09-01T08:44:10-03:00,,NA
2021-09-01,2001385149,9982988989,DROPOFF,2021-09-01T08:44:11-03:00,,NA
2021-09-01,2001480784,9797504177,DROPOFF,2021-09-01T08:44:12-03:00,,NA
2021-09-01,2001650566,9928234260,DROPOFF,2021-09-01T08:44:15-03:00,,NA
2021-09-01,QS2239916,9535428022,DROPOFF,2021-09-01T08:44:18-03:00,,NA
2021-09-01,2000231133,9916320128,DROPOFF,2021-09-01T08:44:18-03:00,,NA
2021-09-01,QS2261379,8790621556,DROPOFF,2021-09-01T08:44:25-03:00,,NA
2021-09-01,2001280818,9871913716,DROPOFF,2021-09-01T08:44:27-03:00,,NA
2021-09-01,2001634776,7070966301,OTP,2021-09-01T08:45:53-03:00,,NA
2021-09-01,2001518472,8840316276,OTP,2021-09-01T08:45:05-03:00,,NA
2021-09-01,2001173167,9949214343,DROPOFF,2021-09-01T08:44:45-03:00,,NA
2021-09-01,2001162678,8076739372,DROPOFF,2021-09-01T08:44:47-03:00,,NA
2021-09-01,2001285525,9976279791,DROPOFF,2021-09-01T08:44:49-03:00,,NA
2021-09-01,QS2241221,9503122440,DROPOFF,2021-09-01T08:44:57-03:00,,NA
2021-09-01,2001697639,9419194679,DROPOFF,2021-09-01T08:44:58-03:00,,NA
2021-09-01,2001440816,9601000997,DROPOFF,2021-09-01T08:45:00-03:00,,NA
2021-09-01,2000734526,8436136361,OTP,2021-09-01T08:46:44-03:00,,NA
2021-09-01,QS2243081,8217816355,DROPOFF,2021-09-01T08:45:25-03:00,,NA
2021-09-01,2001108515,9746525263,OTP,2021-09-01T08:46:24-03:00,,NA
2021-09-01,QS2275161,7986140852,DROPOFF,2021-09-01T08:45:26-03:00,,NA
2021-09-01,QS2213084,9900137584,DROPOFF,2021-09-01T08:45:27-03:00,,NA
2021-09-01,QS2281870,9035132893,DROPOFF,2021-09-01T08:45:29-03:00,,NA
2021-09-01,QS2275172,9620185832,DROPOFF,2021-09-01T08:45:30-03:00,,NA
2021-09-01,2001567352,8870068632,DROPOFF,2021-09-01T08:45:30-03:00,,NA
2021-09-01,2001650576,9060430743,DROPOFF,2021-09-01T08:45:30-03:00,,NA
2021-09-01,QS2276418,8169002349,DROPOFF,2021-09-01T08:45:31-03:00,,NA
2021-09-01,2001438332,9836345537,OTP,2021-09-01T09:55:26-03:00,,NA
2021-09-01,QS2212678,9599573910,DROPOFF,2021-09-01T08:45:37-03:00,,NA
2021-09-01,2001766665,9148980613,OTP,2021-09-01T08:46:22-03:00,,NA
2021-09-01,2001665529,9720550588,DROPOFF,2021-09-01T08:45:41-03:00,,NA
2021-09-01,2001677216,6001374638,DROPOFF,2021-09-01T08:45:42-03:00,,NA
2021-09-01,QS2283870,8122525704,DROPOFF,2021-09-01T08:45:42-03:00,,NA
2021-09-01,QS2265127,9867363743,DROPOFF,2021-09-01T08:45:42-03:00,,NA
2021-09-01,2001783913,9581153732,DROPOFF,2021-09-01T08:45:45-03:00,,NA
2021-09-01,2001737770,9977911148,DROPOFF,2021-09-01T08:45:47-03:00,,NA
2021-09-01,QS2284060,8565900090,DROPOFF,2021-09-01T08:45:50-03:00,,NA
2021-09-01,2001733291,8602409164,DROPOFF,2021-09-01T08:45:51-03:00,,NA
2021-09-01,PC973,9964903838,DROPOFF,2021-09-01T08:45:54-03:00,,NA
2021-09-01,QS2234115,7747880908,DROPOFF,2021-09-01T08:45:58-03:00,,NA
2021-09-01,2001468731,9207322916,DROPOFF,2021-09-01T08:45:59-03:00,,NA
2021-09-01,2001283423,6303640770,OTP,2021-09-01T08:46:21-03:00,,NA
2021-09-01,QS2258402,7526839857,DROPOFF,2021-09-01T08:46:01-03:00,,NA
2021-09-01,2001785351,9550135225,DROPOFF,2021-09-01T08:46:01-03:00,,NA
2021-09-01,2000838968,7880249003,DROPOFF,2021-09-01T08:46:01-03:00,,NA
2021-09-01,2001527213,7569412136,DROPOFF,2021-09-01T08:46:01-03:00,,NA
2021-09-01,2001634698,7278738603,DROPOFF,2021-09-01T08:46:03-03:00,,NA
2021-09-01,QS2266282,7674036151,DROPOFF,2021-09-01T08:46:03-03:00,,NA
2021-09-01,2001355282,8273299051,OTP,2021-09-01T08:46:54-03:00,,NA
2021-09-01,2000756310,8879957915,DROPOFF,2021-09-01T08:46:07-03:00,,NA
2021-09-01,2001690354,9028283123,OTP,2021-09-01T08:47:06-03:00,,NA
2021-09-01,QS2262532,7207735160,DROPOFF,2021-09-01T08:46:10-03:00,,NA
2021-09-01,2001652599,9963568212,CREATED,2021-09-01T08:46:49-03:00,,NA
2021-09-01,2001557627,8058231327,DROPOFF,2021-09-01T08:46:13-03:00,,NA
2021-09-01,2001466178,7008309936,OTP,2021-09-01T08:47:29-03:00,,NA
2021-09-01,QS2275259,8617431700,DROPOFF,2021-09-01T08:46:14-03:00,,NA
2021-09-01,2001637077,9759151079,OTP,2021-09-01T08:49:49-03:00,,NA
2021-09-01,2001791020,8320607454,DROPOFF,2021-09-01T08:46:18-03:00,,NA
2021-09-01,2001587628,7400777407,OTP,2021-09-01T08:47:37-03:00,,NA
2021-09-01,2000749226,9743849868,OTP,2021-09-01T08:46:51-03:00,,NA
2021-09-01,2001691752,9968368827,OTP,2021-09-01T08:47:29-03:00,,NA
2021-09-01,2000104086,9774293436,OTP,2021-09-01T11:40:11-03:00,,NA
2021-09-01,2001751939,7204897371,DROPOFF,2021-09-01T08:46:31-03:00,,NA
2021-09-01,2001280890,8218651678,DROPOFF,2021-09-01T08:46:38-03:00,,NA
2021-09-01,2001608187,9992744049,OTP,2021-09-01T08:47:17-03:00,,NA
2021-09-01,2001010127,9205390563,OTP,2021-09-01T08:47:41-03:00,,NA
2021-09-01,2001791780,6360658493,DROPOFF,2021-09-01T08:46:44-03:00,,NA
2021-09-01,2000779548,8595552473,OTP,2021-09-01T08:47:27-03:00,,NA
2021-09-01,2000779880,9899391818,DROPOFF,2021-09-01T08:46:59-03:00,,NA
2021-09-01,2001608370,9670260920,DROPOFF,2021-09-01T08:47:02-03:00,,NA
2021-09-01,2000990402,9042040506,OTP,2021-09-01T08:47:42-03:00,,NA
2021-09-01,2001296061,9850556610,DROPOFF,2021-09-01T08:47:09-03:00,,NA
2021-09-01,2001572412,8409389899,OTP,2021-09-01T08:47:36-03:00,,NA
2021-09-01,QS2280613,9044751570,DROPOFF,2021-09-01T08:47:10-03:00,,NA
2021-09-01,QS2276789,7668922369,DROPOFF,2021-09-01T08:47:11-03:00,,NA
2021-09-01,2001345275,8806649569,DROPOFF,2021-09-01T08:47:14-03:00,,NA
2021-09-01,2001812974,9816152761,DROPOFF,2021-09-01T08:47:16-03:00,,NA
2021-09-01,2001791292,9052568330,DROPOFF,2021-09-01T08:47:30-03:00,,NA
2021-09-01,2000175935,8423269899,DROPOFF,2021-09-01T08:47:38-03:00,,NA
2021-09-01,2001774191,7995974907,DROPOFF,2021-09-01T08:47:49-03:00,,NA
2021-09-01,QS2234701,7982488768,DROPOFF,2021-09-01T08:47:59-03:00,,NA
2021-09-01,2001768087,9166938866,DROPOFF,2021-09-01T08:48:04-03:00,,NA
2021-09-01,2001652598,7675919270,OTP,2021-09-01T08:56:04-03:00,,NA
2021-09-01,2000768267,7208132881,DROPOFF,2021-09-01T08:48:15-03:00,,NA
2021-09-01,2001601224,9632500854,DROPOFF,2021-09-01T08:48:16-03:00,,NA
2021-09-01,2001559289,8765191838,DROPOFF,2021-09-01T08:48:16-03:00,,NA
2021-09-01,2001531503,9724978489,DROPOFF,2021-09-01T08:48:33-03:00,,NA
2021-09-01,QS2261521,8286034388,DROPOFF,2021-09-01T08:48:40-03:00,,NA
2021-09-01,2001311448,6392191483,OTP,2021-09-01T08:49:18-03:00,,NA
2021-09-01,CB437,9348855626,DROPOFF,2021-09-01T08:48:42-03:00,,NA
2021-09-01,2000922546,9356119336,DROPOFF,2021-09-01T08:48:44-03:00,,NA
2021-09-01,2001068052,7838034675,OTP,2021-09-01T08:49:58-03:00,,NA
2021-09-01,2001308303,9953856389,DROPOFF,2021-09-01T08:48:46-03:00,,NA
2021-09-01,QS2242587,8591680822,DROPOFF,2021-09-01T08:48:47-03:00,,NA
2021-09-01,2001446235,8700825071,DROPOFF,2021-09-01T08:48:47-03:00,,NA
2021-09-01,2001728409,8287272990,DROPOFF,2021-09-01T08:49:03-03:00,,NA
2021-09-01,2001488732,9995357537,DROPOFF,2021-09-01T08:49:07-03:00,,NA
2021-09-01,2001666730,8287594001,DROPOFF,2021-09-01T08:49:13-03:00,,NA
2021-09-01,2001347232,7908337174,OTP,2021-09-01T08:49:41-03:00,,NA
2021-09-01,2001624122,8928143094,DROPOFF,2021-09-01T08:49:14-03:00,,NA
2021-09-01,SS671,8848461778,DROPOFF,2021-09-01T08:49:45-03:00,,NA
2021-09-01,QS2279959,9100152497,DROPOFF,2021-09-01T08:49:53-03:00,,NA
2021-09-01,QS2270868,8461993367,DROPOFF,2021-09-01T08:49:55-03:00,,NA
2021-09-01,2001491211,9112707554,DROPOFF,2021-09-01T08:49:57-03:00,,NA
2021-09-01,2000735410,9789771165,OTP,2021-09-01T08:50:59-03:00,,NA
2021-09-01,2001446542,8976266342,OTP,2021-09-01T08:51:27-03:00,,NA
2021-09-01,2001672329,9814927930,OTP,2021-09-01T08:51:15-03:00,,NA
2021-09-01,2001635826,8879975598,CREATED,2021-09-01T08:50:56-03:00,,NA
2021-09-01,2001749664,7985832821,DROPOFF,2021-09-01T08:50:43-03:00,,NA
2021-09-01,2001695308,7569082903,DROPOFF,2021-09-01T08:50:45-03:00,,NA
2021-09-01,2001250416,6261937260,DROPOFF,2021-09-01T08:50:58-03:00,,NA
2021-09-01,2001703763,9300244667,DROPOFF,2021-09-01T08:50:58-03:00,,NA
2021-09-01,QS2287712,9310210209,DROPOFF,2021-09-01T08:51:10-03:00,,NA
2021-09-01,2001710115,9717933912,DROPOFF,2021-09-01T08:51:11-03:00,,NA
2021-09-01,2000599381,8999927451,OTP,2021-09-01T08:55:30-03:00,,NA
2021-09-01,GB105,9741401643,DROPOFF,2021-09-01T08:51:13-03:00,,NA
2021-09-01,2001701121,8511825045,DROPOFF,2021-09-01T08:51:19-03:00,,NA
2021-09-01,QS2257371,9567428690,DROPOFF,2021-09-01T08:51:31-03:00,,NA
2021-09-01,2001449288,9769008761,DROPOFF,2021-09-01T08:51:43-03:00,,NA
2021-09-01,2001747285,7608044569,DROPOFF,2021-09-01T08:51:43-03:00,,NA
2021-09-01,2001791829,9148625084,DROPOFF,2021-09-01T08:51:45-03:00,,NA
2021-09-01,2001638474,9847764443,DROPOFF,2021-09-01T08:51:52-03:00,,NA
2021-09-01,2001783439,7290984948,DROPOFF,2021-09-01T08:51:54-03:00,,NA
2021-09-01,2001751877,8687766677,OTP,2021-09-01T08:52:57-03:00,,NA
2021-09-01,QS2219085,6353791698,DROPOFF,2021-09-01T08:52:12-03:00,,NA
2021-09-01,QS2269925,8936030475,DROPOFF,2021-09-01T08:52:20-03:00,,NA
2021-09-01,2001699617,9686285240,DROPOFF,2021-09-01T08:52:28-03:00,,NA
2021-09-01,2001231786,9711844731,OTP,2021-09-01T08:53:10-03:00,,NA
2021-09-01,QS2257329,9010111497,DROPOFF,2021-09-01T08:52:48-03:00,,NA
2021-09-01,QS2217805,6299875142,DROPOFF,2021-09-01T08:53:04-03:00,,NA
2021-09-01,2001628402,7304440040,DROPOFF,2021-09-01T08:53:06-03:00,,NA
2021-09-01,2000911198,9948369636,DROPOFF,2021-09-01T08:53:06-03:00,,NA
2021-09-01,2001784103,9758567454,DROPOFF,2021-09-01T08:53:09-03:00,,NA
2021-09-01,8882068478,8882068478,DROPOFF,2021-09-01T08:53:10-03:00,,NA
2021-09-01,2001596635,7022308155,DROPOFF,2021-09-01T08:53:14-03:00,,NA
2021-09-01,2001417376,7994301209,OTP,2021-09-01T08:55:46-03:00,,NA
2021-09-01,2001664544,8957512211,OTP,2021-09-01T08:54:02-03:00,,NA
2021-09-01,2001515715,7024382661,OTP,2021-09-01T08:54:19-03:00,,NA
2021-09-01,2001621781,8012331584,DROPOFF,2021-09-01T08:53:35-03:00,,NA
2021-09-01,2001693665,7010068857,OTP,2021-09-01T08:54:03-03:00,,NA
2021-09-01,2001324411,7448251918,DROPOFF,2021-09-01T08:53:53-03:00,,NA
2021-09-01,2001527685,7676424962,OTP,2021-09-01T08:54:29-03:00,,NA
2021-09-01,807496,9698443367,DROPOFF,2021-09-01T08:54:02-03:00,,NA
2021-09-01,2001756279,7089408012,DROPOFF,2021-09-01T08:54:12-03:00,,NA
2021-09-01,2001665292,9006607262,DROPOFF,2021-09-01T08:54:39-03:00,,NA
2021-09-01,2001470621,6383179198,OTP,2021-09-01T08:55:08-03:00,,NA
2021-09-01,QS2263407,8448375401,DROPOFF,2021-09-01T08:54:57-03:00,,NA
2021-09-01,2001768537,8657727709,OTP,2021-09-01T08:56:35-03:00,,NA
2021-09-01,2001218171,7870027694,DROPOFF,2021-09-01T08:55:35-03:00,,NA
2021-09-01,2001648842,7277550048,ACCEPTED,2021-09-01T08:57:02-03:00,,NA
2021-09-01,QS2235720,7696214364,DROPOFF,2021-09-01T08:56:05-03:00,,NA
2021-09-01,2001523381,9074408846,DROPOFF,2021-09-01T08:56:25-03:00,,NA
2021-09-01,2001671955,9619041194,OTP,2021-09-01T08:58:00-03:00,,NA
2021-09-01,QS2254345,9620639862,DROPOFF,2021-09-01T08:56:44-03:00,,NA
2021-09-01,2001769452,9016889242,DROPOFF,2021-09-01T08:56:48-03:00,,NA
2021-09-01,2001466789,9130202558,OTP,2021-09-01T08:57:36-03:00,,NA
2021-09-01,2001677895,8248517472,DROPOFF,2021-09-01T08:57:10-03:00,,NA
2021-09-01,2001768150,6263003694,DROPOFF,2021-09-01T08:57:14-03:00,,NA
2021-09-01,2001628413,9909013143,DROPOFF,2021-09-01T08:57:32-03:00,,NA
2021-09-01,2001603603,8261938812,OTP,2021-09-01T08:59:45-03:00,,NA
2021-09-01,2001230746,7306070007,DROPOFF,2021-09-01T08:57:56-03:00,,NA
2021-09-01,QS2219709,9710693314,DROPOFF,2021-09-01T08:58:29-03:00,,NA
2021-09-01,2001572147,9581387696,DROPOFF,2021-09-01T08:58:42-03:00,,NA
2021-09-01,2001782938,9905436188,DROPOFF,2021-09-01T08:58:45-03:00,,NA
2021-09-01,2001699092,7680026227,OTP,2021-09-01T08:59:41-03:00,,NA
2021-09-01,2001508203,7993351561,DROPOFF,2021-09-01T08:59:03-03:00,,NA
2021-09-01,2001743668,9584276432,OTP,2021-09-01T09:00:52-03:00,,NA
2021-09-01,2001709054,9095926716,OTP,2021-09-01T09:01:22-03:00,,NA
2021-09-01,PG636,9731243811,DROPOFF,2021-09-01T09:00:36-03:00,,NA
2021-09-01,2001462242,9754386663,DROPOFF,2021-09-01T09:00:51-03:00,,NA
2021-09-01,2001636456,9830871320,DROPOFF,2021-09-01T09:01:00-03:00,,NA
2021-09-01,2001645480,9902194335,ACCEPTED,2021-09-01T09:01:50-03:00,,NA
2021-09-01,2001613854,9309834705,DROPOFF,2021-09-01T09:01:21-03:00,,NA
2021-09-01,2000230163,8744865725,DROPOFF,2021-09-01T09:01:46-03:00,,NA
2021-09-01,2001742657,7060866513,OTP,2021-09-01T09:03:42-03:00,,NA
2021-09-01,2001743439,7780358654,DROPOFF,2021-09-01T09:02:22-03:00,,NA
2021-09-01,2001651790,7047211581,DROPOFF,2021-09-01T09:02:49-03:00,,NA
2021-09-01,2001614024,7356142757,ACCEPTED,2021-09-01T09:03:51-03:00,,NA
2021-09-01,2001359671,9848961567,DROPOFF,2021-09-01T09:03:10-03:00,,NA
2021-09-01,2001633675,7982714007,DROPOFF,2021-09-01T09:03:37-03:00,,NA
2021-09-01,QS2257175,9080663738,DROPOFF,2021-09-01T09:04:10-03:00,,NA
2021-09-01,2001163075,9022638980,DROPOFF,2021-09-01T09:04:19-03:00,,NA
2021-09-01,2001576455,9972799958,DROPOFF,2021-09-01T09:04:22-03:00,,NA
2021-09-01,2000976371,8652007442,DROPOFF,2021-09-01T09:04:22-03:00,,NA
2021-09-01,QS2287685,8588949429,DROPOFF,2021-09-01T09:04:53-03:00,,NA
2021-09-01,QS2277314,9881857562,DROPOFF,2021-09-01T09:05:08-03:00,,NA
2021-09-01,2001719147,6376043946,CREATED,2021-09-01T09:06:34-03:00,,NA
2021-09-01,2001635995,9457421085,OTP,2021-09-01T09:07:22-03:00,,NA
2021-09-01,2001727600,7286000531,OTP,2021-09-01T09:08:10-03:00,,NA
2021-09-01,QS2259431,9866404118,DROPOFF,2021-09-01T09:06:20-03:00,,NA
2021-09-01,2001572496,7697603613,DROPOFF,2021-09-01T09:06:37-03:00,,NA
2021-09-01,2001576486,9677056340,OTP,2021-09-01T09:07:38-03:00,,NA
2021-09-01,QS2204942,9985394948,DROPOFF,2021-09-01T09:07:09-03:00,,NA
2021-09-01,2001634965,8100122055,CREATED,2021-09-01T09:08:02-03:00,,NA
2021-09-01,2001666351,9093964803,OTP,2021-09-01T09:08:30-03:00,,NA
2021-09-01,2001690176,9583183929,OTP,2021-09-01T09:08:45-03:00,,NA
2021-09-01,2001713816,7470446951,OTP,2021-09-01T09:10:15-03:00,,NA
2021-09-01,QS2248861,6302234571,DROPOFF,2021-09-01T09:09:12-03:00,,NA
2021-09-01,2001727366,9958233576,OTP,2021-09-01T09:09:59-03:00,,NA
2021-09-01,2001785382,8055145058,DROPOFF,2021-09-01T09:09:40-03:00,,NA
2021-09-01,2001620657,7060366683,OTP,2021-09-01T09:13:47-03:00,,NA
2021-09-01,2001633951,8171061600,DROPOFF,2021-09-01T09:11:20-03:00,,NA
2021-09-01,QS2287821,8077889209,DROPOFF,2021-09-01T09:11:46-03:00,,NA
2021-09-01,2001632721,9307825464,DROPOFF,2021-09-01T09:12:02-03:00,,NA
2021-09-01,2001282051,9884400448,ACCEPTED,2021-09-01T09:13:23-03:00,,NA
2021-09-01,2001107004,8608094304,CREATED,2021-09-01T09:13:42-03:00,,NA
2021-09-01,2001620567,8877614900,OTP,2021-09-01T09:14:44-03:00,,NA
2021-09-01,QS2271988,9951248786,DROPOFF,2021-09-01T09:14:11-03:00,,NA
2021-09-01,2001526297,9573366466,OTP,2021-09-01T09:15:23-03:00,,NA
2021-09-01,2001586406,9751024706,OTP,2021-09-01T09:15:50-03:00,,NA
2021-09-01,2001347646,9607684865,DROPOFF,2021-09-01T09:14:35-03:00,,NA
2021-09-01,2001507502,8401179341,DROPOFF,2021-09-01T09:14:48-03:00,,NA
2021-09-01,QS2285491,8341777237,DROPOFF,2021-09-01T09:14:50-03:00,,NA
2021-09-01,2001544190,7624847187,DROPOFF,2021-09-01T09:15:00-03:00,,NA
2021-09-01,2001721082,9607848154,DROPOFF,2021-09-01T09:15:10-03:00,,NA
2021-09-01,2001665640,7011062277,CREATED,2021-09-01T09:16:12-03:00,,NA
2021-09-01,350996,9822780541,DROPOFF,2021-09-01T09:15:36-03:00,,NA
2021-09-01,2001703823,9554369072,DROPOFF,2021-09-01T09:15:37-03:00,,NA
2021-09-01,2001194647,9964390317,DROPOFF,2021-09-01T09:16:06-03:00,,NA
2021-09-01,QS2235007,8880039119,DROPOFF,2021-09-01T09:16:16-03:00,,NA
2021-09-01,2001526105,9908351300,DROPOFF,2021-09-01T09:16:34-03:00,,NA
2021-09-01,2001720411,8578867227,OTP,2021-09-01T09:19:50-03:00,,NA
2021-09-01,SD494,7204629505,DROPOFF,2021-09-01T09:16:58-03:00,,NA
2021-09-01,JC105,8548005606,DROPOFF,2021-09-01T09:17:07-03:00,,NA
2021-09-01,2001327480,9892667193,DROPOFF,2021-09-01T09:17:32-03:00,,NA
2021-09-01,2000535620,9321673341,DROPOFF,2021-09-01T09:17:59-03:00,,NA
2021-09-01,2000157413,7403218207,DROPOFF,2021-09-01T09:19:12-03:00,,NA
2021-09-01,2001585117,9721355854,DROPOFF,2021-09-01T09:19:46-03:00,,NA
2021-09-01,792636,9325973130,OTP,2021-09-01T09:20:29-03:00,,NA
2021-09-01,2001769023,7750844341,DROPOFF,2021-09-01T09:21:14-03:00,,NA
2021-09-01,2001750738,7667406868,DROPOFF,2021-09-01T09:22:19-03:00,,NA
2021-09-01,2001591182,9986863792,CREATED,2021-09-01T09:25:38-03:00,,NA
2021-09-01,2001157630,9702678232,OTP,2021-09-01T09:32:38-03:00,,NA
2021-09-01,2001757417,9352367510,DROPOFF,2021-09-01T09:27:08-03:00,,NA
2021-09-01,QS2277218,9804172045,DROPOFF,2021-09-01T09:27:53-03:00,,NA
2021-09-01,2001307900,7652097550,DROPOFF,2021-09-01T09:28:10-03:00,,NA
2021-09-01,2001115908,7654146061,DROPOFF,2021-09-01T09:28:41-03:00,,NA
2021-09-01,2001769311,8826525201,DROPOFF,2021-09-01T09:29:03-03:00,,NA
2021-09-01,2000781176,8248222967,OTP,2021-09-01T09:30:56-03:00,,NA
2021-09-01,2001757493,9971715377,CREATED,2021-09-01T09:31:16-03:00,,NA
2021-09-01,778925,9043345904,OTP,2021-09-01T09:32:47-03:00,,NA
2021-09-01,QS2276149,6382576787,DROPOFF,2021-09-01T09:33:11-03:00,,NA
2021-09-01,QS2254758,8367311906,DROPOFF,2021-09-01T09:33:42-03:00,,NA
2021-09-01,2000838157,8096252999,DROPOFF,2021-09-01T09:33:52-03:00,,NA
2021-09-01,2000763780,9892555812,DROPOFF,2021-09-01T09:33:53-03:00,,NA
2021-09-01,QS2255180,9731716694,DROPOFF,2021-09-01T09:35:10-03:00,,NA
2021-09-01,2001732693,9179407184,DROPOFF,2021-09-01T09:36:04-03:00,,NA
2021-09-01,2001635814,8358824000,OTP,2021-09-01T09:37:12-03:00,,NA
2021-09-01,2000527627,9993781777,OTP,2021-09-01T09:41:30-03:00,,NA
2021-09-01,QS2289954,8309752637,DROPOFF,2021-09-01T09:38:05-03:00,,NA
2021-09-01,2000819739,9027555049,DROPOFF,2021-09-01T09:38:19-03:00,,NA
2021-09-01,2001558207,7002082691,OTP,2021-09-01T09:40:30-03:00,,NA
2021-09-01,2001508338,7674089810,OTP,2021-09-01T09:40:47-03:00,,NA
2021-09-01,2001521654,7016692127,OTP,2021-09-01T09:40:53-03:00,,NA
2021-09-01,2001794838,9512889087,DROPOFF,2021-09-01T09:40:28-03:00,,NA
2021-09-01,QS2284303,9867143998,DROPOFF,2021-09-01T09:41:09-03:00,,NA
2021-09-01,2001361418,9021942805,DROPOFF,2021-09-01T09:42:19-03:00,,NA
2021-09-01,QS2226299,9769363127,DROPOFF,2021-09-01T09:42:24-03:00,,NA
2021-09-01,QS2281099,7483479571,DROPOFF,2021-09-01T09:42:27-03:00,,NA
2021-09-01,2001752996,9321490928,DROPOFF,2021-09-01T09:43:59-03:00,,NA
2021-09-01,2001433693,9946036316,DROPOFF,2021-09-01T09:46:03-03:00,,NA
2021-09-01,2001448157,6371862809,DROPOFF,2021-09-01T09:48:22-03:00,,NA
2021-09-01,2001688471,9054575956,OTP,2021-09-01T09:55:51-03:00,,NA
2021-09-01,2001688765,9894409129,OTP,2021-09-01T09:57:14-03:00,,NA
2021-09-01,2001720946,7001931085,DROPOFF,2021-09-01T09:55:33-03:00,,NA
2021-09-01,2001629182,9414445031,DROPOFF,2021-09-01T09:55:53-03:00,,NA
2021-09-01,2001069864,9910176482,DROPOFF,2021-09-01T09:57:51-03:00,,NA
2021-09-01,2001713812,9213739944,DROPOFF,2021-09-01T09:59:04-03:00,,NA
2021-09-01,2000945729,9336727110,DROPOFF,2021-09-01T10:01:57-03:00,,NA
2021-09-01,QS2273672,9326067944,DROPOFF,2021-09-01T10:02:58-03:00,,NA
2021-09-01,2001619856,9540979968,DROPOFF,2021-09-01T10:05:09-03:00,,NA
2021-09-01,2001794621,9696331147,DROPOFF,2021-09-01T10:07:01-03:00,,NA
2021-09-01,2001635621,8830625274,WAITING_LIST,2021-09-01T10:10:54-03:00,,NA
2021-09-01,QS2271196,8882008170,DROPOFF,2021-09-01T10:10:29-03:00,,NA
2021-09-01,2000617827,8851619002,DROPOFF,2021-09-01T10:12:49-03:00,,NA
2021-09-01,2001475741,6354555072,DROPOFF,2021-09-01T10:14:00-03:00,,NA
2021-09-01,QS2291339,7903801483,DROPOFF,2021-09-01T10:21:34-03:00,,NA
2021-09-01,2001594544,9845118372,DROPOFF,2021-09-01T10:21:48-03:00,,NA
2021-09-01,2000854369,7204642719,DROPOFF,2021-09-01T10:24:25-03:00,,NA
2021-09-01,2001548698,7021063027,OTP,2021-09-01T10:25:56-03:00,,NA
2021-09-01,2001783961,7999581369,DROPOFF,2021-09-01T10:26:29-03:00,,NA
2021-09-01,AD055,9779439637,DROPOFF,2021-09-01T10:27:27-03:00,,NA
2021-09-01,2001373320,9730492446,DROPOFF,2021-09-01T10:29:58-03:00,,NA
2021-09-01,JA758,9972746394,DROPOFF,2021-09-01T10:32:05-03:00,,NA
2021-09-01,2001317516,9313930873,DROPOFF,2021-09-01T10:32:25-03:00,,NA
2021-09-01,2000823184,7014265009,OTP,2021-09-01T10:33:45-03:00,,NA
2021-09-01,2001373807,8789178339,DROPOFF,2021-09-01T10:35:27-03:00,,NA
2021-09-01,2001621387,9825246023,DROPOFF,2021-09-01T10:36:50-03:00,,NA
2021-09-01,2001736961,8892898930,DROPOFF,2021-09-01T10:38:48-03:00,,NA
2021-09-01,2001374264,7829437617,DROPOFF,2021-09-01T10:40:44-03:00,,NA
2021-09-01,2001636364,9217577170,DROPOFF,2021-09-01T10:42:56-03:00,,NA
2021-09-01,2001359661,9715374763,OTP,2021-09-01T10:44:34-03:00,,NA
2021-09-01,2001535719,9919299442,DROPOFF,2021-09-01T10:48:35-03:00,,NA
2021-09-01,2000555272,9901288871,OTP,2021-09-01T10:52:45-03:00,,NA
2021-09-01,806504,9404060134,OTP,2021-09-01T10:58:32-03:00,,NA
2021-09-01,2001721353,8788438916,ACCEPTED,2021-09-01T11:00:22-03:00,,NA
2021-09-01,2001604306,9728388813,OTP,2021-09-01T11:03:46-03:00,,NA
2021-09-01,2001505441,9702401333,OTP,2021-09-01T11:06:48-03:00,,NA
2021-09-01,2001441401,8895105551,OTP,2021-09-01T11:07:32-03:00,,NA
2021-09-01,2001040676,8826524222,OTP,2021-09-01T11:10:35-03:00,,NA
2021-09-01,2001694027,9490922232,DROPOFF,2021-09-01T11:14:31-03:00,,NA
2021-09-01,788667,8860713338,DROPOFF,2021-09-01T11:20:07-03:00,,NA
2021-09-01,2001631904,9156481669,DROPOFF,2021-09-01T11:22:02-03:00,,NA
2021-09-01,2001102911,9794852139,DROPOFF,2021-09-01T11:50:36-03:00,,NA
2021-09-01,QS2168345,8826087497,DROPOFF,2021-09-01T12:14:27-03:00,,NA
2021-09-01,QS2237027,9713619479,DROPOFF,2021-09-01T12:22:59-03:00,,NA
2021-09-01,QS2228184,9828090567,DROPOFF,2021-09-01T12:34:04-03:00,,NA
2021-09-01,2001775844,9712221999,DROPOFF,2021-09-01T13:21:15-03:00,,NA
2021-09-01,2000680749,9824491878,DROPOFF,2021-09-01T13:36:11-03:00,,NA
2021-09-01,QS2254812,8297604826,DROPOFF,2021-09-01T14:35:57-03:00,,NA
2021-09-02,202109112,8310901162,DROPOFF,2021-09-02T05:06:40-03:00,,NA
2021-09-02,20210910000,9186477308,DROPOFF,2021-09-02T05:15:13-03:00,,NA
2021-09-02,202109223,9183109011,DROPOFF,2021-09-02T05:26:57-03:00,,NA
2021-09-02,202109111,8310901162,DROPOFF,2021-09-02T05:57:50-03:00,,NA
2021-09-02,2000564041,7327095059,DROPOFF,2021-09-02T11:04:33-03:00,,NA
2021-09-03,20210914,8310901162,DROPOFF,2021-09-03T05:22:42-03:00,,NA
2021-09-03,202109134,8310901162,DROPOFF,2021-09-03T05:24:35-03:00,,NA
2021-09-03,2001798408,7096046282,DROPOFF,2021-09-03T09:24:01-03:00,,NA
2021-09-03,2001021532,9967216470,DROPOFF,2021-09-03T11:15:07-03:00,,NA
2021-09-03,T-8425,7338448409,OTP,2021-09-03T11:18:04-03:00,,NA
2021-09-03,GB225,7846045478,OTP,2021-09-03T12:12:50-03:00,,NA
2021-09-03,QS2265495,6281732216,OTP,2021-09-03T16:17:08-03:00,,NA
2021-09-03,2001775661,9513132333,OTP,2021-09-03T23:19:11-03:00,,NA
2021-09-04,20017756611,9513132333,DROPOFF,2021-09-04T00:03:34-03:00,,NA
2021-09-04,2000855369,7619449349,OTP,2021-09-04T01:33:29-03:00,,NA
2021-09-04,T-16130,9679721999,DROPOFF,2021-09-04T02:09:51-03:00,,NA
2021-09-04,T-15778,7903884464,DROPOFF,2021-09-04T02:22:07-03:00,,NA
2021-09-04,2001237053,9056624816,CREATED,2021-09-04T02:26:07-03:00,,NA
2021-09-04,T-16228,9844235391,OTP,2021-09-04T02:30:51-03:00,,NA
2021-09-04,2001813575,7452815108,CREATED,2021-09-04T03:09:15-03:00,,NA
2021-09-04,2001065805,9003334687,ACCEPTED,2021-09-04T10:40:33-03:00,,NA
2021-09-04,QS2265739,8809039717,DROPOFF,2021-09-04T13:07:27-03:00,,NA
2021-09-04,2001680296,9140545676,ACCEPTED,2021-09-04T13:49:28-03:00,,NA
2021-09-04,2001352769,9036162639,ACCEPTED,2021-09-04T14:24:48-03:00,,NA
2021-09-05,2001704087,9800872641,DROPOFF,2021-09-05T00:52:09-03:00,,NA
2021-09-05,2001658975,7075109725,ACCEPTED,2021-09-05T05:04:02-03:00,,NA
2021-09-05,QS2294227,7004652697,DROPOFF,2021-09-05T06:00:03-03:00,,NA
2021-09-05,2001570118,9964421118,ACCEPTED,2021-09-05T07:54:31-03:00,,NA
2021-09-05,2001051228,8547884268,ACCEPTED,2021-09-05T09:24:37-03:00,,NA
2021-09-05,2001702982,9507851909,DROPOFF,2021-09-05T16:02:54-03:00,,NA
