,user_id,accountHolderName,bankAccountNumber,bankIFSCNumber
0,173024c0-04db-4231-88bd-80acac65862e,MUBEEN  MAZHAR ABBAS SAYED ,'172801507870,ICIC0001728
12,06ccaec8-f3fc-4123-b1f6-cfe07516c51c,Potnuru Tarun Kumar ,'50100300413050,HDFC0009410
13,854e6a07-4eda-4279-8136-d73216bfa8a9,MARIYARAJ ,'250100050310118,TMBL0000250
14,b0e05f70-e8b5-4eb8-894b-fde02a88efb1,Rohit Narendra Jokta ,'062110110010987,BKID0000621
15,b427b2db-9727-41c0-b001-04b8499b3431,JAGDISH A TIBELI ,'920010073262297,UTIB0001641
16,3cc0057e-4e6d-429c-a846-a79000716ea0,ABINASH MOHANTY ,'006101567855,ICIC0000061
17,2b7e16ab-dd2e-4a00-a989-7eae1a0f30a7,S .MUTHUKUMAR ,'12901050075521,HDFC0001290
18,fbb6518d-b0b1-4ef6-99dc-fffa54e49f4b,RAJ KUMAR AHIRWAR ,'50100290811664,HDFC0003660
19,4128e544-d43b-4a98-9472-4d1a947d0117,SATISHA  ,'4011101002344,CNRB0004011
20,967b5dd1-6ce0-487f-87fd-33a79983c1f3,BANKEY BIHARI ,'39942292164,SBIN0016371
21,d05eb840-c291-40c4-bf37-e5d272d1d612,T S VINOD ,'343601506224,ICIC0003436
22,d1dc880e-31bb-423e-826b-9a6e58c4114a,THEJASHWINI N ,'010110100007100,BCBM0000022
23,eddf5b4e-f90a-478a-b542-e3b0a7344104,BAPPA SINGH ,'50190002552152,BDBL0001598
24,c5d769aa-0c04-424e-88be-065677b75ec2,BISHAL ROUTH ,'0087010269353,PUNB0008720
25,ee500746-c93f-46a0-851b-95a28455795d,RIZWAN S ,'50100353527520,HDFC0009035
26,3a22c53f-ec91-417f-a9f2-234065f590fd,SOURAV BISWAS ,'919010068002501,UTIB0000163
27,0271cd06-bfec-4469-bfbe-07dd65068a10,Rajat Roy ,'1144010138567,PUNB0114420
28,d762ab97-0060-4bd7-ab3f-5283ae67935a,ARUN UPADHYAY ,'3806825641,CBIN0280632
29,701c1a8e-a22d-495f-a21d-938fe963d9a0,DHANESWAR DHIR ,'588902010009461,UBIN0558893
30,097d9dbc-0c1b-4d10-8d8f-93e853e9f804,AMBAR SATYAM ,'33709000241,SBIN0016662
31,a7aa3f4e-9f27-44c1-8d9b-fe09db4f9cf5,BIJOY THAPA ,'7086528045,AIRP0000001
32,b32cf7f9-3a84-4b63-90e6-5abfe97d6f3c,Vishnu Raj Balasubramaniyan ,'50100396786027,HDFC0001862
33,22ace196-6e47-4027-ae5f-ee4d87b64273,VINOTH  ,'029701561502,ICIC0000297
34,b96445e5-5ce3-4281-a355-71c77f0c24e1,DEEPAK KUMAR ,'50100322715085,HDFC0004110
35,d458d36c-f5fd-4728-8563-1e01d5935f43,Sravani ,'918010093910331,UTIB0000514
36,339b6cff-969e-4364-82e4-f58f4476a6bd,GANESH BAGADE ,'50100361112183,HDFC0002822
37,dc2df204-a980-4b8b-90f6-0cc863f27e39,RANGANATH ,'50100405622130,HDFC0000766
38,11455aa4-3400-49db-a93d-48e496d01d63,CHONA CHABA SINGH ,'3212439887,CBIN0283121
39,30af4ec1-1971-4329-ab5f-b4273af9679a,Bhawana ,'914010032419691,UTIB0000234
40,c457aa00-1468-4ff8-a30a-2d89fdf445fa,THEEPAK K ,'0932101503842,CNRB0000932
41,6ae047c4-32ec-4654-8c8f-272f859e9acf,PATEL JIGAR ,'270810110004267,BKID0002708
42,f991bba6-eaa8-46e1-8b3d-18d47fd0f7eb,AKSHAY ANAND ,'3120101001177,CNRB0003120
43,51df9839-4ba5-412c-be1a-156110c8af5c,AMIT MAITY ,'915010062796112,UTIB0000064
44,1bb5cf68-289f-494a-81c5-904cb3e8e3a6,MONTI KUMAR ,'351901000004751,IOBA0003519
45,11c95e90-9f0b-45ba-8fb1-fc314d7366a6,ANAS A ,'99980105571587,FDRL0001396
46,2ad9a47a-690b-423f-96da-1ab0282a4527,Roshani Mahesh ,'918010026556115,UTIB0000315
47,b4a114ee-f638-4319-a3b9-f704c68f97b3,Sameer Ganesh Kulkarni ,'000501636508,ICIC0000005
48,3fc5b51d-0bd1-421c-802d-2e9eb495db73,Alim Salim Shahabarfiwale ,'9096225225,AIRP0000001
49,65b3b016-d79c-489d-8c65-f6c842ebaec6,PRATHMESH JADHAV ,'3494781476,CBIN0283154
50,92cbc9a6-aef0-4a40-96d5-5741cadf32bf,Pradeep H ,'520331000223901,UBIN0933724
51,edd0988e-492c-4c68-97e4-a588fbc5ad1b,HARI KRISHNAN ,'22090100031322,FDRL0002209
52,e93f5f43-064c-4019-9492-b881739e9b8a,Rajesh Kumar ,'50100062366362,HDFC0000045
53,89bed521-20c8-4e27-ac34-acab0fdf1b59,KAILASH CHANDRA ,'83792300009100,CNRB0018379
54,1c535c6a-bd43-4d73-9042-9fd0c0f1f10d,Jagadeesha M G ,'5885000100017539,PUNB0588500
55,170d1a04-0513-4ec9-9041-a2eb0cbd00a6,JEEVAN KUMAR ,'13530110006801,UCBA0001353
56,cc38e5e6-8828-40cb-be4d-0051a335a2e8,PRAKASH BASAPPA BELAKINDI ,'039400101026314,UBIN0903949
57,4a60294a-20f5-4aea-9eb4-b398e4aa7366,Kewal Desai ,'7490040293,AIRP0000001
58,e5061024-ba19-4d97-b442-2b644540228a,SHAIK RAFI ,'8978690906,AIRP0000001
59,20383fa3-5200-4b02-a412-7f2971d7a5b6,ISRAR ,'916010048232475,UTIB0000372
60,80313c11-56ca-4a5f-be86-129ce0b69eee,Suman Das ,'881024472128,DBSS0IN0811
61,d151b9cc-cab7-4151-9dbd-fcb5e9f9f177,RAVISHANKAR RAMKEWAL ,'014203100002164,SRCB0000014
62,8c0c52ee-881b-43e2-8e7a-7f01c97a3e79,DHARAM NISHAD ,'016101548414,ICIC0000161
63,b0800a40-c4f4-4276-8403-bb3eb5576dfc,LAXMI SAKHARAM SHEDGE ,'50100307170693,HDFC0000194
64,d8ceb8b4-f306-4bdf-b1b5-ce9e5695dfb6,AISHWARYA PARDESHI,'60030987978,MAHB0001219
65,a18538ce-d287-417c-acea-d0d506ca413d,AJAYDEEP SINGH ,'20191487222,SBIN0001637
66,923ed4f9-3897-4c04-998a-b1c96e4f483c,PRUTHVI GOWDA A N ,'64162314915,SBIN0041016
67,230bfadf-23d9-47a6-8ffd-5e02c7988f14,SATHISH M ,'915010021213689,UTIB0000006
68,055a43e0-b8f0-4b92-8940-26ed9866b69d,HARISH MUTHAIAH lagishetty ,'CHEQUE,NA
69,04450d3b-019d-4185-b8bc-566f824e2879,SHAHID MOHAMMED ,'741302010006353,UBIN0574139
70,e102dd10-593b-412b-a5be-36f67a948ad7,VEERU ,'10006285316,IDFB0040101
71,10c176c5-3ebe-4d92-b5fb-8bcdf83e2cdf,GADAMSETTY VENKATA KRISHNA ,'175210100057546,UBIN0817520
72,d6ae1893-6a9d-47b4-8b3a-fb10d3e38fbd,Akash Krushna Deokar ,'0260101021044,CNRB0000260
73,d37ba1ae-d2af-4a33-85f7-0450480ca2a0,BHARATKUMAR R KALASARIYA ,'18650100014390,FDRL0001865
74,1798d6b2-0451-43df-a39e-ea8cf54702eb,SATYENDRA DEV ,'33333393769,SBIN0003369
75,f1d56541-1092-49cd-bc51-23be5a40bf8c,ANURAG MISHRA ,'913010052014235,UTIB0001691
76,d0122c9d-6734-4c58-8ed8-6572b24333ee,AMAR HALDAR ,'77074765780,SBIN0RRCHGB
77,e4e8f004-0c8d-49e1-ad6d-fac3ad086eea,J RONALD RAKESH KUMAR ,'50388850158,IDIB000K791
78,77ae3e42-4563-4f67-af7d-e970a626da77,MOHD MUZAFFARUDDIN ,'31299838202,SBIN0003026
79,9cc4ff2a-0286-41a0-a8cc-3c3a27ca4276,SALEEM KHAN ,'918010107531509,UTIB0000194
80,8771648c-8809-4366-a16e-f0357822e2f8,ASHISH CHUNNI ,'50408710007,IDIB000F514
81,58fa41ed-fb33-40c4-ad29-c86f560f9cbc,ROHIT C NALAMAKKKAL ,'837958280,IDIB000D017
82,1809bd47-2994-4119-8414-89edb158ff34,RAVIKANT RAY ,'3300568164,CBIN0282602
83,8f7fc8d4-2ff6-4a7f-a35b-c7662a822ba9,Sannadi Bhavani Shankar Reddy ,'50100291069216,HDFC0003955
84,92c731a3-de6f-4810-bd4b-1aa02e842aaf,AKARSH N S ,'0092500101722201,KARB0000009
85,4cf7be19-12b9-4f50-aa52-a08cc71ded3c,Saurav Singh ,'20340198243,SBIN0012576
86,efa19caf-d8ae-4d83-aee4-eaf5f172a9d8,Saiyed Sahistabanu ,'7096702674,AIRP0000001
87,5208874f-a6d5-48d3-9ceb-677d191d7a99,RAVIKUMAR GORDHANBHAI BHALALA ,'50391761749,IDIB000S800
88,98790c3d-c92e-43ba-ab8f-134691b849b4,TAMILSELVAN GANESAN ,'1184120010000056,UJVN0001184
89,dc641d42-458e-4046-8336-57a23603ed66,Nithin H U ,'0540101060368,CNRB0000540
90,bffab823-a8cd-4f1f-890a-7615ebbc00a7,NIMESH BHARATBHAI PATEL ,'45270100000281,BARB0PINJAR
91,7a10c6e4-4478-4ad9-966c-f208c15ae7d4,GAJANAN DHARMARAJ RASEWAR ,'34772575570,SBIN0011446
92,7a142c98-bd50-4d23-93b3-650cacf0ab4a,KAMAL SHARMA ,'5686101002128,CNRB0005686
93,4ab619d4-e4e2-4b9e-9e27-fc0be8ff0183,Sharmistha Ghosh ,'30926772756,SBIN0001486
94,daff2f60-011a-45b8-ae1d-aeaa64e22305,N VENUPRASAD ,'6453862318,IDIB000D030
95,d936d9d5-bc48-4236-9dcd-d0812b9ec7d6,SHAVANE MAHESH ANJAN ,'50100286662973,HDFC0000359
96,3e375b0d-328b-47d9-bce1-37acd182d0cc,DEEP CHAND SHARMA ,'07652180002742,CNRB0010765
97,f2cd5f69-0273-4b37-8356-0526c8ef7ece,GAVARA YESU PRASADU ,'30511772871,SBIN0002711
98,94d02136-ce47-4b3d-830b-410354ce6503,VENKATESH S B ,'408010200839,KKBK0000958
99,fa27d482-44d5-45ab-a646-3c413b334c4b,MAHMAD SHABBIR MULLA ,'50100100944399,HDFC0002552
100,aff23f61-b0ab-4a3c-a655-a4f44dd15dcd,KIRAN PRASAD S ,'201010470305,KKBK0000958
101,0577ad86-603b-47fa-8be0-fd71bbb9a3f1,PATIL PARTH ,'3406006900002659,PUNB0531900
102,240ffbb9-5b0a-413b-a221-fbf8fd16a832,SHAHID PATEL ,'60112624415,MAHB0000103
103,4557f44a-ed13-4ac0-8fa2-8488dfcbbc5b,AKASH SONI ,'7971000100009378,PUNB0797100
104,65f03aa3-512e-4956-9ab7-fbe853808a8c,GOKULRAJ K ,'916863774,IDIB000K123
105,42c3b33f-1f42-4abd-b764-3ad89b4e17be,D ARUN ,'1057104000104814,IBKL0001057
106,469d2886-25b3-4b39-8869-accd363de430,AMBADAS POL,'30800898363,SBIN0006117
107,c1c313de-b402-49a0-9065-077ebd25cb69,RAMESH DHEERAVATH ,'107091800007462,YESB0001070
108,0a1445eb-5aec-449c-bade-86279ac31313,BHAMRE HARSHAL RAJESHBHAI ,'084501513272,ICIC0000845
109,e8e67df3-3c76-4d8d-965a-535bbf3a0baf,MUSTHYALA SHIVAKRISHNA ,'041001522103,ICIC0000410
110,878bee5e-48c9-46dc-bea6-f0774104a817,BHARAT SINGH  ,'949010110003905,BKID0009490
111,cf9e7dfb-435e-4570-bdb2-de5e6b51c617,ALOK SINGH ,'3401001500050696,PUNB0340100
112,14b986ce-b535-4a73-8390-d961014b00fb,Akshay Nagnath Gaikwad ,'3612100205,KKBK0000958
113,9174156b-4512-4fc5-93e6-cacf7c7fa32c,P V REVANTH KUMAR ,'919885927680,PYTM0123456
114,a4f47ff5-c335-4911-bb7a-8708094be6c5,MURALI D ,'100801518658,ICIC0001008
115,77d4bb83-67a7-4ef0-a147-c98bc69eeb00,AYUSH GAURAV ,'50100368280896,HDFC0002610
116,5a92aee7-ac45-4199-9dc5-454ba3d5c8ec,N RAGHAVENDRA ,'919010029277810,UTIB0002628
117,246b5ff0-f2cc-43cf-93cc-0240682f164d,ARUN JAISWAL ,'429110110007921,BKID0004291
118,c9601d54-cd4d-4aff-8943-00c37a681262,Rajeshkumar Ravindranath Mishra ,'910010048847800,UTIB0000020
119,a560fd77-2f53-4590-8f89-da64c8348990,Tayde Neelam ,'483302010057215,UBIN0548332
120,1b7f9836-68d0-47b4-a1d9-376860994611,Mandar  Patekar,'489402010917630,UBIN0548944
121,d5115fb9-8408-4a70-a21a-daae7aed16d7,DEVENDRA PRASAD R ,'30292795770,SBIN0002774
122,8cd977de-2f4d-4151-ac2e-c698a0e2eb43,REVANSIDDAPPA NIMBURE,'50100312959438,HDFC0002411
123,63746207-da24-4e3b-b5f5-5c5c968769e4,VAIBHAV DHALKE ,'20303495503,SBIN0014515
124,4bdf9f93-2a82-4d16-b6b8-586dc02877ec,DEVESH SHRIVASTAV ,'143901000716,ICIC0001439
125,0ea1b3d9-4401-47b3-ba43-ef79e59dbb9d,Rajib Kar ,'0323101032935,CNRB0000323
126,1185ad2e-8024-4167-aa85-548a5799994d,M. Pradeep Kumar ,'36567042484,SBIN0016114
127,15450bf4-6beb-4a71-a22e-f3c2fb704af2,AMAN SRIVASTAVA ,'223100050301766,TMBL0000223
128,0d471d52-8e5f-4eca-8922-65c94e742d27,RAJAKUBERAN PALANIMURUGAN ,'11910100195251,FDRL0001191
129,e7c937f7-0462-4075-aef7-1d9421a7732c,SAJAD S ,'20114696066,SBIN0000903
130,0c301f0f-476e-4eae-8874-cae828b69c1f,Paban Puri ,'31240110023198,UCBA0003124
131,5b32997f-a20f-4800-874b-56eecb6954fa,MOHAN RAMESH MALI  ,'33650967982,SBIN0000482
132,cd431a05-9258-4c07-b9ac-e53eaba48d65,SACHIN SHRINIVASRAO DONE  ,'920010049833403,UTIB0004506
133,ace16822-89a2-46f0-9f3e-0d406730fd86,SOLANKI NIKUNJ CHETANBHAI ,'313510110003458,BKID0003135
134,48e37989-84b4-4163-8768-f0d64dae0af9,CHIRAG SOLANKI ,'50100358567130,HDFC0002115
135,e27007be-e1bc-4751-9246-7a2171d0b91f,MOHAMMED IRFAN ,'920010048328344,UTIB0000333
136,61f605b8-ba19-4fba-a98a-7bdb608f316a,DIGAMBAR VIJAY DUSSA ,'070910110001224,BKID0000709
137,b0f4fc5a-481c-4e46-a99c-06efbfa6015b,YASHAVANTH B H ,'50100349514261,HDFC0001232
138,e3fa4df2-d1b5-4bd5-a40b-8a11f725b0a0,ANISH KUMAR M K ,'2358119053984,CNRB0002358
139,0fefc053-7f2f-48be-908a-26b010cda732,NISHIKANT DIGAMBAR PATIL ,'0663104000092108,IBKL0000663
140,4d8cc161-6200-4b25-a652-d35056081e42,SHAIK KHAJA HUSSAIN ,'50100340839373,HDFC0003052
141,11ceef7b-c633-4c1a-8401-cb28e319c642,NIRANJAN KUMAR UPADHYAY ,'030701517675,ICIC0000307
142,cb2560a0-b528-4c0f-8f9e-c1f203544704,RAM BILAS ,'50100334871961,HDFC0000127
143,10421c46-6963-404e-a83a-3ddf1f1074dc,Tarun Raj ,'32708190943,SBIN0008111
144,df0d48d5-3e6f-4d12-bf50-896d4f849044,A VINOD KUMAR ,'20286848580,SBIN0016528
145,0c7a1d8a-458b-4d08-8fae-e13e676712be,NETRA BALLABH  ,'34409387436,SBIN0008546
146,ab26ca50-e3a4-4722-a8a4-1b454c76c1ee,M.VASANTHKUMAR ,'147001000811407,CIUB0000147
147,d6e528a9-4dc8-4283-a4f7-93d18ff559af,BODDU NAVEEN KUMAR ,'50100126140674,HDFC0001629
148,d2b4c850-3536-4ab4-931d-7ce10dbe4b3c,PUGAZHENTHI.J ,'918010006349843,UTIB0001182
149,c0f80d87-c990-472b-980c-d88921c9ed1e,NIRMAL KUMAR SINGH ,'334101506375,ICIC0004317
150,14787633-ca41-42aa-b5d1-111ddce16ab7,SANJEEB SINGH ,'918010008207617,UTIB0001482
151,8ac81a0f-2f97-4b2f-aa94-3456b7f0eaca,MESHAK VICTOR CRASTA ,'8812849053,KKBK0000958
152,92660a53-3989-45dc-9aed-b8332db082c5,MANDEEP  SINGH  ,'057801514583,ICIC0000578
153,a6bfcecb-f6da-4347-87bb-7593ff1a4e9b,DEEPAK VISHWAKARMA ,'30873040707,SBIN0005824
154,80be9b2d-d4bc-4c48-b510-8c8c2c7820b9,RESHMA DULALMOHAMED SHAIKH  ,'0613837857,KKBK0000958
155,22ba1a0b-f59a-497a-a8db-4c69c1a36374,Netai Mondal ,'50100306348396,HDFC0004369
156,fee85a22-d261-4992-af94-201247eec032,AMIT RANA ,'12530100012673,BARB0PRABHA
157,a9046e42-40ef-4898-ae4a-d7861bdacf83,SIDHIK ,'14100100140658,FDRL0001410
158,167bc813-f563-4b1b-a8dc-ea66a061c943,ARUN KUMAR A ,'9633646465,AIRP0000001
159,b16b45b2-26ee-4a91-a233-50262bcda1a6,CHRISTY DAVID ,'50100335681771,HDFC0000628
160,b8d4e523-cf0d-4846-93cc-eb2844431fab,B Thangadurai ,'158100050308967,TMBL0000158
161,54b0d99b-6b41-4d5e-91d1-9e28bef20bb9,PRASANTA PRADHAN ,'30796822352,SBIN0004782
162,851a9f73-1507-43fd-bf5f-f164bb5ce792,MADASU KIRANKUMAR ,'428702500130045,UBIN0542873
163,4890b228-7eae-4ced-831d-542a35453d4d,VISHAL TIWARI  ,'2813702898,KKBK0000958
164,565f8172-b5b1-4525-a19b-ce50d9d30bad,Shivakumar T N ,'063291900016158,YESB0000632
165,6b6da0d0-e155-452c-a808-859749a2f61f,PRADEEPP ,'005104000338929,IBKL0000005
166,8610c84a-6d16-4dcb-a6dd-41006eab3d91,PRAJAPATI KUMAR ,'5632283663,CITI0000007
167,368afb4b-5d2e-471f-b7b8-27a7093219a9,SURESHA S ,'5042500119828801,KARB0000504
168,9e113d34-2368-4213-ac32-9afa0e7a6c37,SURAJ RAMESH CHOUDHARY ,'333701502952,ICIC0003337
169,f8a9ddb2-90df-4661-8112-48909b8266b0,Hardik Rajani ,'036101521052,ICIC0000361
170,45eed9df-aab7-4ced-86c5-1cbe27b24a5e,PRASHANT GAUTAM UBALE ,'34008565030,SBIN0007971
171,eb0eb6f8-5e8d-44ad-98b7-72c8d3ff4113,PAARIPALLI NARESH ,'62208253842,SBIN0021360
172,cb6c400b-b624-4394-831f-8fff27d53c0c,MOHAN R ,'64190942683,SBIN0040180
173,47533a2e-a45a-4978-b7e6-6887ac799321,RAHUL ,'1542001500131450,PUNB0154200
174,d6139201-e5bb-43d2-ace8-a1e4d73f1bf4,RAJESH UMABATHI ,'14570100036769,FDRL0001457
175,a793aa98-6acf-418a-9644-07b683252a24,Vikas Pundir ,'918010009088507,UTIB0001148
176,ff1fc370-c942-4a57-a85d-4b6830c47c2a,HEMANT KUMAR SINGH ,'50100251155580,HDFC0003990
177,279b0f84-e88f-41e4-bd7e-1d360f43e4e9,Rohit Ravindra Utekar ,'021010100008502,PJSB0000021
178,12d0178b-0fa4-49fc-8b5a-8f7bb09e81ee,NAVEEN KUMAR N ,'100801532938,ICIC0001008
179,a2af70f0-0ac2-46b2-a355-90e9e5d48111,GHANCHI SOHIL ,'200816510000236,BKID0002008
180,4ca5bbbd-a9f7-4163-bafa-cc7450b13119,KARAN KUMAR ,'32743135492,SBIN0001181
181,586489b5-004f-4b7e-94b7-881cfa9ece45,VISHAL BASAWARAJ BIRADAR ,'33286429552,SBIN0003824
182,352b8eec-ff27-47d4-b80b-6d249b53d62e,Rakshith H G ,'0486108034256,CNRB0000486
183,2d72f3b9-56fa-470b-855d-1725aab0c769,ALEEMUDIN ,'692010110003592,BKID0006920
184,f0895889-0f8f-4d23-96c5-66f0adad4848,Sitaram Baban Bhoir  ,'50100226581035,HDFC0003038
185,513ffd34-5254-4cb6-aa72-ba848a13c7f1,S NAVEEN KUMAR ,'50100413037813,HDFC0001048
186,ca337c4e-a400-4d1f-92b6-79a054293b3b,ABHISHEK MUKHERJEE ,'35723804183,SBIN0003906
187,7e805e53-83fd-40aa-89dc-f3c88dd1ce33,RAJAT KOUNDAL ,'596110110006083,BKID0005961
188,0326a9ee-8fa9-40c4-9bfe-72e9f09bcf7e,ROSY DAHIYA  ,'6572000100037885,PUNB0657200
189,4b38233e-c066-45af-af17-d84ea0456771,PANKAJ KUMAR YADAV ,'36005080815,SBIN0012147
190,730b20c0-8671-46ee-aa3b-5fa581dc377a,NAVEEN KUMAR B H ,'520101253314038,UBIN0907723
191,aadad6f1-b3b8-4075-8a33-9b1fab708aee,VAIBHAV KUMAR ,'104901509480,ICIC0001049
192,6b5b9de9-1655-4850-9398-b8be1c6e1e12,DASHRATH SINGH  ,'0312329370,KKBK0000958
193,d9d2ce06-4dd5-42d4-a7f4-68ee84e58b60,BARUN MAITY ,'920010062419099,UTIB0001183
194,40072ae4-5fca-4e78-a9ac-e7bb9472899d,ASHRAF HUSSAIN ,'1280166000031599,KVBL0001280
195,2f42fb00-d440-420f-8d10-431cef48ffa4,Dinesh rai  ,'50100381804876,HDFC0009151
196,da3a807e-3ded-495f-bc73-6d3a6ddfa06e,Sachin Mukund Katare ,'20374876379,SBIN0001406
197,cc42e748-ef78-460b-abaa-341b312ca33b,Rajeshkumar A ,'30553886743,SBIN0006903
198,7645aa8a-9cee-4127-90bb-2dc95324ff97,DEVARAKONDA VENKATESWARARAO ,'630601168356,ICIC0006306
199,5d4c56df-c15e-4c5c-98d9-30b3b39bc853,RAJKUMAR ,'31478100003387,BARB0JAGJAI
200,0c76e401-a326-4bbb-a8e3-930c24e10870,MUKESH SURWADE ,'60024342554,MAHB0001927
201,372ba6a1-bfd1-4eb8-9040-3f754c0ae0c0,LAMBAWALA KHIJARMAHEDI ,'139601000359,ICIC0001396
202,92f10e07-9772-461e-9971-706432856786,VISHAL SUNDER GUPTA ,'566802010011130,UBIN0556688
203,61cc8823-fbd5-4275-a669-3c083f6a6b4e,AJAY BALMIKI ,'033001517935,ICIC0000330
204,462aa009-d828-49ab-9e32-b357f387d265,PARMAR JATIN RAMESHBHAI ,'324101501234,ICIC0000844
205,1d645ead-ff99-4b53-8c3f-55bf25b2ba35,UTTAM GANPATRAO JADHAV ,'50201163884,IDIB000L535
206,0faee2c2-d62e-4972-bf11-7eadec218e15,RASHIKBHAI KHIMJIBHAI RATHOD ,'311002010103198,UBIN0560511
207,6395510f-0eb3-435f-b47e-dc0571eb9c68,PRAJAPATI PANKAJKUMAR JITENDRABHAI ,'9292000100017117,PUNB0929200
208,0869f258-e9f7-4baa-84ea-b4d85393a9d9,VINOD KUMAR CHOUDHARY ,'30735150640,SBIN0010855
209,b36ec3e6-9276-4dab-a535-7b8a556f7b52,CHIRAG PRAJAPATI ,'30516864010,SBIN0010862
210,252953c6-fc94-49b5-ada9-79899e6055f7,SUROJIT MUKHERJEE ,'20459738627,SBIN0001796
211,fbf399be-cdcf-4c8a-a39e-cb10e199581e,RAJDIP ACHARYA ,'100046734281,INDB0000963
212,1573baaf-54c6-43d7-9cf3-418846d61654,HEZLEENA ,'018401538080,ICIC0000184
213,30b939fd-1c20-4a90-8bcd-3e5084839d8a,VINIT PANDEY ,'192001502176,ICIC0001920
214,1eeefb32-108d-4bcc-9201-8f80ddf9891f,NITESH KUMAR JHA ,'50288100002554,BARB0CHAKHA
215,4978c886-798c-479f-9ffb-f31107196cd7,Vangala Rajashekar ,'9614468695,KKBK0000958
216,ec1be358-29bb-4caf-979d-0e92c174edf7,ROHAN DILIP KILLEKAR ,'012011100016810,ASBL0000012
217,5b7323ae-3dea-40b7-9936-977e4aa9db04,LOKESH P ,'254701000015723,IOBA0002547
218,b3a82ea5-b7d8-4bb6-9017-e4bd53f2e227,NEERAJ SINGH ,'081801505628,ICIC0000818
219,6bff75a8-c7a6-4597-a233-26a6599ea821,NIKHIL GOVARDHAN BHIRUD ,'169501503003,ICIC0001695
220,7c472b15-9cb7-4827-9965-b59c61315dfb,HARIHARAN PANNEERSELVAM ,'164101000025433,IOBA0001641
221,cca63f68-c411-4d6e-abd5-8e01dd5f916d,Satish Kumar ,'29648100008015,BARB0BARRAB
222,3c95a23a-5da8-46fc-a4ac-aa48c036b00d,BHANU PRAKASH K ,'047901503447,ICIC0000479
223,624aaf29-8be9-4fbc-b074-c0246bf41fdf,SHAIKH MOHSIN ABDUL JABBAR ,'091501514928,ICIC0000915
224,0c84337e-47e1-4dcd-a6aa-32084c91c0db,VAGHELA DEEPAKKUMAR RAJUBHAI ,'280910110004323,BKID0002809
225,6000df27-7c1d-4938-99d7-e791372e2ccf,RUPESH SAHU ,'100044316425,INDB0000031
226,980e696f-812f-41ef-a8f8-e5dd9e0e5446,BALWANT D GAWANDE ,'39642756286,SBIN0000311
227,6adf4936-0ee2-48b8-8c81-9d933884c511,MD. SIRAJ IKBAL HOSSAIN ,'914010020270167,UTIB0000389
228,1db2ba17-e88b-4563-8119-653a8756c38f,Ritesh Kumar ,'1014010248273,PUNB0101420
229,c2a11de1-1a6b-4754-9d38-a4918e149039,SWATHI ,'50100402154210,HDFC0009233
230,392b06d9-eb71-4129-a649-07d602689681,AASHISH CHAUHAN ,'9874000100055568,PUNB0987400
231,f49b6dfc-4aa8-4212-8e81-245a4a777e3b,Sahal Kooliyodan ,'50100282107200,HDFC0000184
232,933b04aa-b4a7-4e3e-9469-8478640a4294,G UPENDAR ,'62481621462,SBIN0020780
233,cd47eafd-f4b2-4454-9c4c-f64bdcf1f1ba,RITESH DHANGAR ,'44678100008318,BARB0MANAWA
234,57f8b160-f7d1-4bf2-b626-2146b086b435,AMAN SINGH  ,'0614000100329080,PUNB0061400
235,b72e642e-7e35-48ca-bdf0-82f16d000a22,RAJNI BHUSHAN KUMAR ,'3547110010051110,UJVN0003547
236,72ef0280-b104-43f8-84cd-8432c7b94ed1,VIJENDRA ,'552902010013855,UBIN0555291
237,7d911ad8-7982-41ac-8b5c-617c0761a7b1,Abhijit Chakraborty ,'6313279775,KKBK0000958
238,bce63796-3e40-4175-97b8-7281a867d353,N DEVARAJULU ,'50100369807260,HDFC0002379
239,c9724a0d-8a5e-452f-bd7c-020cf9126ce0,SUDHIR SURESH GUPTA ,'920010061818774,UTIB0000063
240,67161ade-1bf0-42f4-9c0f-aef0efee154c,AVINASH SIDRAMAPPA KUMBHAR ,'33046644960,SBIN0012485
241,13a6c54d-9008-4a24-8e90-ccfb54d7fdf0,SAJIL K ,'99980102208514,FDRL0002139
242,85b785f9-d649-4027-918b-ab71862e69db,Bejawada Nookaraju ,'11002413000478,PUNB0110010
243,d87260a6-875d-44fd-9d9b-42480bf728ad,AKASH ,'0276104000097884,IBKL0000276
244,5d35b674-5e16-463d-b6f0-5d48c54401e7,MADHUSH GOWDA N  ,'6620174140,IDIB000D059
245,7affc938-46ed-4cd6-9521-508be10a2b59,Tinku Jaiswal ,'50100238226598,HDFC0001437
246,a36817de-c36f-4193-9c93-8c1b580d2029,DABHI GANPATBHAI  ,'33303141728,SBIN0002655
247,a7234ff0-b9c2-4de4-b367-900a9cf3a3ef,SUNIL KUMBHAR ,'4020000100168518,PUNB0402000
248,14886d99-1354-4aa1-82d0-2572c11a3203,GOVIND ,'50100423428536,HDFC0000225
249,f2aa2a9b-40e4-466d-85d0-50626b037359,Sharath H V ,'3432500100066801,KARB0000343
250,24c6a617-66d3-4573-8806-308dd5e50b03,BIRRAJU DAMODARA VENKATA PAVAN ,'602201548666,ICIC0006022
251,ad14c633-466b-439c-950a-c341a5f758a9,Sathish Kumar ,'602601551482,ICIC0006026
252,9b2bd2d6-8c05-460c-9a0c-d0c99c50e923,ANANTHA KRISHNAN R ,'12501140000284,HDFC0001250
253,fc13965f-4006-4c9b-8a9d-381ae748fa32,KESAVARAJ SIVAKUMAR  ,'1181110010053634,UJVN0001181
254,6ad334ce-fcc0-4846-b662-9b2bb6b7cb38,SANJAY PRATAP SINGH  ,'2167108019868,CNRB0002167
255,28ba378e-9e3a-46ef-be22-4be4919e7c36,VIKRAM WALECHA ,'5212140643,KKBK0000958
256,9b4145c8-f16d-4b18-a0f2-32b065129370,GANESH R ,'003301533017,ICIC0000033
257,ed17ece1-b22c-4d93-806d-bcb916626ede,E Aravinth ,'10049742294,IDFB0080102
258,f00071c9-27fc-4b70-9704-5d2028050be3,CHILUKA SURESH ,'50100191078087,HDFC0001631
259,83337171-e792-4ce5-950f-f712874e7dd8,S SATHISH KUMAR ,'20271703583,SBIN0011733
260,d346a8d6-4411-474e-84c9-6d9dbf525d8b,VAIBHAV DATTATRAY SHINDE ,'4613601272,KKBK0000958
261,d96ca33f-f269-4b13-a313-a929a43172d8,SANJEET KUMAR DAS ,'490216310000382,BKID0004902
262,70336c44-d13c-4348-ada4-01d6cdbda30b,S ,'728018210016096,BKID0007280
263,e6262d32-7b87-4622-a367-3c51b0d11c54,Satheesh Thangaraj ,'32019439698,SBIN0005739
264,349f36a9-1ead-44e6-aa5d-3237fe3eed08,VIVEK KUVARSINGH UIKEY ,'876810110006765,BKID0008768
265,1cafd9d6-238f-49f3-8b21-9bd13ae941f0,Md Shahid Ansari ,'09263211000655,UCBA0000926
266,8200c29e-737c-4504-b63d-3cde41fbfce1,JATINDRA NATH MAHAKUL ,'30965039493,SBIN0005194
267,3c80ea4d-e633-4250-b47c-9e0647b0fcaf,GADILA  PRAVEEN ,'170410100050224,UBIN0817040
268,a7753948-19ab-42f3-bcde-c76ca75a2e98,KOTCHERLA RAGHU ,'36402200167677,CNRB0013640
269,68d44428-5f8e-4635-97c3-9d367d847234,RAMIZ KHAN ,'10006733641,IDFB0021001
270,3e2934a3-2439-48da-82af-8db7f6ad0750,B R Shrinath ,'0212104000274111,IBKL0000212
271,361ff263-faff-464b-a2d0-42808ad09de5,DHARA BHAVSAR ,'002401550127,ICIC0000024
272,dee005b2-d3e0-41ee-a8a9-1e65a516fa0a,BIJENDRA KUMAR SINGH ,'33478700221,SBIN0001099
273,c33ef25b-1925-446a-80b4-3aaa18522e53,Anand M ,'269201508463,ICIC0002692
274,b2f2b1c7-f504-41b3-b210-702b2823b2c2,Sanjay Sharma ,'02811050069376,HDFC0000281
275,88b16f76-9b30-4451-acd7-c015cebe1b33,IRFAN KHAN ,'1450001500007975,PUNB0145000
276,a252c894-38e8-4862-abe8-78335dc30189,BHOOPATHI ,'1650110080050735,UJVN0001650
277,11ecda65-e350-4cc8-b9f1-145403147698,Manoj Yadav ,'00781050292489,HDFC0000078
278,edc4ed35-ddeb-404d-97bf-7ae134ad7ce4,AMIT SINGH ,'76830100010159,BARB0VJMNGR
279,f51780ed-f8e1-46cf-9e7b-b6b6b17936d9,SANTHOSKUMAR KUMARESAN ,'6047874096,IDIB000M082
280,a4736773-89ff-4085-be6f-19b4591dcb06,SHIBU KUMAR E B ,'50100326744873,HDFC0001258
281,15fe5a1c-272d-48cc-80c8-980cb1b3feb0,A KULANTHAI RAJ ,'50100321509074,HDFC0001005
282,1457f500-b9c0-42fc-ab39-4c978c3aaebf,ARVIND K V ,'142001544249,ICIC0001420
283,cbb3a068-f830-42ce-be61-65eeb0a7b30b,RITESHKUMAR RAMLAKHAN GUPTA ,'47108100003216,BARB0ILTHAN
284,5a2e4531-b367-4a19-9825-3cfb560c105e,Vijay Balchandra Chawan ,'4554101001375,CNRB0004554
285,b681b660-95ef-4fc1-a794-e79dce4d7624,DHILIP KUMAR R ,'602801533856,ICIC0006028
286,31fee27b-d44b-4f12-be3c-830ac4d58f95,SYED AZIZ QURESHI ,'666662990014616,UBIN0555401
287,7dde87fd-40f1-437e-bdc9-b098c25a4087,AJAY KUMAR SHARMA ,'001201613428,ICIC0000012
288,d46449d6-349b-44c1-abb1-3f9d4ef1d24a,VINOD JADHAV ,'50100259558803,HDFC0001579
289,76fc6f84-c124-4c77-8e3c-51d8d624943c,RAMAVATH JYOTHI ,'20329009230,SBIN0012836
290,651f4b8e-8f62-4a7a-9c4a-6d6012eb8288,SANKET KUMAR SINGH ,'2515010200038959,PUNB0474300
291,b932b483-ac65-49eb-88c8-63ba25a21362,BELALLA CHANDRASEKHAR REDDY  ,'100701532926,ICIC0001007
292,61d3dc55-3321-4a65-b6b4-b415d0202030,Taufeeq Pasha ,'50100380031198,HDFC0000140
293,f3577e4b-5ecf-4beb-9bff-b58180608982,Rathva Vipulbhai Vajesingbhai ,'11330100011600,BARB0HALOLX
294,228f951a-31be-417e-8431-aab149d53993,Nama Varaprasad ,'50100377339457,HDFC0001933
295,d7b907f8-48d6-42af-b509-3f0294506a78,KAMALAKAR SUNIL DEVKULE ,'20189322966,SBIN0016435
296,5162621e-19c7-407a-9310-59e5c0185c6b,RUPESH KUMAR ,'9881000100042485,PUNB0988100
297,2a88a4c5-c8b1-41c3-ade2-26e0b20e4239,PIYUSH PAREEKH ,'2812342934,KKBK0003715
298,eb1e507f-f173-41a1-8d0f-f5c41ed08434,Tejasvi Bhoir ,'9769449763,AIRP0000001
299,1b9abba9-34c1-4bf2-a4e2-770d9ef663d6,Ankush Sampat Maske ,'50100219900110,HDFC0000685
300,2bf4140f-1b78-4f04-9cab-7a0f940e4e8b,DHANUS A ,'65291600182,SBIN0070760
301,6a3001ff-32af-4f51-8faf-e34fc2a3235a,UDAY S NAVADE ,'31482247733,SBIN0000833
302,3f5be15b-9366-4724-ab6e-b5c2c00d085c,GEORGE P J ,'0902500102937101,KARB0000090
303,64193e11-c0d0-4660-af74-75f0b6eaec5c,PRASHANT SHUKLA ,'0434053000011644,SIBL0000434
304,2b8696c3-c3e6-455c-a048-5db9aff605ce,Vijay Pratap Singh  ,'19100013922316,FSFB0000001
305,72f31b4d-4160-429d-a443-386093d5e7ef,PRABHAKARAN M ,'520441023349331,UBIN0934976
306,89b77423-bca3-447c-b848-059c2c19d55c,WASEEM HYDER ,'1626108000608,CNRB0001626
307,9bc16ba1-7ede-44dd-a847-2e377689816f,VIVEK S ,'916010049078676,UTIB0003626
308,ac01bfbc-6c4e-458d-aae8-f5544ab1d36b,ABHAYA KUMAR PATTANAYAK ,'19781050001263,HDFC0001978
309,ba64b7f9-b286-48b3-871c-ac14015fe631,DHAVALKUMAR KANADA ,'25310100004897,BARB0SIHORX
310,5170ffe0-f903-4501-8713-4fe65690aadb,Shubham Santosh Shitole ,'7774957378,AIRP0000001
311,69e3da23-e2d2-4e6d-ad35-b9483f5a5539,KAILAS S ,'6360939138,IDIB000A012
312,c44602d8-a979-4104-b8c2-0546948231a0,BOMMAGONI SRINIVAS ,'34438264330,SBIN0008498
313,83699db9-9467-436c-b0b6-a19620d3bf24,Dharmendra Kachhi ,'1634104000053552,IBKL0000052
314,7709e813-04ea-47ef-8348-25f9b64d2794,MANISHA RAJARAM BAGAL ,'50100109154636,HDFC0000163
315,09cee4ed-7c1f-44c1-bfda-89a779be40a2,NANDANKUMAR T S ,'10044673335,IDFB0080155
316,ab012301-6e05-4500-a104-e6cfdcf35945,BASIL GEORGE ,'10110100238133,FDRL0001011
317,16ecbb43-91cc-43a7-ba65-db5ef5508188,SANTOSH KUMAR BEHERA ,'33678997225,SBIN0016133
318,60e08690-ad8f-4538-81f7-cd062ffc597b,Seenivasan Senthil ,'50100355072859,HDFC0001104
319,3fb2b0f6-660f-4fe1-85d6-1bafafa96273,SYED ABRAR ,'67166826554,SBIN0070557
320,e368fd89-e64d-41a1-abd1-6aad6150d18a,MANOJ KUMAR RABIDAS  ,'36448949066,SBIN0007997
321,3d4dcec8-3cfd-43f1-905d-3a2809359644,PIYUSH SISODIA ,'0056001500046702,PUNB0496900
322,d8d99de9-4839-4b91-8c8e-63d0dec2f874,KALPESH RAJU MALUSARE ,'4443110010052517,UJVN0004443
323,98154cd7-766c-41a8-9b4d-6d7c82bc5690,PRADEEP KUMAR ,'919840812628,PYTM0123456
324,8bca7f45-8a77-41b0-84b4-3753f2b01cdc,MUHAMMED SAYEED T ,'11120100169997,FDRL0001112
325,0a1b389f-9762-4853-8008-8e1ff3c5266a,Sharique Abdulkarim Shaikh ,'31619269507,SBIN0000454
326,64e73c15-a6b4-426b-acf7-3a31bc4d6509,PARAG VASANT MAYEKAR ,'99840100010976,BARB0DBREVD
327,1d95d8c1-a0a5-4e99-9ee7-cdfab99ca228,NOAH ABEL JAVAJI ,'50100253537606,HDFC0000253
328,cf387bc8-4d6d-4e7b-8e17-4a43655582ec,RAVI KUMAR ,'20115273334,SBIN0000181
329,31f43c28-342c-4b51-9b48-ce3d6015fe39,Ramisetty Sri Sai ,'50100257393315,HDFC0009095
330,db37cbae-3542-4259-8be6-2aba4140b267,Saksham Sanjay Shivhare ,'38869301306,SBIN0001633
331,e1b46b67-0b1b-461a-8e6e-17f807172976,Praveen R Ramesh,'881016081727,DBSS0IN0811
332,3a54846a-a5f9-409e-ae58-1e088b64083c,ABHISHEK SINGH ,'60349345793,MAHB0000382
333,505ab0ca-f395-43ef-a1d9-3e50dd685ea5,DIBAKAR DAS ,'400810110017165,BKID0004008
334,1fc9738c-4edc-4bda-99a6-bdc8e5cd56b2,SRINIVASA  PERUMAL S ,'270401500104,ICIC0002704
335,896522ea-d38f-44f8-b7be-53bc423012fc,VISHWANATH ,'30903772616,SBIN0005978
336,97e3c2ae-0ce1-430f-8ed9-680cb0700f45,VARUN SHRIYAN ,'1394108062915,CNRB0001394
337,672731c7-8728-4581-a27c-c149873e56dc,KUNAL WAHI ,'13591140000090,HDFC0001359
338,c647bc9a-004d-4539-acdb-fe7dbb3cd6c8,JAYDEEP PAUL ,'122710024916,BARB0DBSHIL
339,ab552ce6-01e5-46fb-8246-00a04d7815ba,G AKHIL ,'50100420195819,HDFC0006274
340,35747d7e-521a-4538-9a44-e8d76b22d2c9,NAVEEN K ,'50100347477121,HDFC0000157
341,6706d3f3-9429-4c1c-afa1-4fb588e4383d,SOJU KURIAKOSE ,'102901510684,ICIC0001029
342,fd05a51e-718f-472c-b3f2-f37527c2a3c8,PRASHANT ICCHARAM JAISWAL ,'01481140067028,HDFC0000148
343,06a03e57-44c2-485b-b569-b63c96aa1dd6,MOSTAFIZUR RAHMAN ,'37662568579,SBIN0013090
344,c09ac8cd-e114-48ea-a4e6-4c7bedd52738,SYED SAIN,'153710100025343,UBIN0815373
345,7d9181b2-c8b3-4474-a1fe-8ef22af6062c,SUMIT GOGATE ,'50100378165591,HDFC0000257
346,78960a63-e550-42d2-8b49-fc3666a5634a,Dhaval Parmar ,'3645257617,KKBK0002576
347,8f83d9ed-1d18-4962-94d2-a834a0a5d7bd,MANISH AGNIHOTREE ,'50100382573420,HDFC0002649
348,5a7e21b3-b869-47f5-a625-873031f04834,CHANDRAKANTA  PANDA ,'50210001909898,BDBL0001035
349,0065e713-5ee9-49df-8a1a-d53ed8a595b1,KAJAL YADAV ,'201610110019763,BKID0002016
350,33217ec6-0ee8-4295-addd-d51b285510e6,SUBHADARA ,'04852300008004,CNRB0010485
351,7f7c1ac9-4511-48e0-8091-4bce9e799fe7,BAIBHAV BITTU ,'3120101001154,CNRB0003120
352,1ef5d942-efdc-4733-8168-dfcbf933ea27,SANDEEP RAYKWAR  ,'50100142303653,HDFC0003812
353,45f2403c-6cca-43b5-96d3-f2e1283a4310,FIRDOS MUKIM KHAN ,'920010051060107,UTIB0000111
354,9b83ea46-923d-486d-aaf4-c85e7addc306,GANESH ANANT  THUKRUL ,'004210100032286,BKID0000042
355,58cf84d3-5fa3-4544-afea-d0a3202563f5,ANOOP PK ,'007403550604190001,CSBK0000074
356,182283ff-c9a6-47fb-85fa-6959791650e7,IMRAN AHMED M F ,'232601504384,ICIC0002326
357,745769ac-5bae-4db6-8d0d-d699497a1a25,SUSHIL RADHESHYAM GIRI ,'315502010111698,UBIN0531553
358,bbf38a8e-4aad-414e-8729-131ac4af39e4,Harish Kumar M ,'919008043497,PYTM0123456
359,6d63ab5b-7e56-456f-a1c5-5cc45e50a92d,Umesh Meena ,'34442044410,SBIN0031783
360,2aa69695-4cd6-439d-b549-b93e3be6838c,LALIT KUMAR ,'3486092099,CBIN0280328
361,2c2d3a61-81fa-47f9-84cc-d550e4dda837,Yogesh Ashok ,'0312560230,KKBK0000958
362,b67e335d-fe8b-426b-bd62-4efc1b89891e,Hitesh Rajendra Jagtap ,'50100292574973,HDFC0000239
363,93a523bf-2442-4045-b53d-c17642d09e3e,Siddappa M Yalival ,'33366390691,SBIN0003151
364,31ab9747-6ffb-4795-91ec-5de37fdcf975,MUDASSIR HUSSAIN YUSUF SHAIKH ,'50100357900771,HDFC0001991
365,7ed36d2e-ce32-4b99-aa6e-f80885bc6b65,SHOAIB ISMAIL SAYYED ,'000501658082,ICIC0000005
366,dd3d6cad-f35f-423f-9c0c-08f6871bc7e6,KOLLURU SANTOSH KUMAR ,'9312039845,KKBK0000958
367,21913164-4f96-418b-8b6e-eba7086e58a9,NARASIMHA RAAMISETTI ,'068501504405,ICIC0000685
368,a6fc7766-e3bd-477f-8759-0a743100b66c,SHAIK SHAKEEL ,'30412210015970,CNRB0013041
369,0c727f36-9375-4428-b52f-b512227f47fd,Arun Mishra ,'10018645094,IDFB0020102
370,3731b0bf-df60-4d38-a98a-c9f3b97a9381,ANURAG PATLE ,'33431207503,SBIN0002828
371,371c2b70-f22c-4c32-8063-a101c61e5d14,LATIFSAB ,'30854529303,SBIN0006882
372,92a7e288-535e-40b3-9efa-0eab4fa700dd,Sandip Raghunath Khillare ,'322002010310905,UBIN0532207
373,f8d90e74-1ea8-4a98-8c68-6d2ac76e76c5,AMMAR ,'015104000397100,IBKL0000015
374,c96ebd3f-739c-47a9-87d3-51564170223e,Praveen Kumar ,'081610110002292,BKID0ARYAGB
375,96913858-6e3a-4241-9994-73798afd61e9,VISHNU R NAIR ,'50100358910390,HDFC0000464
376,28e48f33-c875-4393-90cd-aa3354d5b9c4,Suchismita ,'8811633196,KKBK0001753
377,fba705eb-5d11-4822-949f-53b3a415de66,DHARANIKOTA AVINASH ,'013410100118768,UBIN0801348
378,38339c3a-df5f-4946-847c-abbcf7c40faf,BULA AKHLAK AHMAD GULAMRASUL ,'552002010012660,UBIN0555207
379,548e9c71-9a76-431e-b415-255c0d60635e,GAGAN S ,'54057701599,SBIN0040899
380,23b9c356-b5ae-4ad1-98e8-0964b3ebdfca, SHEK AFZAL D  ,'100054102335,INDB0000167
381,7dd19ecd-83c9-4425-b013-ab09c537e342,PATEL NIKETABAHEN RAMANBHAI ,'38677063505,SBIN0050861
382,3d4b0a66-19b3-4979-b8a5-c4841838a733,SUMIT KADAM ,'10020073356,IDFB0040101
383,d564f450-0a86-4e3e-bc1f-ceeb162effb7,ERNAPATI KISHORE ,'000801623401,ICIC0000008
384,cedbd39a-a118-4e1d-8efa-cbda3f6840a6,VASIM SAJID INAMDAR ,'50100287686050,HDFC0000164
385,04063175-cf98-4511-9d51-f23ee5fd541d,PRABHU SUBRAMANI ,'61282010001374,CNRB0016128
386,795815dc-300e-4ec7-8627-a3f296933adf,Yaturi Anantheswar Reddy ,'920010066215457,UTIB0000152
387,8ab898f4-be57-49a7-8dc1-f98c375c5d15,VIVEKANAND  PANDIT ,'7366012155,AIRP0000001
388,69c4e793-bc35-45b9-91af-a2c5fb3f3eb1,SUMAN ,'0930001500141550,PUNB0093000
389,3f7cc099-30e9-4b3a-bca4-e0c870284cec,VIKAS PAL ,'082201510748,ICIC0000822
390,1e463051-8b82-45d4-ae7d-db41367100f4,GOVIND DNYANOBA BHUSARE  ,'62296874048,SBIN0020456
391,0c22a371-88c1-43ab-b1e3-c0f365ad290b,SHYAM SINGH ,'33718100002819,BARB0SOHNAR
392,e7c3132d-1978-4c4b-a7a0-8f74d42abd60,RAMACHANDRAN KUPPAN ,'399501502939,ICIC0003995
393,37b61e80-1457-4e3c-a8a1-7779e68bf8b1,VIGNESH SETTU ,'917010058878107,UTIB0000170
394,676fb2f6-400a-4be2-b2b9-d6564df95aae,Rajkumar Mallikarjun ,'266010100098236,UTIB0000266
395,d0aecca4-8d96-4f65-bb09-e7da46241e3b,ASHISH DHIRAJ PATEL ,'107209100000097,SRCB0000107
396,47f545c9-1aa5-4a5d-82e9-7fc1408965aa,GOVIND KUMAR GAUR ,'18920100009553,BARB0GEETAP
397,6d99370a-657d-419d-83cc-21874f42d1de,Ishu Milind ,'349601503154,ICIC0003496
398,609407b7-2c5d-466d-b40c-d60f0222aebb,MANGAM JOSEPH PAUL ,'31037413904,SBIN0009633
399,f40f309c-64b4-4244-880a-e7d962af390e,SAHUL HAMEED SOWBAR AJITH ,'3420101007890,CNRB0003420
400,cd91f4b1-fa5e-48c3-beb4-e9929e118de1,PRIT VALLABHDAS ADATIYA ,'38510033036,SBIN0015056
401,af741396-f5b3-4505-b139-d4eb9c78e74a,SAILESHWARAN DAKSHNAMOORTHY ,'920010000004668,UTIB0003964
402,792794cf-6a53-43c3-9bab-3c0e1309bd4d,Monika Rajput ,'174001000527,ICIC0001740
403,2d176d96-edf3-492d-9fb5-a91722696c84,MUNIRAJA N ,'01661050115913,HDFC0000166
404,c19ff601-d14a-4238-85de-5034a357a370,SYED ZAHEER ,'100034166618,INDB0000004
405,e6aabbb2-f276-476d-92bd-45238b95aeb4,Pradeep Kumar Sethi ,'7377634709,AIRP0000001
406,b59f6eb9-71e6-438e-af41-1f4b551e7aa2,MANNURU MURALI KRISHNA ,'08472191040790,PUNB0084710
407,1990f363-d591-4c06-acfe-384aafba47f7,Kunal  ,'661401567808,ICIC0006614
408,697d875b-3063-4dde-9068-e4d70de05a1e,MAHFOOZ ANSARI ,'15460110080146,UCBA0001545
409,9ab17190-339f-4f4f-9da5-a2dbf45ec614,BALAI MAJUMDER ,'359104000010663,IBKL0000359
410,ec281fd9-97c9-4920-922c-5c740caeddb4,YONAK BAKTHAN J ,'100801537251,ICIC0001008
411,fb2fa9cc-d6a6-4b6c-90dc-f5c98b0f5d28,MOHD NAHEED  ALAM ,'915010018870453,UTIB0000636
412,039932c3-b60e-45ba-8e56-3f5783982f0f,DINESH KUMAR ,'33938100027430,BARB0BANDIK
413,43b0ee7a-6654-436c-8ef4-9ded9a66e009,NILAMBAR KUMAR SHARMA ,'31894378063,SBIN0014300
414,e6bcc72e-01ef-47c5-a65e-d6f2c08de765,SAHID AHMED ,'309008579656,RATN0000102
415,c5162085-2c3c-4cda-982e-810cbeaac735,ANIL VERMA ,'65760100003335,BARB0VJPASE
416,90eee26b-abed-4d37-9cf9-b56b8e1a8c8b,Nikunj Bhatt ,'029401523669,ICIC0000294
417,17bb7fdd-1ca0-454b-a669-267b58edbdc2,Pinku Yadav  ,'100001426806,INDB0000012
418,090d603d-a5e8-4b5c-84e8-427902718e8b,MANISH SILLARE  ,'60195379462,MAHB0000796
419,11c57aec-95cb-4a09-bdc7-dae66c0d0154,MANGESH CHAVAN ,'121701505157,ICIC0001217
420,fdcdae42-031d-4665-ba99-0bd8d26b49be,SANTOSH KUMAR ,'31724348819,SBIN0003909
421,ecb52965-8787-4558-b771-6971227098c6,DINESH SHANTARAM ,'566602010009526,UBIN0556661
422,7cfa1008-fcf3-424c-8de8-138bf1df6835,RAVI MISHRA ,'20409986680,ALLA0210087
423,9da67830-6959-46d8-8ed2-416a605d5bdc,Jagjeet Singh ,'04611000008429,PSIB0000461
424,0320a920-6008-4935-813f-370d30184741,Bejjanki Rakesh Kumar ,'610102010002826,UBIN0561011
425,baffa19a-6a82-44ee-81d0-a939d25230e7,JASHRATH VERMA ,'954002661,IDIB000S189
426,0305fcb0-b211-41e3-ada9-a2a0b9c6b614,NAVRATAN BHAKHDIWAL  ,'50100255585195,HDFC0000554
427,3c8873d6-7ae7-4968-9e5c-ec7eb611ca01,SURAJIT DEB ,'8787449301,AIRP0000001
428,b27e074c-9365-4269-a26e-0af667c64883,LAWAKUMAR PEERAPPA HARIJAN LAWAKUMAR PEERAPPA HARIJAN,'345300101000339,UBIN0934534
429,af8fec4c-984f-4021-9670-e400cec91a83,DHIRAJKUMAR NITIN PATIL ,'4563010018047360,JSFB0004563
430,be2a354e-5b7e-4f18-8be5-ae48f422b8de,Pradyumna ,'520451007145725,UBIN0900745
431,465ec262-91ef-4cd8-9c2c-0a73b92921f3,Mohammed Rooshan Ali ,'7612898223,KKBK0000958
432,5b659d87-2455-46f2-8d71-a1e9308056f7,SORODINDU DEY ,'555802010009653,UBIN0555584
433,035f32c9-a8d1-4f46-8274-61ffc8e51532,AVIK CHATTERJEE ,'919010083105520,UTIB0000005
434,4d941427-bb81-4c2f-a354-bc6eb2bb9953,CHITRA G ,'2906118000287,CNRB0002906
435,c4e9c08e-f866-430a-afed-fd36bba4a935,BASAVARAJU S ,'1212500101885701,KARB0000121
436,6381178b-5f80-4125-86d8-408701c14aab,Chetan Gurunath Dharane ,'50100327523224,HDFC0000567
437,c7a6a2fb-6048-489f-8c44-fb8ba0cf6895,Ajay Kumar ,'50388045618,IDIB000A534
438,f2c76719-1e41-4bbf-8c5f-0afe3606c700,JORIGE TEJA KUMAR ,'159398282833,INDB0001004
439,c1dedbcf-2f8c-451f-abfc-085a5d239343,Chandan Kumar ,'2794000100209358,PUNB0279400
440,32bc9108-a5c8-4e5a-a71d-6fba46f6cae4,VINOD C ,'64158782683,SBIN0040268
441,c311a0df-77eb-4411-91d6-9013743a5251,TELAPROLU VENU ,'20100003820178,FSFB0000001
442,b0670821-855b-4d81-bfb4-db70cb4d2788,MOHAMMAD ZAHAGIR SIDDIQUE ,'576010110005923,BKID0005760
443,7e75d1b5-976a-4ec8-b2ad-f2aa254eed51,SUDHIR BUDHIA ,'30981949505,SBIN0016591
444,62319933-e274-48d3-9b5c-a610ab3ff7c4,Chauhan Yunushmiya  ,'20132327110,SBIN0000301
445,7bce2f87-93eb-42e9-9f27-9609c3e4cd1c,Sk Sahabul ,'3340110010051291,UJVN0003340
446,a39b957a-3513-4d7a-bcdc-f21cd16331c4,Manoj Kumar Gouda ,'32447118995,sbin0003381
447,af4559fd-c1e1-42f5-8909-8ee0e9b91985,Mohankumar Baskaran ,'9894015429,AIRP0000001
448,4777e9fc-b4ad-4784-b1a5-11ea1d92ab24,MUTHUKUMAR RAMACHANDRAN ,'30296728721,SBIN0004882
449,11d8dda4-3ea6-48eb-a5b6-c3ad6ede19bc,Kocharala Ravinder Kumar ,'000801581140,ICIC0000008
450,e2f26199-ac48-4595-b9a7-cd26ab33f4a6,GAGANDEEP MORIA ,'50100328955823,HDFC0000431
451,5762ad36-19b1-45ce-bf46-f58bf660c591,AKPOIJAM IBOYAL SINGH ,'50100344455680,HDFC0002336
452,002cb86c-1bed-4b76-ab58-598deec85499,Anand Shantaram Waghmare ,'115010100417891,UTIB0000115
453,99b01870-741e-42e6-a3d5-e4995d503aeb,MANOJ PRIYADHARSAN PAULRAJ ,'001601561310,ICIC0000016
454,4065878b-eeea-4213-bd56-79ab50004887,RAJ KISHOR MAHTO ,'10052571399,IDFB0021331
455,fad79017-73b7-4ce8-94d1-c7ec76eb6878,SARAVANAN P ,'50100380094042,HDFC0001868
456,db56f755-db50-435c-a2fa-c501861cd982,CHITTURI SUDHEERKUMAR ,'238401503041,ICIC0002384
457,778e747b-8397-453d-967d-0385a9c68167,NAEEM ,'38423578865,SBIN0004741
458,e3a1ba95-cb33-4d00-8b73-f313fbc2fe4f,Arijit Biswas =UPPER(B92),'3317110080053227,UJVN0003317
459,f121277c-3c59-43d1-82ea-fb4d9790524b,GAURAV ,'50100338905549,HDFC0003666
460,2853e3c2-a60f-4670-801d-7df730f7ddd4,MOHAMED ASARUDEEN M ,'3042120000177,CNRB0003042
461,583a9beb-1732-4f6b-ba24-2de881a205ce,SUMIT KUMAR ,'158579992101,INDB0000749
462,d466766d-404e-443b-9337-739b79788344,MUKESH SINGH RATHORE  ,'01258100006983,BARB0PISANG
463,aef01911-0510-4362-bd30-e38e57d13607,MANJEET SINGH ,'038701508975,ICIC0000387
464,dc0237eb-5c23-4227-8f37-732779c258a9,ALOK KUMAR VINOD KUMAR SINGH ,'27340100023163,BARB0BLYTHA
465,9a11b0f3-4506-4c16-b023-aa2e4ae4d593,ALOK DINKAR PANDE ,'076104000278119,IBKL0000076
466,7cb595b3-ad4d-487e-9746-a04e5d59b06d,Arvind Kumar ,'030701511057,ICIC0000307
467,55760325-4e0f-4187-b46a-5b596fe109c3,SATISH SHUKLA ,'358202010103701,UBIN0535826
468,13e6bf58-4737-4c56-83cf-8d45dba99e8e,HARSH DODIYA ,'202210110004845,BKID0002022
469,5646a161-8b4c-44e5-8508-5128f0776faf,ANIL RAJU ,'50100314042881,HDFC0000356
470,576f0e81-8c02-4139-bbd6-fb95f173fab2,SURYA MUKHERJEE ,'8212018677,KKBK0000958
471,05be5e6e-2fcb-4f77-8deb-bc4da4e8c465,Dalbir Singh ,'3114732140,KKBK0000958
473,e5ef85ca-9e35-47a2-a984-abc05b4a7443,SANDIP MUKHERJEE ,'919010065169331,UTIB0000501
474,2311f22d-9da6-44d0-a7d9-0bc48652ce69,RAKESH PANDEY ,'32388955189,SBIN0011536
475,bbb587b2-c8a3-470c-ba1b-e41b9c056a87,SONU ,'629101514187,ICIC0006291
476,8a680305-5de6-4cf6-92a3-bb4fb9e61de5,UMESHKUMAR U ,'07652010006986,CNRB0010456
477,ba1f1026-e586-414a-a3e8-dd8ad58c46b0,POTURAJU CHINNA ,'067401002769,ICIC0000674
478,291ca43d-4729-4729-b579-11ad2754d26c,RAVINDRA VINAYAK JOSHI ,'187201503225,ICIC0001872
479,477e5fee-0247-48b5-9587-5a1a1ad5e796,GANESH VASANT KUCHEKAR ,'60180870989,MAHB0000116
480,406ec944-cafe-492f-ba84-5ce7b0f38080,KIRANKUMAR N BORAWAT ,'11116101024326,PKGB0011116
481,138e9280-15a7-4e22-95af-c163e925d727,RAHUL CHITLOJWAR ,'32871316958,SBIN0011588
482,772aeb44-ffe0-421a-bde0-2adeb021804d,ASHUTOSH PATEL ,'20281624019,SBIN0012271
483,4bd865c6-24a0-4606-9740-1db2c209e0fa,GADDAM SURESH KUMAR REDDY ,'1113710312,KKBK0000958
484,43671cf6-2752-470c-983b-e08a807d80a4,SAGAR M K ,'634402010003256,UBIN0563447
485,21a18278-24e9-4430-bdd9-cf1c251cc4f0,BHUMESH DEWGIRKAR ,'12481050019835,HDFC0001248
486,ef2aab2e-3fd1-4cb8-bac7-e7c823e9ad76,SHIVAKUMAR B N ,'4514101002455,CNRB0004514
487,f9b7c8fe-6626-4b85-95c4-33d0c158afab,MRITYUNJAY BOSE ,'35386907893,SBIN0003466
488,d942dfe9-aa49-4117-b4ab-ccdd02179d21,LAVANYA R ,'50100151112124,HDFC0003820
489,aefe6feb-5338-43cf-b95d-c8e08f42f16d,MAHABOOB D ,'50441726776,IDIB000A630
490,8f45febd-3eb9-4640-a2ff-4e7d10104a48,Ruthipakam Prashanth ,'219210100027846,UBIN0821926
491,ffaca924-8fe4-4ae7-bfa0-37c6597268e0,VISHNU ,'2114503705,KKBK0000958
492,45ab8001-d639-4f72-b23c-b42691bede98,BELLAMKONDA SIVA PRASAD ,'315010229025,KKBK0000958
493,f57a82f8-4ece-467d-914b-5741d0e249fe,SONU SINGH ,'919990953822,PYTM0123456
494,0ba9e70e-e708-4c5e-bce9-ecc22e09b9ca,Manneti Gangadhar Reddy ,'067401509110,ICIC0000674
495,499e53d3-d18c-4df0-bf2f-8f2af208a4ac,BABY  C S ,'50100321196532,HDFC0002710
496,359226e6-6d75-4e9c-bba7-ab945b5d7636,CHAKALI MADHU SUDAN ,'10048458643,IDFB0080201
497,ffb2dd9c-3502-41b2-8da0-3c6baba92037,ASHOK KUMAR NIGAM ,'27950100021770,BARB0JAISAN
498,90db7124-7d5a-4906-8c2c-51676ac2df61,SIDRAMA ,'62249177509,SBIN0021540
499,5bfe20f3-90c5-4712-a9b3-0c509c411aa1,Lakshami Narayan Choudhary ,'230203100004942,SRCB0000230
500,1b7ea19a-e568-4c01-816e-5787556b00f7,Nikhil Singla ,'0171000100356295,PUNB0017100
501,4a0ff395-8885-4007-9864-31d0e7d6d2fb,RAMESH RAJENDRA KONDA ,'392203100012835,SRCB0000392
502,4f69918e-59e5-488b-9249-86f133d309ad,K.KARTHIK PANDI ,'50100314331563,HDFC0000123
503,b594b980-dbc8-4408-b870-6b21cf521814,SUBRATA MAJUMDER ,'1467104000173667,IBKL0001467
504,b372dd6e-6081-4e15-8b91-db0ae1e7d04f,GURMEL SINGH ,'50100246586260,HDFC0003383
505,0f845676-ff87-4d1d-9dbf-76f5c763362c,Vishal Vitthal Bhandari ,'215201519554,ICIC0002152
506,3f5db01d-3cbd-4d84-acf5-d495d4386793,Emmaneni ,'52207202906,SBIN0020076
507,9cd822bb-9f60-4d65-b5bb-374c46911b9c,PIUSH CHAUBEY ,'757702010006705,UBIN0575771
508,a3094179-07e2-4edf-b719-e5dd859fad36,DEVENDER ,'0343104000058104,IBKL0000343
509,1fcb8727-f512-4e05-912e-9b4cecd13cb0,NEERAJ KUMAR ,'662801530368,ICIC0006628
510,1f8eb64b-4891-453b-b5dc-43c23a1f09a6,KAMLESH VERMA ,'50100229312419,HDFC0000044
511,5a486da6-d1b2-417f-b0f8-9cb9e1844c57,Venu Aderla ,'52106143320,SBIN0020556
512,8f21ea36-1398-4408-bc8e-fa2f5232e247,MAMAS KUMAR MAHANTA ,'3672500100587901,KARB0000367
513,c147c69b-4190-45bf-9338-b10064d60c76,AMAN SRIVASTAVA ,'726602010004370,UBIN0572667
514,71a121cd-c64f-4276-ab15-b3626428454f,BOLLAM MADHUSUDHANA ,'31026903333,SBIN0017408
515,ee7e6460-31ed-4bff-a4e3-a0342d52217c,Sachin Bhandari ,'628101555981,ICIC0006281
516,4169cbbe-cc8e-4a59-b51c-301c01a0d8d3,VAJITHA PARVIN ,'33268677664,SBIN0030284
517,63278471-5317-495e-88ec-5ed071a4c606,Ritika Sharma ,'50100401865385,HDFC0003790
518,9abcd673-2ab7-44a5-a9b0-4d158a7ca4a8,CHANDRESH KUMAR ,'50100180794872,HDFC0001888
519,ba9825da-713f-4a30-ad69-d500b3a15945,NALLAGINALA SAI RAM ,'7612435725,KKBK0000958
520,dbc2f6f5-938d-43de-9ff6-581162d78677,Anurag Mishra ,'153110100016530,UBIN0549487
521,099cabcc-1e53-4f27-8f46-8624ecfc0c26,MOHAMMED AZEEZ KHAN ,'9382500100984601,KARB0000938
522,8b862b05-86cd-42a6-b749-fa63e36ccfad,RAVINDER SINGH ,'309202010077165,UBIN0530921
523,4232ad76-a323-4ea3-b5dc-5d2de551c72d,Hareshbhai Shankarbhai Rohit ,'37673194199,SBIN0050877
524,ae42d5f9-35de-4c66-8a12-edcb7e7af5fd,Enayathulla Khan ,'919010064037855,UTIB0003200
525,b335ea74-cf4d-4a87-b15e-4d753f5d9950,DIWAKAR GUPTA ,'918010025509507,UTIB0002998
526,fffb8c92-c4d5-404e-a50c-40fc2052264f,AAVISHKAR V KOTIAN ,'02322210032578,CNRB0010232
527,5ca9b329-33da-4571-b384-f9a71de0a641,ALOK RAJ ,'440110510001255,BKID0004401
