{"itemCount":11029,"md5Checksum":"UBUJ787hOCJugYfHdT6bZA==","etag":"77fe3fe4283c90f666b89d1a0fcc4d29-1","dataFileS3Key":"AWSDynamoDB/01646202795360-4603f3c2/data/aidt4aspye7wfmafhyjp5w5o6m.json.gz"}
{"itemCount":11306,"md5Checksum":"CfGfkXf0kwm+a7Jv9pMSLg==","etag":"0531b56ab9fd13666b4939dfba536d44-1","dataFileS3Key":"AWSDynamoDB/01646202795360-4603f3c2/data/pdsu2vjuqq63visgp4koqtzp2y.json.gz"}
{"itemCount":11297,"md5Checksum":"njYQXjVNxpiD+P5e0y92dA==","etag":"4c18898670768b742273fa9e3b386da2-1","dataFileS3Key":"AWSDynamoDB/01646202795360-4603f3c2/data/cnciacqzhy2vtayalauknzahoi.json.gz"}
{"itemCount":11219,"md5Checksum":"BPPbS2Uxnr7ESi7pUqyb+w==","etag":"d6b9bf3ed196827448f1f0fa6989ebda-1","dataFileS3Key":"AWSDynamoDB/01646202795360-4603f3c2/data/hnuw3cn4ry4ermu367v3be2loa.json.gz"}
