{"itemCount":6062,"md5Checksum":"Wkmo09A3KSE93CyqN6RTbA==","etag":"0cf6331b50492021d1ff3a31771b0f6c-1","dataFileS3Key":"AWSDynamoDB/01638672900412-214fc2f5/data/yziwef7mdq2tpig6k4s4uqh3ha.json.gz"}
{"itemCount":6163,"md5Checksum":"XoNExY7vpIFcrntKg0Lbjw==","etag":"d46d70a6c44b0577e0967122da6cf7ae-1","dataFileS3Key":"AWSDynamoDB/01638672900412-214fc2f5/data/5hpcvjmonuy25ljlcrcku76imi.json.gz"}
{"itemCount":6199,"md5Checksum":"i1QCMVDHQ5wQkSsdHIiPBg==","etag":"ac5721cd09aebc24f07dd61d68f27cb9-1","dataFileS3Key":"AWSDynamoDB/01638672900412-214fc2f5/data/mrrgjcmwmq76vpaqm7rwhlhjle.json.gz"}
{"itemCount":6112,"md5Checksum":"yT7msFon/NuuWPW5aiHAcg==","etag":"99a62c69d342f4c858885c1359b6f773-1","dataFileS3Key":"AWSDynamoDB/01638672900412-214fc2f5/data/b2jappxe6a2mxj5y5zxrqmx2fa.json.gz"}
