{"itemCount":10744,"md5Checksum":"hyItJ5RM2pid+fjBJy6FKg==","etag":"d01c5bd155ee22614a9ea0676b2b95d2-1","dataFileS3Key":"AWSDynamoDB/01645605913686-724e1db8/data/sylfyfrcwq25rpl5ghbhhozism.json.gz"}
{"itemCount":11032,"md5Checksum":"xTCWxS2RgRn7lLFRvBi7XA==","etag":"d8b899af5c42dec0f2617621669c0137-1","dataFileS3Key":"AWSDynamoDB/01645605913686-724e1db8/data/ori5pwxlgm57rk2rrvntfyadjy.json.gz"}
{"itemCount":10987,"md5Checksum":"Htd34ld3qpzKMISDJirjjA==","etag":"0bf94481b32cfb3ce568db3991b1110f-1","dataFileS3Key":"AWSDynamoDB/01645605913686-724e1db8/data/k6lkhkcjy45otmmw4uy5mu4rxe.json.gz"}
{"itemCount":10920,"md5Checksum":"mHl7sfVMwdrJ57I9XmohnQ==","etag":"81d672324b61094f6bdba880ae2b3cea-1","dataFileS3Key":"AWSDynamoDB/01645605913686-724e1db8/data/xfgw6i7khu3vtnb6fnlnx2nrba.json.gz"}
