,user_id,full_name,email,phone_number,metadata,document_number,wage_per_month,data
0,854e6a07-4eda-4279-8136-d73216bfa8a9,MARIYARAJ ,mariyaraj.m@gmail.com,9042203533,"{'gender': 'MALE', 'birth_date': '1991-04-10'}",CKRPM4724Q,22073,Last name is Missing
1,f121277c-3c59-43d1-82ea-fb4d9790524b,GAURAV ,gaurav.gaurav6@bizsupporta.com,8307322072,"{'gender': 'Male', 'birth_date': '1999-12-02'}",CLRPG1073R,42774,Last name is Missing
2,701c1a8e-a22d-495f-a21d-938fe963d9a0,DHANESWAR DHIR ,qs2126193@example.com,9668888864,"{'gender': 'Male', 'birth_date': '1991-01-01'}",HFSPD1291E,9000,Wrong State Code 
3,6000df27-7c1d-4938-99d7-e791372e2ccf,RUPESH SAHU ,RUPESHSAHU422@GMAIL.COM,9754028329,"{'gender': 'Male', 'birth_date': '1994-08-18'}",HERPS4685R,14061,SYS100007(Invalid State)/ SYS100005 (Additional Address Mandatory field missing)
4,4978c886-798c-479f-9ffb-f31107196cd7,Vangala Rajashekar ,vrajashekar@gmail.com,8978299264,"{'gender': 'Male', 'birth_date': '1993-09-20'}",BIQPV3290L,12096,Wrong State Code 
5,980e696f-812f-41ef-a8f8-e5dd9e0e5446,BALWANT D GAWANDE ,balwantgawande@gmail.com,7620515850,"{'gender': 'Male', 'birth_date': '1990-01-01'}",AMRPG9968L,15490,SYS100007(Invalid State)/ SYS100005 (Additional Address Mandatory field missing)
6,cd47eafd-f4b2-4454-9c4c-f64bdcf1f1ba,RITESH DHANGAR ,riteshdhangar199@gmail.com,7898615182,"{'gender': 'Male', 'birth_date': '1995-01-29'}",DLYPR1928E,11142,SYS100004  (No record found)
7,933b04aa-b4a7-4e3e-9469-8478640a4294,G UPENDAR ,upendar.3311@gmail.com,7036865345,"{'gender': 'Male', 'birth_date': '1989-08-26'}",AYWPG9041R,31512,Wrong State Code 
9,c2a11de1-1a6b-4754-9d38-a4918e149039,SWATHI ,2001448671@example.in,9945744470,"{'gender': 'Female', 'birth_date': '1995-11-29'}",IRLPS9011M,16213,Last name is Missing
10,b72e642e-7e35-48ca-bdf0-82f16d000a22,RAJNI BHUSHAN KUMAR ,2001647213@gmail.com,9852625735,"{'gender': 'Male', 'birth_date': '1986-01-01'}",BWDPK3333A,26295,SYS100007(Invalid State)/ SYS100005 (Additional Address Mandatory field missing)
11,7affc938-46ed-4cd6-9521-508be10a2b59,Tinku Jaiswal ,tinkujaiswal2011@gmail.com,9372233684,"{'gender': 'Male', 'birth_date': '1997-04-06'}",ARFPJ4276M,5942,SYS100007(Invalid State)/ SYS100005 (Additional Address Mandatory field missing)
12,72ef0280-b104-43f8-84cd-8432c7b94ed1,VIJENDRA ,2001344431@gmail.com,9009985571,"{'gender': 'Male', 'birth_date': '1995-01-29'}",BJPPV7225K,13279,Last name is Missing
14,bce63796-3e40-4175-97b8-7281a867d353,N DEVARAJULU ,QS2164825@gmail.com,6301238083,"{'gender': 'Male', 'birth_date': '1991-03-16'}",BLDPD9377E,11400,SYS100007(Invalid State)/ SYS100005 (Additional Address Mandatory field missing)
15,a7234ff0-b9c2-4de4-b367-900a9cf3a3ef,SUNIL KUMBHAR ,QS2172692@gmail.com,9078376737,"{'gender': 'Male', 'birth_date': '1990-06-05'}",DYNPK9943J,15913,SYS100007(Invalid State)/ SYS100005 (Additional Address Mandatory field missing)
16,c9724a0d-8a5e-452f-bd7c-020cf9126ce0,SUDHIR SURESH GUPTA ,2001691852@gmail.com,9136771645,"{'gender': 'MALE', 'birth_date': '1999-02-02'}",CBRPG8023K,14023,SYS100007(Invalid State)/ SYS100005 (Additional Address Mandatory field missing)
17,f8d90e74-1ea8-4a98-8c68-6d2ac76e76c5,AMMAR ,QS1932587@gmail.com,9918336852,"{'gender': 'Male', 'birth_date': '1994-08-07'}",ARKPN7601H,18340,Last name is Missing
18,3cc0057e-4e6d-429c-a846-a79000716ea0,ABINASH MOHANTY ,abinashm626@gmail.com,9692142921,"{'gender': 'Male', 'birth_date': '1986-03-08'}",BGZPM8464J,19951,Wrong State Code 
19,af741396-f5b3-4505-b139-d4eb9c78e74a,SAILESHWARAN DAKSHNAMOORTHY ,2001490192@gmail.com,9003413748,"{'gender': 'MALE', 'birth_date': '2000-03-09'}",HBJPS6230K,0,SYS100007(Invalid State)/ SYS100005 (Additional Address Mandatory field missing)
21,c19ff601-d14a-4238-85de-5034a357a370,SYED ZAHEER ,sza0292@gmail.com,8125147011,"{'gender': 'Male', 'birth_date': '1992-02-12'}",ABEPZ5778K,15291,Wrong State Code 
22,4128e544-d43b-4a98-9472-4d1a947d0117,SATISHA  ,QS2039314@gmail.com,9986215755,"{'gender': 'Male', 'birth_date': '1987-07-05'}",GSEPS9719E,18705,Last name is Missing
23,967b5dd1-6ce0-487f-87fd-33a79983c1f3,BANKEY BIHARI ,QS2206350@gmail.com,7830210877,"{'gender': 'MALE', 'birth_date': '1997-11-10'}",CMPPB0677K,13813,SYS100007(Invalid State)/ SYS100005 (Additional Address Mandatory field missing)
25,d05eb840-c291-40c4-bf37-e5d272d1d612,T S VINOD ,2001672149@gmail.com,8095684292,"{'gender': 'Male', 'birth_date': '1981-04-01'}",AWQPV5970Q,23504,SYS100007(Invalid State)/ SYS100005 (Additional Address Mandatory field missing)
26,097d9dbc-0c1b-4d10-8d8f-93e853e9f804,AMBAR SATYAM ,ambar.satyam@bizsupporta.com,8579010040,"{'gender': 'Male', 'birth_date': '1996-12-08'}",DWRPS2400C,17181,SYS100004  (No record found)
27,b32cf7f9-3a84-4b63-90e6-5abfe97d6f3c,Vishnu Raj Balasubramaniyan ,vishnudct30@gmail.com,9600047773,"{'gender': 'M', 'birth_date': '1997-06-30'}",BJMPV5905K,48385,SYS100007(Invalid PIN Code/Invalid Additional Address PIN)
28,22ace196-6e47-4027-ae5f-ee4d87b64273,VINOTH  ,QS1929145@gmail.com,9591861467,"{'gender': 'Male', 'birth_date': '1988-11-01'}",BKKPB1637H,43256,Last name is Missing
30,d458d36c-f5fd-4728-8563-1e01d5935f43,Sravani ,sravani.vsn055@gmail.com,6302110308,"{'gender': 'F', 'birth_date': '1995-06-20'}",BLYPV9981R,41650,Last name is Missing
32,b96445e5-5ce3-4281-a355-71c77f0c24e1,DEEPAK KUMAR ,deepak.kumar1@bizsupporta.com,7503456707,"{'gender': 'Male', 'birth_date': '1994-04-11'}",CPDPK7247B,22886,SYS100007(Invalid State)/ SYS100005 (Additional Address Mandatory field missing)
33,dc2df204-a980-4b8b-90f6-0cc863f27e39,RANGANATH ,ranganathk102@gmail.com,9986286862,"{'gender': 'Male', 'birth_date': '1992-10-10'}",AYMPR0244F,13883,Last name is Missing
35,d87260a6-875d-44fd-9d9b-42480bf728ad,AKASH ,akshtwr1@gmail.com,7054126517,"{'gender': 'MALE', 'birth_date': '1988-12-15'}",ALKPT8908M,41129,Last name is Missing
38,30af4ec1-1971-4329-ab5f-b4273af9679a,Bhawana ,bhawanaarora08@gmail.com,6301219399,"{'gender': 'F', 'birth_date': '1991-08-12'}",BIRPA3922R,50045,Last name is Missing
39,6ae047c4-32ec-4654-8c8f-272f859e9acf,PATEL JIGAR ,2001578186@gmail.com,7043981435,"{'gender': 'Male', 'birth_date': '1995-01-29'}",EPCPP4653B,8805,SYS100004  (No record found)
43,14886d99-1354-4aa1-82d0-2572c11a3203,GOVIND ,govindbora77@gmail.com,9456131081,"{'gender': 'Male', 'birth_date': '1995-08-16'}",FRXPS5043A,12999,Wrong State Code 
45,676fb2f6-400a-4be2-b2b9-d6564df95aae,Rajkumar Mallikarjun ,rajkatla999@gmail.com,9860097989,"{'gender': 'M', 'birth_date': '1987-05-02'}",BAKPK3403L,32411,SYS100007(Invalid PIN Code/Invalid Additional Address PIN)
47,e93f5f43-064c-4019-9492-b881739e9b8a,Rajesh Kumar ,rajesh.uhs@gmail.com,9502267897,"{'gender': 'M', 'birth_date': '1984-05-06'}",EPZPS4009M,29564,SYS100007(Invalid PIN Code/Invalid Additional Address PIN)
48,2ad9a47a-690b-423f-96da-1ab0282a4527,Roshani Mahesh ,roshani.waghmare15@gmail.com,9766002174,"{'gender': 'F', 'birth_date': '1995-04-21'}",ACXPW9482D,50716,SYS100007(Invalid PIN Code/Invalid Additional Address PIN)
51,65b3b016-d79c-489d-8c65-f6c842ebaec6,PRATHMESH JADHAV ,prathmjadhav1497@gmail.com,8454895297,"{'gender': 'Male', 'birth_date': '1995-01-29'}",BHEPJ4299J,0,Wrong State Code 
52,e5061024-ba19-4d97-b442-2b644540228a,SHAIK RAFI ,2001706337@example.com,9966110507,"{'gender': 'Male', 'birth_date': '1997-03-17'}",HSTPS0608L,10004,Wrong State Code 
53,b0800a40-c4f4-4276-8403-bb3eb5576dfc,LAXMI SAKHARAM SHEDGE ,laxmisedge20@gmail.com,9920958019,"{'gender': 'FEMALE', 'birth_date': '1995-01-20'}",FVEPS5384F,29464,SYS100004  (No record found)
56,24c6a617-66d3-4573-8806-308dd5e50b03,BIRRAJU DAMODARA VENKATA PAVAN ,birrajumanikantavarma@gmail.com,9494796970,"{'gender': 'Male', 'birth_date': '1994-01-16'}",CBBPB5131K,32482,SYS100007(Invalid State)/ SYS100005 (Additional Address Mandatory field missing)
57,dee005b2-d3e0-41ee-a8a9-1e65a516fa0a,BIJENDRA KUMAR SINGH ,bijendra.bba@gmail.com,9708161247,"{'gender': 'Male', 'birth_date': '1991-01-04'}",FBCPS9424J,10534,SYS100004  (No record found)
58,70336c44-d13c-4348-ada4-01d6cdbda30b,S ,akashtripathiid7@gmail.com,8791503960,"{'gender': 'Male', 'birth_date': '1997-04-06'}",BURPT7746N,3976,Last name is Missing
59,11ecda65-e350-4cc8-b9f1-145403147698,Manoj Yadav ,manoj.samsung80@gmail.com,9307825464,"{'gender': 'Male', 'birth_date': '1976-11-14'}",ABLPY8506F,20618,SYS100007(Invalid State)/ SYS100005 (Additional Address Mandatory field missing)
60,a252c894-38e8-4862-abe8-78335dc30189,BHOOPATHI ,2001647056@gmail.com,9566610317,"{'gender': 'Male', 'birth_date': '1990-01-17'}",FQZPB3507F,0,Last name is Missing
61,3c80ea4d-e633-4250-b47c-9e0647b0fcaf,GADILA  PRAVEEN ,gadilapraveen57@gmail.com,9618234047,"{'gender': 'MALE', 'birth_date': '1997-08-26'}",CTFPG1651R,21883,Wrong State Code 
62,a7753948-19ab-42f3-bcde-c76ca75a2e98,KOTCHERLA RAGHU ,1088934@dummy.com,8500251152,"{'gender': 'male', 'birth_date': '1990-07-23'}",FYPPK8280N,19964,SYS100007(Invalid State)/ SYS100005 (Additional Address Mandatory field missing)
63,68d44428-5f8e-4635-97c3-9d367d847234,RAMIZ KHAN ,QS2164044@gmail.com,9758093678,"{'gender': 'Male', 'birth_date': '1992-04-03'}",DQKPK9969R,6612,SYS100007(Invalid State)/ SYS100005 (Additional Address Mandatory field missing)
64,7dde87fd-40f1-437e-bdc9-b098c25a4087,AJAY KUMAR SHARMA ,98873116667374@dummy.com,9887311666,"{'gender': 'MALE', 'birth_date': '1993-07-26'}",BNTPA4778A,25208,SYS100007(Invalid State)/ SYS100005 (Additional Address Mandatory field missing)
65,cc38e5e6-8828-40cb-be4d-0051a335a2e8,PRAKASH BASAPPA BELAKINDI ,prakash5.bk79@gmail.com,9741015190,"{'gender': 'Male', 'birth_date': '1993-01-01'}",BPMPB2810R,13283,SYS100004  (No record found)
66,a18538ce-d287-417c-acea-d0d506ca413d,AJAYDEEP SINGH ,ajaydeepsingh@ymail.com,8284003220,"{'gender': 'Male', 'birth_date': '1992-06-28'}",GWHPS4804P,22421,Wrong State Code 
68,20383fa3-5200-4b02-a412-7f2971d7a5b6,ISRAR ,israrahmad931060@gmail.com,9711912193,"{'gender': 'Male', 'birth_date': '1988-04-12'}",AFOPI1362L,15708,Last name is Missing
71,1798d6b2-0451-43df-a39e-ea8cf54702eb,SATYENDRA DEV ,QS1989598@gmail.com,8090908005,"{'gender': 'Male', 'birth_date': '1990-01-01'}",CGBPD0948K,29198,SYS100007(Invalid State)/ SYS100005 (Additional Address Mandatory field missing)
72,f1d56541-1092-49cd-bc51-23be5a40bf8c,ANURAG MISHRA ,P-ANURAG.MISHRA@industowers.com,9670845621,"{'gender': 'Male', 'birth_date': '1986-07-25'}",CIXPM5179H,15680,SYS100007(Invalid State)/ SYS100005 (Additional Address Mandatory field missing)
73,8c0c52ee-881b-43e2-8e7a-7f01c97a3e79,DHARAM NISHAD ,nishaddharam@johndeere.com,8889839299,"{'gender': 'Male', 'birth_date': '1991-12-13'}",BFUPN5151D,18824,Wrong State Code 
74,e102dd10-593b-412b-a5be-36f67a948ad7,VEERU ,veeruy555@gmail.com,8742927612,"{'gender': 'Male', 'birth_date': '1996-11-07'}",Bkr0v2912g,10996,PAN No is not in Correct Format
76,edc4ed35-ddeb-404d-97bf-7ae134ad7ce4,AMIT SINGH ,amitsinghamit0099@gmail.com,9582542177,"{'gender': 'Male', 'birth_date': '1995-03-15'}",FSTPS9621H,14735,SYS100007(Invalid State)/ SYS100005 (Additional Address Mandatory field missing)
80,94d02136-ce47-4b3d-830b-410354ce6503,VENKATESH S B ,2001697022@gmail.com,9940590903,"{'gender': 'Male', 'birth_date': '1981-11-25'}",BLEPV5922Q ,16432,SYS100007(Invalid State)/ SYS100005 (Additional Address Mandatory field missing)
81,2d72f3b9-56fa-470b-855d-1725aab0c769,ALEEMUDIN ,aleemraza29@gmail.com,9568694045,"{'gender': 'male', 'birth_date': '1991-07-11'}",BAAPA1831Q,19486,Last name is Missing
83,d8ceb8b4-f306-4bdf-b1b5-ce9e5695dfb6,AISHWARYA PARDESHI,pardeshiaishwarya@johndeere.com,8625079018,"{'gender': 'Female', 'birth_date': '1998-07-31'}",EQNPP1496Q,16803,Wrong State Code 
84,7a142c98-bd50-4d23-93b3-650cacf0ab4a,KAMAL SHARMA ,2001750487@gmail.com,6267156350,"{'gender': 'Male', 'birth_date': '1995-01-29'}",JDHPS3713P,10624,SYS100004  (No record found)
85,8771648c-8809-4366-a16e-f0357822e2f8,ASHISH CHUNNI ,qs1877022@example.com,8527157074,"{'gender': 'Male', 'birth_date': '1994-04-03'}",BQWPC5129H,12474,SYS100007(Invalid State)/ SYS100005 (Additional Address Mandatory field missing)
88,d0122c9d-6734-4c58-8ed8-6572b24333ee,AMAR HALDAR ,2001670769@gmail.com,6264022702,"{'gender': 'Male', 'birth_date': '1995-01-29'}",BGDPH5738Q,11598,SYS100004  (No record found)
90,0d471d52-8e5f-4eca-8922-65c94e742d27,RAJAKUBERAN PALANIMURUGAN ,2001650035@gmail.com,9487343696,"{'gender': 'MALE', 'birth_date': '2000-11-03'}",DXFPR8357L,10956,SYS100007(Invalid State)/ SYS100005 (Additional Address Mandatory field missing)
91,cf9e7dfb-435e-4570-bdb2-de5e6b51c617,ALOK SINGH ,74995614712357@dummy.com,7499561471,"{'gender': 'MALE', 'birth_date': '1989-03-20'}",ITKPS3522L,10173,SYS100007(Invalid State)/ SYS100005 (Additional Address Mandatory field missing)
92,a4f47ff5-c335-4911-bb7a-8708094be6c5,MURALI D ,A103363@dummy.com,9738604605,"{'gender': 'male', 'birth_date': '1982-05-08'}",BMUPD3749N,19824,SYS100007(Invalid State)/ SYS100005 (Additional Address Mandatory field missing)
93,e8e67df3-3c76-4d8d-965a-535bbf3a0baf,MUSTHYALA SHIVAKRISHNA ,2001345035@gmail.in,7893988414,"{'gender': 'Male', 'birth_date': '1997-06-10'}",EVAPM5868P,14314,SYS100007(Invalid State)/ SYS100005 (Additional Address Mandatory field missing)
94,cd431a05-9258-4c07-b9ac-e53eaba48d65,SACHIN SHRINIVASRAO DONE  ,QS2200515@gmail.com,9322628261,"{'gender': 'Male', 'birth_date': '1988-12-04'}",APCPD3883M,25513,SYS100007(Invalid State)/ SYS100005 (Additional Address Mandatory field missing)
95,246b5ff0-f2cc-43cf-93cc-0240682f164d,ARUN JAISWAL ,QS1591551@dummy.com,9800681484,"{'gender': 'Male', 'birth_date': '1990-01-01'}",BRDPJ9333C,14660,SYS100007(Invalid State)/ SYS100005 (Additional Address Mandatory field missing)
96,e7c937f7-0462-4075-aef7-1d9421a7732c,SAJAD S ,QS2226653@gmail.com,8848476279,"{'gender': 'Male', 'birth_date': '1987-05-15'}",Hmjps3567n,22500,SYS100007(Invalid State)/ SYS100005 (Additional Address Mandatory field missing)
97,88b16f76-9b30-4451-acd7-c015cebe1b33,IRFAN KHAN ,IRFAN.KHAN@BRANCH.SHAREKHAN.COM,8950418386,"{'gender': 'male', 'birth_date': '1993-08-15'}",EBBPK3486G,16192,SYS100007(Invalid State)/ SYS100005 (Additional Address Mandatory field missing)
98,f51780ed-f8e1-46cf-9e7b-b6b6b17936d9,SANTHOSKUMAR KUMARESAN ,2001691519@gmail.com,9790602861,"{'gender': 'Male', 'birth_date': '1994-07-30'}",LBTPS5428R,16993,SYS100007(Invalid State)/ SYS100005 (Additional Address Mandatory field missing)
99,d46449d6-349b-44c1-abb1-3f9d4ef1d24a,VINOD JADHAV ,jadhav.dj@gmail.com,9867416866,"{'gender': 'MALE', 'birth_date': '1985-05-15'}",AICPJ9677L,86670,Wrong State Code 
100,83699db9-9467-436c-b0b6-a19620d3bf24,Dharmendra Kachhi ,dharmendra090@gmail.com,9131467769,"{'gender': 'Male', 'birth_date': '1988-12-20'}",CVAPK3863Q,39542,Wrong State Code 
101,77ae3e42-4563-4f67-af7d-e970a626da77,MOHD MUZAFFARUDDIN ,royal.sea143@gmail.com,8143624006,"{'gender': 'Male', 'birth_date': '1993-09-30'}",AEAPU4595E,17539,Wrong State Code 
102,c1c313de-b402-49a0-9065-077ebd25cb69,RAMESH DHEERAVATH ,ramsnaik20@gmail.com,9346058530,"{'gender': 'Male', 'birth_date': '1989-08-20'}",CZPPD1453E,13001,SYS100007(Invalid State)/ SYS100005 (Additional Address Mandatory field missing)
103,15450bf4-6beb-4a71-a22e-f3c2fb704af2,AMAN SRIVASTAVA ,2000232451@gmail.com,9898286866,"{'gender': 'male', 'birth_date': '1970-01-01'}",FMTPS8316H,19929,SYS100007(Invalid State)/ SYS100005 (Additional Address Mandatory field missing)
104,878bee5e-48c9-46dc-bea6-f0774104a817,BHARAT SINGH  ,QS2189390@gmail.com,6267923170,"{'gender': 'Male', 'birth_date': '1997-01-03'}",GKOPS8681D,8921,SYS100007(Invalid State)/ SYS100005 (Additional Address Mandatory field missing)
106,0c301f0f-476e-4eae-8874-cae828b69c1f,Paban Puri ,pabanpuri786@gmail.com,7528852845,"{'gender': 'Male', 'birth_date': '1995-10-17'}",EIAPP1994Q,13122,SYS100007(Invalid State)/ SYS100005 (Additional Address Mandatory field missing)
109,1990f363-d591-4c06-acfe-384aafba47f7,Kunal  ,QS1571157@gmail.com,9716232673,"{'gender': 'Male', 'birth_date': '1990-01-01'}",EVMPK3963D,15404,Last name is Missing
110,98790c3d-c92e-43ba-ab8f-134691b849b4,TAMILSELVAN GANESAN ,2001612062@gmail.com,8072682769,"{'gender': 'MALE', 'birth_date': '1981-10-04'}",AFHPT0639Q,18232,SYS100007(Invalid State)/ SYS100005 (Additional Address Mandatory field missing)
111,bffab823-a8cd-4f1f-890a-7615ebbc00a7,NIMESH BHARATBHAI PATEL ,2001701206@gmail.com,9104652309,"{'gender': 'MALE', 'birth_date': '2001-09-23'}",FZPPP5316F,15612,SYS100007(Invalid State)/ SYS100005 (Additional Address Mandatory field missing)
112,730b20c0-8671-46ee-aa3b-5fa581dc377a,NAVEEN KUMAR B H ,QS2224811@gmail.com,8550817655,"{'gender': 'Male', 'birth_date': '1997-03-08'}",BPQPN1320C,18229,SYS100007(Invalid State)/ SYS100005 (Additional Address Mandatory field missing)
113,65f03aa3-512e-4956-9ab7-fbe853808a8c,GOKULRAJ K ,gokulraj1494@gmail.com,8825469317,"{'gender': 'Male', 'birth_date': '1994-06-14'}",BYBPG4313A,11950,SYS100007(Invalid State)/ SYS100005 (Additional Address Mandatory field missing)
114,513ffd34-5254-4cb6-aa72-ba848a13c7f1,S NAVEEN KUMAR ,2001690653@gmail.com,7337279923,"{'gender': 'Male', 'birth_date': '1993-06-15'}",GXCPS0822M,22609,SYS100007(Invalid State)/ SYS100005 (Additional Address Mandatory field missing)
116,f0895889-0f8f-4d23-96c5-66f0adad4848,Sitaram Baban Bhoir  ,QS1882613@gmail.com,8983094863,"{'gender': 'Male', 'birth_date': '1986-09-25'}",AMXPB5529L,18551,SYS100007(Invalid State)/ SYS100005 (Additional Address Mandatory field missing)
117,6b5b9de9-1655-4850-9398-b8be1c6e1e12,DASHRATH SINGH  ,qs1858849@gmail.com,8285242358,"{'gender': 'Male', 'birth_date': '1991-03-04'}",CJXPS6144K,35628,SYS100007(Invalid State)/ SYS100005 (Additional Address Mandatory field missing)
118,795815dc-300e-4ec7-8627-a3f296933adf,Yaturi Anantheswar Reddy ,anantheswar05@gmail.com,7013099720,"{'gender': 'M', 'birth_date': '1990-08-05'}",AGTPY3558J,59001,SYS100007(Invalid PIN Code/Invalid Additional Address PIN)
120,69c4e793-bc35-45b9-91af-a2c5fb3f3eb1,SUMAN ,sumankumari10081995@gmail.com,6377128158,"{'gender': 'Female', 'birth_date': '1995-08-10'}",ITFPS3014E,11080,Last name is Missing
121,0c22a371-88c1-43ab-b1e3-c0f365ad290b,SHYAM SINGH ,2001666790@gmail.com,9511189619,"{'gender': 'Male', 'birth_date': '1989-03-02'}",GIRPS1258F,10125,SYS100007(Invalid State)/ SYS100005 (Additional Address Mandatory field missing)
122,9ab17190-339f-4f4f-9da5-a2dbf45ec614,BALAI MAJUMDER ,2001538613@gmail.com,9339424699,"{'gender': 'MALE', 'birth_date': '1985-04-20'}",AZDPM1386M,14756,SYS100007(Invalid State)/ SYS100005 (Additional Address Mandatory field missing)
123,039932c3-b60e-45ba-8e56-3f5783982f0f,DINESH KUMAR ,QS2170734@gmail.com,9875703316,"{'gender': 'MALE', 'birth_date': '1994-05-11'}",EKFPK0660B,13810,SYS100007(Invalid State)/ SYS100005 (Additional Address Mandatory field missing)
124,89b77423-bca3-447c-b848-059c2c19d55c,WASEEM HYDER ,2001115081@gmail.com,9700582308,"{'gender': ' MALE ', 'birth_date': '1990-01-01'}",AEOPW0175Q,12223,SYS100007(Invalid State)/ SYS100005 (Additional Address Mandatory field missing)
125,ca337c4e-a400-4d1f-92b6-79a054293b3b,ABHISHEK MUKHERJEE ,QS2228396@gmail.com,7003863105,"{'gender': 'Male', 'birth_date': '1998-05-08'}",DDZPM5379F,10015,SYS100007(Invalid State)/ SYS100005 (Additional Address Mandatory field missing)
126,2f42fb00-d440-420f-8d10-431cef48ffa4,Dinesh rai  ,QS1699129@gmail.com,8750728888,"{'gender': 'Male', 'birth_date': '1990-01-01'}",AKTPR2885B,27492,SYS100007(Invalid State)/ SYS100005 (Additional Address Mandatory field missing)
127,fc13965f-4006-4c9b-8a9d-381ae748fa32,KESAVARAJ SIVAKUMAR  ,QS2206886@gmail.com,6369380601,"{'gender': 'Male', 'birth_date': '1998-08-18'}",ILPPK4287R,15737,SYS100007(Invalid State)/ SYS100005 (Additional Address Mandatory field missing)
128,372ba6a1-bfd1-4eb8-9040-3f754c0ae0c0,LAMBAWALA KHIJARMAHEDI ,khijarmahedi@gmail.com,9978229091,"{'gender': 'male', 'birth_date': '1993-11-11'}",ANIPL3402G,19308,SYS100007(Invalid State)/ SYS100005 (Additional Address Mandatory field missing)
129,28ba378e-9e3a-46ef-be22-4be4919e7c36,VIKRAM WALECHA ,1119154@dummy.com,9468478567,"{'gender': 'male', 'birth_date': '1990-08-12'}",ABOPW2605E,18899,SYS100007(Invalid State)/ SYS100005 (Additional Address Mandatory field missing)
130,76fc6f84-c124-4c77-8e3c-51d8d624943c,RAMAVATH JYOTHI ,QS2227825@gmail.com,9515941088,"{'gender': 'Female', 'birth_date': '1996-04-14'}",Cfxpr2383p,12501,SYS100007(Invalid State)/ SYS100005 (Additional Address Mandatory field missing)
132,5162621e-19c7-407a-9310-59e5c0185c6b,RUPESH KUMAR ,QS2161380@gmail.com,8709612581,"{'gender': 'MALE', 'birth_date': '1992-09-06'}",CXOPK2826H,3702,SYS100007(Invalid State)/ SYS100005 (Additional Address Mandatory field missing)
134,8ab898f4-be57-49a7-8dc1-f98c375c5d15,VIVEKANAND  PANDIT ,qs2128059@example.com,7366012155,"{'gender': 'Male', 'birth_date': '1991-01-01'}",CCXPP8284Q,10496,SYS100004  (No record found)
135,3f7cc099-30e9-4b3a-bca4-e0c870284cec,VIKAS PAL ,QS2226118@gmail.com,8299414101,"{'gender': 'Male', 'birth_date': '1994-11-09'}",Csqpp3037a,15500,SYS100007(Invalid State)/ SYS100005 (Additional Address Mandatory field missing)
136,1e463051-8b82-45d4-ae7d-db41367100f4,GOVIND DNYANOBA BHUSARE  ,QS2197662@gmail.com,9309723783,"{'gender': 'Male', 'birth_date': '1999-08-28'}",FGCPB5757E,17624,SYS100007(Invalid State)/ SYS100005 (Additional Address Mandatory field missing)
137,0c76e401-a326-4bbb-a8e3-930c24e10870,MUKESH SURWADE ,QS2245533@gmail.com,9405356835,"{'gender': 'Male', 'birth_date': '1991-03-18'}",COMPS5692J ,7064,SYS100007(Invalid State)/ SYS100005 (Additional Address Mandatory field missing)
138,5b32997f-a20f-4800-874b-56eecb6954fa,MOHAN RAMESH MALI  ,QS1728053@gmail.com,9922798440,"{'gender': 'Male', 'birth_date': '1988-01-15'}",BINPM4293D,33237.00,SYS100007(Invalid State)/ SYS100005 (Additional Address Mandatory field missing)
139,b0f4fc5a-481c-4e46-a99c-06efbfa6015b,YASHAVANTH B H ,QS2245564@gmail.com,9148625084,"{'gender': 'Male', 'birth_date': '2001-08-10'}",BCIPY5349F,8877,SYS100007(Invalid State)/ SYS100005 (Additional Address Mandatory field missing)
140,ab26ca50-e3a4-4722-a8a4-1b454c76c1ee,M.VASANTHKUMAR ,vasanthk231@gmail.com,9952262299,"{'gender': 'Male', 'birth_date': '1987-09-27'}",AXYPV7732R,15203,Last name is Missing
141,d6e528a9-4dc8-4283-a4f7-93d18ff559af,BODDU NAVEEN KUMAR ,2001754093@gmail.com,9542921696,"{'gender': 'Male', 'birth_date': '1991-02-15'}",Drhpb6416g,10000,SYS100007(Invalid State)/ SYS100005 (Additional Address Mandatory field missing)
142,d2b4c850-3536-4ab4-931d-7ce10dbe4b3c,PUGAZHENTHI.J ,pugazhenthijayaraman@gmail.com,9445873537,"{'gender': 'Male', 'birth_date': '1998-12-06'}",ERRPP0938J,9123,Last name is Missing
144,14787633-ca41-42aa-b5d1-111ddce16ab7,SANJEEB SINGH ,QS2199323@gmail.com,9144547088,"{'gender': 'Male', 'birth_date': '1974-06-08'}",BVOPS6907A,21000,SYS100007(Invalid State)/ SYS100005 (Additional Address Mandatory field missing)
145,cb2560a0-b528-4c0f-8f9e-c1f203544704,RAM BILAS ,A380143,7668688661,"{'gender': 'male', 'birth_date': '1992-06-06'}",AYXPB2216N,14929,SYS100007(Invalid State)/ SYS100005 (Additional Address Mandatory field missing)
147,b8d4e523-cf0d-4846-93cc-eb2844431fab,B Thangadurai ,tdurai073@gmail.com,9176643078,"{'gender': 'Male', 'birth_date': '1997-04-06'}",BESPT4619D,7656,SYS100007(Invalid State)/ SYS100005 (Additional Address Mandatory field missing)
149,7709e813-04ea-47ef-8348-25f9b64d2794,MANISHA RAJARAM BAGAL ,1081251,8424899828,"{'gender': 'female', 'birth_date': '1992-08-29'}",CJLPB2203G,32530,SYS100007(Invalid State)/ SYS100005 (Additional Address Mandatory field missing)
150,9bc16ba1-7ede-44dd-a847-2e377689816f,VIVEK S ,2001645310@gmail.com,8531013277,"{'gender': 'Male', 'birth_date': '1987-08-28'}",AYLPV7838G,13908,SYS100007(Invalid State)/ SYS100005 (Additional Address Mandatory field missing)
151,c44602d8-a979-4104-b8c2-0546948231a0,BOMMAGONI SRINIVAS ,akil02011990@gmail.com,8886669697,"{'gender': 'Male', 'birth_date': '1990-01-02'}",CBCPB1453K,18874,Wrong State Code 
152,d9d2ce06-4dd5-42d4-a7f4-68ee84e58b60,BARUN MAITY ,789439656110869@dummy.com,7894396561,"{'gender': 'MALE', 'birth_date': '1985-02-15'}",BOBPM7172P,11448,SYS100007(Invalid State)/ SYS100005 (Additional Address Mandatory field missing)
153,40072ae4-5fca-4e78-a9ac-e7bb9472899d,ASHRAF HUSSAIN ,QS2192113@gmail.com,9342228494,"{'gender': 'Male', 'birth_date': '1972-08-21'}",BLRPS6002F,24830,SYS100007(Invalid State)/ SYS100005 (Additional Address Mandatory field missing)
154,7e805e53-83fd-40aa-89dc-f3c88dd1ce33,RAJAT KOUNDAL ,QS2063225@gmail.com,7061996255,"{'gender': 'Male', 'birth_date': '1998-07-11'}",LAUPK0092D,9969,SYS100007(Invalid State)/ SYS100005 (Additional Address Mandatory field missing)
155,5d4c56df-c15e-4c5c-98d9-30b3b39bc853,RAJKUMAR ,2001691107@gmail.com,9079774712,"{'gender': 'Male', 'birth_date': '1999-11-28'}",DUYPR4085R,0,Last name is Missing
156,7645aa8a-9cee-4127-90bb-2dc95324ff97,DEVARAKONDA VENKATESWARARAO ,QS2202068@gmail.com,9032334477,"{'gender': 'Male', 'birth_date': '1982-03-11'}",ANNPD9044R,25808,SYS100007(Invalid State)/ SYS100005 (Additional Address Mandatory field missing)
157,cbb3a068-f830-42ce-be61-65eeb0a7b30b,RITESHKUMAR RAMLAKHAN GUPTA ,2001670947@gmail.com,8652850115,"{'gender': 'Male', 'birth_date': '1995-01-29'}",DLUPG8609F,9488,SYS100004  (No record found)
158,c96ebd3f-739c-47a9-87d3-51564170223e,Praveen Kumar ,pk1128767@gmail.com,8077242335,"{'gender': 'Male', 'birth_date': '1993-10-18'}",GXIPK6883A,5000,SYS100007(Invalid State)/ SYS100005 (Additional Address Mandatory field missing)
160,6ad334ce-fcc0-4846-b662-9b2bb6b7cb38,SANJAY PRATAP SINGH  ,QS2213548@gmail.com,8394939895,"{'gender': 'Male', 'birth_date': '1996-12-21'}",JSGPS9826D,13813,SYS100007(Invalid State)/ SYS100005 (Additional Address Mandatory field missing)
161,28e48f33-c875-4393-90cd-aa3354d5b9c4,Suchismita ,suchismita92.das@gmail.com,9583498248,"{'gender': 'F', 'birth_date': '1992-05-17'}",BZVPD8365A,68019,Last name is Missing
162,11ceef7b-c633-4c1a-8401-cb28e319c642,NIRANJAN KUMAR UPADHYAY ,QS1822017@gmail.com,7488290641,"{'gender': 'Male', 'birth_date': '1990-01-04'}",ABNPU6443R,13317,SYS100007(Invalid State)/ SYS100005 (Additional Address Mandatory field missing)
163,df0d48d5-3e6f-4d12-bf50-896d4f849044,A VINOD KUMAR ,A360210@dummy.com,8019864043,"{'gender': 'male', 'birth_date': '1991-04-15'}",AVIPV5454A,11476,SYS100007(Invalid State)/ SYS100005 (Additional Address Mandatory field missing)
164,ace16822-89a2-46f0-9f3e-0d406730fd86,SOLANKI NIKUNJ CHETANBHAI ,QS2234257@gmail.com,8000990021,"{'gender': 'Male', 'birth_date': '2002-06-27'}",NRZPS8427Q,22423,SYS100007(Invalid State)/ SYS100005 (Additional Address Mandatory field missing)
165,0c7a1d8a-458b-4d08-8fae-e13e676712be,NETRA BALLABH  ,qs1778749@gmail.com,7500287845,"{'gender': 'Male', 'birth_date': '1999-10-24'}",DTRPB4122F,14293,SYS100007(Invalid State)/ SYS100005 (Additional Address Mandatory field missing)
167,92660a53-3989-45dc-9aed-b8332db082c5,MANDEEP  SINGH  ,mandeep.singh@uhcindia.com,8727092212,"{'gender': 'Male', 'birth_date': '1984-09-21'}",ENWPS5190G,19180,SYS100007(Invalid State)/ SYS100005 (Additional Address Mandatory field missing)
168,9e113d34-2368-4213-ac32-9afa0e7a6c37,SURAJ RAMESH CHOUDHARY ,suraj.chaudhari@myespresso.com,9920864432,"{'gender': 'MALE', 'birth_date': '1993-10-12'}",AVMPC9538Q,16025,SYS100007(Invalid State)/ SYS100005 (Additional Address Mandatory field missing)
169,a6bfcecb-f6da-4347-87bb-7593ff1a4e9b,DEEPAK VISHWAKARMA ,2001602097@gmail.com,9919248208,"{'gender': 'MALE', 'birth_date': '1997-07-14'}",BXDPV2408J,10294,SYS100007(Invalid State)/ SYS100005 (Additional Address Mandatory field missing)
171,80be9b2d-d4bc-4c48-b510-8c8c2c7820b9,RESHMA DULALMOHAMED SHAIKH  ,reshma.shaikh@sharekhan.com,9136300754,"{'gender': 'Female', 'birth_date': '1998-04-17'}",IBEPS9494B,16932,SYS100007(Invalid State)/ SYS100005 (Additional Address Mandatory field missing)
172,8610c84a-6d16-4dcb-a6dd-41006eab3d91,PRAJAPATI KUMAR ,QS2234858@gmail.com,6358158578,"{'gender': 'Male', 'birth_date': '1997-08-29'}",DBWPP7454R,18401,SYS100007(Invalid State)/ SYS100005 (Additional Address Mandatory field missing)
173,64193e11-c0d0-4660-af74-75f0b6eaec5c,PRASHANT SHUKLA ,prashant07shukla@gmail.com,8218495772,"{'gender': 'MALE', 'birth_date': '1988-05-08'}",EPUPS9975F,25890,SYS100007(Invalid State)/ SYS100005 (Additional Address Mandatory field missing)
174,d8d99de9-4839-4b91-8c8e-63d0dec2f874,KALPESH RAJU MALUSARE ,QS2205216@gmail.com,9016078571,"{'gender': 'Male', 'birth_date': '1990-09-07'}",BGDPM3924R,13955,SYS100007(Invalid State)/ SYS100005 (Additional Address Mandatory field missing)
176,8f83d9ed-1d18-4962-94d2-a834a0a5d7bd,MANISH AGNIHOTREE ,monuaditya2@gmail.com,8943996955,"{'gender': 'Male', 'birth_date': '1997-10-12'}",CHAPA7465A,16000,SYS100007(Invalid State)/ SYS100005 (Additional Address Mandatory field missing)
177,31f43c28-342c-4b51-9b48-ce3d6015fe39,Ramisetty Sri Sai ,swathi.ramisetty51@gmail.com,8317679630,"{'gender': 'F', 'birth_date': '1995-07-07'}",DGMPR7151A,39248,SYS100007(Invalid PIN Code/Invalid Additional Address PIN)
178,8ac81a0f-2f97-4b2f-aa94-3456b7f0eaca,MESHAK VICTOR CRASTA ,QS1954901@gmail.com,8850460378,"{'gender': 'Male', 'birth_date': '1995-12-20'}",BJSPC0304D,6000,SYS100007(Invalid State)/ SYS100005 (Additional Address Mandatory field missing)
179,4890b228-7eae-4ced-831d-542a35453d4d,VISHAL TIWARI  ,vishal.tiwari@bizsupporta.com,6393116114,"{'gender': 'Male', 'birth_date': '1995-01-01'}",ARAPT0293R,13638,SYS100007(Invalid State)/ SYS100005 (Additional Address Mandatory field missing)
180,6b6da0d0-e155-452c-a808-859749a2f61f,PRADEEPP ,97107720793908@dummy.com,7397365951,"{'gender': 'MALE', 'birth_date': '1986-04-19'}",EEGPP2375B,17294,Last name is Missing
181,45eed9df-aab7-4ced-86c5-1cbe27b24a5e,PRASHANT GAUTAM UBALE ,2001007888@dummy.com,8888309288,"{'gender': 'Male', 'birth_date': '1990-01-01'}",ABEPU4971H,11679,SYS100007(Invalid State)/ SYS100005 (Additional Address Mandatory field missing)
182,2b8696c3-c3e6-455c-a048-5db9aff605ce,Vijay Pratap Singh  ,vijaypratap9559@gmail.com,9696331147,"{'gender': 'Male', 'birth_date': '1988-11-08'}",Cfbps4323c,7092,SYS100007(Invalid State)/ SYS100005 (Additional Address Mandatory field missing)
183,16ecbb43-91cc-43a7-ba65-db5ef5508188,SANTOSH KUMAR BEHERA ,shivtosh.behera7@gmail.com,9777718781,"{'gender': 'Male', 'birth_date': '1987-05-27'}",BTKPB7475G,9859,Wrong State Code 
184,851a9f73-1507-43fd-bf5f-f164bb5ce792,MADASU KIRANKUMAR ,2001586468@gmail.com,9000150853,"{'gender': 'MALE', 'birth_date': '1991-01-01'}",Bulpm4377a,0,SYS100007(Invalid State)/ SYS100005 (Additional Address Mandatory field missing)
185,e368fd89-e64d-41a1-abd1-6aad6150d18a,MANOJ KUMAR RABIDAS  ,QS2204491@gmail.com,7002240913,"{'gender': 'Male', 'birth_date': '1987-07-19'}",BFLPR1316D,18700,SYS100007(Invalid State)/ SYS100005 (Additional Address Mandatory field missing)
187,5a7e21b3-b869-47f5-a625-873031f04834,CHANDRAKANTA  PANDA ,chandrakanta.panda@bizsupporta.com,7327070701,"{'gender': 'Male', 'birth_date': '1987-10-15'}",BXPPP5346H,16638,Wrong State Code 
188,3a54846a-a5f9-409e-ae58-1e088b64083c,ABHISHEK SINGH ,abhishek.singh6@bizsupporta.com,7888769628,"{'gender': 'Male', 'birth_date': '2001-11-19'}",MTQPS3453Q,17987,SYS100007(Invalid State)/ SYS100005 (Additional Address Mandatory field missing)
189,896522ea-d38f-44f8-b7be-53bc423012fc,VISHWANATH ,vishwanathpatil023@gmail.com,9108581378,"{'gender': 'MALE', 'birth_date': '1989-08-01'}",BBTPV8148M,33567,Last name is Missing
191,33217ec6-0ee8-4295-addd-d51b285510e6,SUBHADARA ,Q1047525@gmail.com,7795472262,"{'gender': 'FEMALE', 'birth_date': '1984-09-10'}",HZHPS1870P ,26265,Last name is Missing
192,2c2d3a61-81fa-47f9-84cc-d550e4dda837,Yogesh Ashok ,rider1032@gmail.com,9821791958,"{'gender': 'M', 'birth_date': '1987-09-26'}",CFCPS5216K,40800,SYS100007(Invalid PIN Code/Invalid Additional Address PIN)
193,21913164-4f96-418b-8b6e-eba7086e58a9,NARASIMHA RAAMISETTI ,ramisettynarasimha@johndeere.com,9705959693,"{'gender': 'Male', 'birth_date': '1986-08-29'}",AOMPR1361M,19508,Wrong State Code 
195,93a523bf-2442-4045-b53d-c17642d09e3e,Siddappa M Yalival ,QS2000001@gmail.com,9880157640,"{'gender': 'Male', 'birth_date': '1990-01-01'}",AOAPY4473P,28184,SYS100004  (No record found)
196,31ab9747-6ffb-4795-91ec-5de37fdcf975,MUDASSIR HUSSAIN YUSUF SHAIKH ,QS2160936@gmail.com,9594135313,"{'gender': 'Male', 'birth_date': '1992-06-12'}",EXEPS0415N,11665,Wrong State Code 
197,b932b483-ac65-49eb-88c8-63ba25a21362,BELALLA CHANDRASEKHAR REDDY  ,QS2121993@gmail.com,6304977186,"{'gender': 'MALE', 'birth_date': '1998-09-09'}",BSQPC9113D,12669,SYS100007(Invalid State)/ SYS100005 (Additional Address Mandatory field missing)
198,3f5db01d-3cbd-4d84-acf5-d495d4386793,Emmaneni ,pujanaidu9@gmail.com,9573476796,"{'gender': 'F', 'birth_date': '1989-01-22'}",CCLPP6966P,38467,Last name is Missing
199,47533a2e-a45a-4978-b7e6-6887ac799321,RAHUL ,QS2166439@gmail.com,7973161983,"{'gender': 'Male', 'birth_date': '1995-03-21'}",CLXPR0407A,14197,Last name is Missing
200,fee85a22-d261-4992-af94-201247eec032,AMIT RANA ,2001018272@dummy.com,9773414963,"{'gender': 'Male', 'birth_date': '1990-01-01'}",AYFPR0629H,20505,SYS100007(Invalid State)/ SYS100005 (Additional Address Mandatory field missing)
201,a9046e42-40ef-4898-ae4a-d7861bdacf83,SIDHIK ,sidhikthaj37@gmail.com,6238153774,"{'gender': 'Male', 'birth_date': '1992-04-28'}",JDHPS0182J,21749,Last name is Missing
202,22ba1a0b-f59a-497a-a8db-4c69c1a36374,Netai Mondal ,QS1572820@gmail.com,9073100589,"{'gender': 'Male', 'birth_date': '1990-01-01'}",CSLPM8982L,23169,SYS100007(Invalid State)/ SYS100005 (Additional Address Mandatory field missing)
203,ff1fc370-c942-4a57-a85d-4b6830c47c2a,HEMANT KUMAR SINGH ,QS2228043@gmail.com,8423290450,"{'gender': 'Male', 'birth_date': '1989-03-15'}",Cgxps2745f,13000,SYS100007(Invalid State)/ SYS100005 (Additional Address Mandatory field missing)
206,4ca5bbbd-a9f7-4163-bafa-cc7450b13119,KARAN KUMAR ,ktarun0787@gmail.com,9873116950,"{'gender': 'male', 'birth_date': '1999-06-13'}",HXPPK4739D,20455,SYS100007(Invalid State)/ SYS100005 (Additional Address Mandatory field missing)
207,586489b5-004f-4b7e-94b7-881cfa9ece45,VISHAL BASAWARAJ BIRADAR ,biradarvishal963@gmail.com,9743202499,"{'gender': 'Male', 'birth_date': '1993-01-08'}",ARHPV1464D,18596,SYS100004  (No record found)
209,ec1be358-29bb-4caf-979d-0e92c174edf7,ROHAN DILIP KILLEKAR ,913763453510427@dummy.com,9137634535,"{'gender': 'MALE', 'birth_date': '1997-05-09'}",DXLPK8936G,13193,SYS100007(Invalid State)/ SYS100005 (Additional Address Mandatory field missing)
210,462aa009-d828-49ab-9e32-b357f387d265,PARMAR JATIN RAMESHBHAI ,QS2235270@gmail.com,9825013603,"{'gender': 'Male', 'birth_date': '1986-10-12'}",DBQPP1144G,7070,SYS100007(Invalid State)/ SYS100005 (Additional Address Mandatory field missing)
211,6bff75a8-c7a6-4597-a233-26a6599ea821,NIKHIL GOVARDHAN BHIRUD ,2001683217@gmail.com,9082688192,"{'gender': 'Male', 'birth_date': '1999-01-13'}",EFPPB5166C,13000,SYS100007(Invalid State)/ SYS100005 (Additional Address Mandatory field missing)
212,0869f258-e9f7-4baa-84ea-b4d85393a9d9,VINOD KUMAR CHOUDHARY ,QS2197486@gmail.com,9074606534,"{'gender': 'Male', 'birth_date': '1991-01-09'}",AUCPC2764P,10123,SYS100007(Invalid State)/ SYS100005 (Additional Address Mandatory field missing)
213,ac01bfbc-6c4e-458d-aae8-f5544ab1d36b,ABHAYA KUMAR PATTANAYAK ,pattanayakabhayakumar@gmail.com,8249205974,"{'gender': 'Male', 'birth_date': '1987-09-05'}",AUMPP1073E,11940,Wrong State Code 
216,09cee4ed-7c1f-44c1-bfda-89a779be40a2,NANDANKUMAR T S ,Q1043416@gmail.com,8971278752,"{'gender': 'MALE', 'birth_date': '1998-09-02'}",CDRPN6022R,12835,SYS100004  (No record found)
217,ba64b7f9-b286-48b3-871c-ac14015fe631,DHAVALKUMAR KANADA ,QS2169994@gmail.com,9723024343,"{'gender': 'Male', 'birth_date': '1990-01-23'}",DNNPK1733H,16442,SYS100004  (No record found)
218,3fb2b0f6-660f-4fe1-85d6-1bafafa96273,SYED ABRAR ,syedfahad2224@gmail.com,8660617816,"{'gender': 'MALE', 'birth_date': '1995-07-02'}",ACKPF9146J,31055,SYS100007(Invalid PIN Code/Invalid Additional Address PIN)
220,3d4dcec8-3cfd-43f1-905d-3a2809359644,PIYUSH SISODIA ,QS2171612@gmail.com,9761636272,"{'gender': 'Male', 'birth_date': '1995-02-02'}",IQIPS9736P,16915,SYS100007(Invalid State)/ SYS100005 (Additional Address Mandatory field missing)
221,cb6c400b-b624-4394-831f-8fff27d53c0c,MOHAN R ,QS2205239@gmail.com,8073134420,"{'gender': 'Male', 'birth_date': '2000-01-01'}",CYPPM2314A,14440,SYS100007(Invalid State)/ SYS100005 (Additional Address Mandatory field missing)
222,d6139201-e5bb-43d2-ace8-a1e4d73f1bf4,RAJESH UMABATHI ,uraajesh26@gmail.com,9841499075,"{'gender': 'male', 'birth_date': '1990-09-26'}",BKWPR7797A,29056,SYS100007(Invalid State)/ SYS100005 (Additional Address Mandatory field missing)
223,a793aa98-6acf-418a-9644-07b683252a24,Vikas Pundir ,Vikashkumar1728@gmail.com,9910026064,"{'gender': 'Male', 'birth_date': '1995-02-17'}",AVBPV9503D,27448,SYS100007(Invalid State)/ SYS100005 (Additional Address Mandatory field missing)
226,0326a9ee-8fa9-40c4-9bfe-72e9f09bcf7e,ROSY DAHIYA  ,QS2216937@gmail.com,9560948308,"{'gender': 'Female', 'birth_date': '1993-09-26'}",BVAPD1995D,20575,SYS100007(Invalid State)/ SYS100005 (Additional Address Mandatory field missing)
227,92f10e07-9772-461e-9971-706432856786,VISHAL SUNDER GUPTA ,2001693217@gmail.com,8369107394,"{'gender': 'Male', 'birth_date': '1995-01-29'}",BVNPG8854K,12733,SYS100004  (No record found)
228,4b38233e-c066-45af-af17-d84ea0456771,PANKAJ KUMAR YADAV ,pankajky13898@gmail.com,7987386665,"{'gender': 'Male', 'birth_date': '1990-01-01'}",AXAPY8492P,13710,SYS100007(Invalid State)/ SYS100005 (Additional Address Mandatory field missing)
229,61cc8823-fbd5-4275-a669-3c083f6a6b4e,AJAY BALMIKI ,2000250985@gmail.com,8376950437,"{'gender': 'male', 'birth_date': '1970-01-01'}",AOKPB0671E,20879,SYS100007(Invalid State)/ SYS100005 (Additional Address Mandatory field missing)
230,b3a82ea5-b7d8-4bb6-9017-e4bd53f2e227,NEERAJ SINGH ,neeraj.singh13@bizsupporta.com,7905920797,"{'gender': 'Male', 'birth_date': '1994-04-16'}",FORPS4793J,10243,SYS100007(Invalid State)/ SYS100005 (Additional Address Mandatory field missing)
233,6d63ab5b-7e56-456f-a1c5-5cc45e50a92d,Umesh Meena ,Q1116852@gmail.com,9887582727,"{'gender': 'Male', 'birth_date': '1996-10-26'}",CRUPM3757M,13715,SYS100007(Invalid State)/ SYS100005 (Additional Address Mandatory field missing)
234,252953c6-fc94-49b5-ada9-79899e6055f7,SUROJIT MUKHERJEE ,QS1814668@gmail.com,9163141919,"{'gender': 'Male', 'birth_date': '1999-12-10'}",EDFPM3723Q,12269,SYS100007(Invalid State)/ SYS100005 (Additional Address Mandatory field missing)
235,fbf399be-cdcf-4c8a-a39e-cb10e199581e,RAJDIP ACHARYA ,2001553142@gmail.com,8777478805,"{'gender': 'Male', 'birth_date': '1996-07-09'}",BZYPA1424L,9575,SYS100007(Invalid State)/ SYS100005 (Additional Address Mandatory field missing)
237,a36817de-c36f-4193-9c93-8c1b580d2029,DABHI GANPATBHAI  ,QS1954912@gmail.com,8000643242,"{'gender': 'Male', 'birth_date': '1998-03-25'}",FCRPD5596N,8382,SYS100007(Invalid State)/ SYS100005 (Additional Address Mandatory field missing)
238,2aa69695-4cd6-439d-b549-b93e3be6838c,LALIT KUMAR ,lalitarora1998@gmail.com,9872032689,"{'gender': 'Male', 'birth_date': '1998-05-24'}",IXTPK6971G,51541,SYS100007(Invalid State)/ SYS100005 (Additional Address Mandatory field missing)
239,a6fc7766-e3bd-477f-8759-0a743100b66c,SHAIK SHAKEEL ,skshakeel78566@gmail.com,9063678566,"{'gender': 'Male', 'birth_date': '1996-01-10'}",KQKPS5871M,14630,Wrong State Code 
240,cca63f68-c411-4d6e-abd5-8e01dd5f916d,Satish Kumar ,shilpikumari2474@gmail.com,6394470019,"{'gender': 'Male', 'birth_date': '1997-04-06'}",KCEPK7985N,10452,SYS100007(Invalid State)/ SYS100005 (Additional Address Mandatory field missing)
241,1573baaf-54c6-43d7-9cf3-418846d61654,HEZLEENA ,A309097@dummy.com,9571594104,"{'gender': 'female', 'birth_date': '1984-03-26'}",AIDPH8081K,15450,Last name is Missing
242,30b939fd-1c20-4a90-8bcd-3e5084839d8a,VINIT PANDEY ,A217304@DUMMY.COM,9889422411,"{'gender': 'male', 'birth_date': '1990-12-24'}",EBIPP3560B,15894,SYS100007(Invalid State)/ SYS100005 (Additional Address Mandatory field missing)
243,1eeefb32-108d-4bcc-9201-8f80ddf9891f,NITESH KUMAR JHA ,QS1953280@gmail.com,8460527824,"{'gender': 'Male', 'birth_date': '1994-12-01'}",BGLPJ7366Q,14385,SYS100007(Invalid State)/ SYS100005 (Additional Address Mandatory field missing)
245,392b06d9-eb71-4129-a649-07d602689681,AASHISH CHAUHAN ,QS2204985@gmail.com,8393981385,"{'gender': 'Male', 'birth_date': '1997-05-15'}",BPYPC6078N,7872,SYS100007(Invalid State)/ SYS100005 (Additional Address Mandatory field missing)
246,f49b6dfc-4aa8-4212-8e81-245a4a777e3b,Sahal Kooliyodan ,sahal.kooliyodan@tsd.ikyaglobal.com,9995540903,"{'gender': 'Male', 'birth_date': '1996-04-19'}",JXRPS6323D,10076,SYS100004  (No record found)
248,57f8b160-f7d1-4bf2-b626-2146b086b435,AMAN SINGH  ,QS2194241@gmail.com,7725866303,"{'gender': 'Male', 'birth_date': '1996-03-25'}",FYFPS0596P,19334,SYS100007(Invalid State)/ SYS100005 (Additional Address Mandatory field missing)
249,0c727f36-9375-4428-b52f-b512227f47fd,Arun Mishra ,arunmishra21090@gmail.com,9990469339,"{'gender': 'Male', 'birth_date': '1992-02-10'}",DAJPM6555G,22861,SYS100007(Invalid State)/ SYS100005 (Additional Address Mandatory field missing)
250,371c2b70-f22c-4c32-8063-a101c61e5d14,LATIFSAB ,QS2149231@gmail.com,9008444793,"{'gender': 'Male', 'birth_date': '1991-06-15'}",AMIPN1156C,16715,Last name is Missing
251,23b9c356-b5ae-4ad1-98e8-0964b3ebdfca, SHEK AFZAL D  ,afzal020496@gmail.com,9677053445,"{'gender': 'Male', 'birth_date': '1990-01-01'}",FTAPS2507G,25568,SYS100007(Invalid PIN Code/Invalid Additional Address PIN) 
253,fba705eb-5d11-4822-949f-53b3a415de66,DHARANIKOTA AVINASH ,avinash.dharanikota@gmail.com,9490049534,"{'gender': 'Male', 'birth_date': '1998-11-02'}",GOIPD8629Q,16000,SYS100004  (No record found)
254,f3577e4b-5ecf-4beb-9bff-b58180608982,Rathva Vipulbhai Vajesingbhai ,rv4555355@gmail.com,9979640319,"{'gender': 'Male', 'birth_date': '1997-04-06'}",CKHPR3142K ,7923,SYS100007(Invalid State)/ SYS100005 (Additional Address Mandatory field missing)
255,38339c3a-df5f-4946-847c-abbcf7c40faf,BULA AKHLAK AHMAD GULAMRASUL ,akhlakbula32@gmail.com,9979596548,"{'gender': 'MALE', 'birth_date': '1999-05-31'}",DFPPB7562K,19502,SYS100007(Invalid State)/ SYS100005 (Additional Address Mandatory field missing)
256,04063175-cf98-4511-9d51-f23ee5fd541d,PRABHU SUBRAMANI ,2001538564@gmail.com,9952769392,"{'gender': 'MALE', 'birth_date': '1993-06-23'}",BSQPP0502F,24431,SYS100007(Invalid State)/ SYS100005 (Additional Address Mandatory field missing)
257,a3094179-07e2-4edf-b719-e5dd859fad36,DEVENDER ,2001557883@gmail.com,9354882862,"{'gender': 'Male', 'birth_date': '1987-04-02'}",AZNPD3892P,17385,Last name is Missing
258,43b0ee7a-6654-436c-8ef4-9ded9a66e009,NILAMBAR KUMAR SHARMA ,2000269940@gmail.com,9958623975,"{'gender': 'male', 'birth_date': '1970-01-01'}",IVQPS6151B,22208,SYS100007(Invalid State)/ SYS100005 (Additional Address Mandatory field missing)
259,e6bcc72e-01ef-47c5-a65e-d6f2c08de765,SAHID AHMED ,QS2130376@gmail.com,6001374638,"{'gender': 'Male', 'birth_date': '1993-03-27'}",AZJPA2147E,15000,SYS100007(Invalid State)/ SYS100005 (Additional Address Mandatory field missing)
260,8e903a1a-2717-4081-9a20-58255a648708,VISHNU M ,2001489196@gmail.com,7012397931,"{'gender': 'MALE', 'birth_date': '1999-04-28'}",FQYPM9099A,3768,SYS100007(Invalid State)/ SYS100005 (Additional Address Mandatory field missing)
262,11c57aec-95cb-4a09-bdc7-dae66c0d0154,MANGESH CHAVAN ,1216379@DUMMY.COM,9920350816,"{'gender': 'male', 'birth_date': '1976-05-01'}",AHMPC8725F,17046,SYS100007(Invalid State)/ SYS100005 (Additional Address Mandatory field missing)
263,fb2fa9cc-d6a6-4b6c-90dc-f5c98b0f5d28,MOHD NAHEED  ALAM ,QS2224184@gmail.com,9560963632,"{'gender': 'Male', 'birth_date': '1990-06-15'}",BJOPA5169C,20628,SYS100007(Invalid State)/ SYS100005 (Additional Address Mandatory field missing)
264,c5162085-2c3c-4cda-982e-810cbeaac735,ANIL VERMA ,2001646698@gmail.com,7404939923,"{'gender': 'MALE', 'birth_date': '1994-02-25'}",ASPPV3256L,20175,SYS100007(Invalid State)/ SYS100005 (Additional Address Mandatory field missing)
266,17bb7fdd-1ca0-454b-a669-267b58edbdc2,Pinku Yadav  ,pinkuydv@gmail.com,9837049959,"{'gender': 'Male', 'birth_date': '1990-01-01'}",ADOPY1439N,40305,SYS100007(Invalid State)/ SYS100005 (Additional Address Mandatory field missing)
267,090d603d-a5e8-4b5c-84e8-427902718e8b,MANISH SILLARE  ,QS2194563@gmail.com,7828141819,"{'gender': 'Male', 'birth_date': '1992-06-28'}",JJXPS1942E,10123,SYS100007(Invalid State)/ SYS100005 (Additional Address Mandatory field missing)
269,fdcdae42-031d-4665-ba99-0bd8d26b49be,SANTOSH KUMAR ,2000638687@gmail.com,7007679468,"{'gender': 'male', 'birth_date': '1994-05-22'}",DDMPK6588M,20647,SYS100007(Invalid State)/ SYS100005 (Additional Address Mandatory field missing)
270,9da67830-6959-46d8-8ed2-416a605d5bdc,Jagjeet Singh ,Q1108487@gmail.com,9558659677,"{'gender': 'Male', 'birth_date': '1987-09-24'}",JRLPS8362G,35505,SYS100007(Invalid State)/ SYS100005 (Additional Address Mandatory field missing)
271,0320a920-6008-4935-813f-370d30184741,Bejjanki Rakesh Kumar ,chari4645@gmail.com,8688926407,"{'gender': 'Male', 'birth_date': '1991-05-20'}",DYWPK1299C,22770,Wrong State Code 
272,baffa19a-6a82-44ee-81d0-a939d25230e7,JASHRATH VERMA ,93197624466091@dummy.com,9319762446,"{'gender': 'MALE', 'birth_date': '1985-04-20'}",AOSPV0284R,19226,SYS100007(Invalid State)/ SYS100005 (Additional Address Mandatory field missing)
273,c1dedbcf-2f8c-451f-abfc-085a5d239343,Chandan Kumar ,nishadc151@gmail.com,8726641655,"{'gender': 'Male', 'birth_date': '1997-04-06'}",CBSPN6871M,6071,SYS100007(Invalid State)/ SYS100005 (Additional Address Mandatory field missing)
274,32bc9108-a5c8-4e5a-a71d-6fba46f6cae4,VINOD C ,c.vinodvinu@gmail.com,9538945931,"{'gender': 'MALE', 'birth_date': '1997-08-25'}",BMEPV1739G,13948,SYS100004  (No record found)
275,7e75d1b5-976a-4ec8-b2ad-f2aa254eed51,SUDHIR BUDHIA ,2001611736@gmail.com,8984591864,"{'gender': 'MALE', 'birth_date': '1985-06-10'}",BAWPB4438G,30941,SYS100007(Invalid State)/ SYS100005 (Additional Address Mandatory field missing)
276,0305fcb0-b211-41e3-ada9-a2a0b9c6b614,NAVRATAN BHAKHDIWAL  ,QS2204469@gmail.com,7725958531,"{'gender': 'Male', 'birth_date': '1995-06-19'}",CQUPB7411G,17553,SYS100007(Invalid State)/ SYS100005 (Additional Address Mandatory field missing)
277,62319933-e274-48d3-9b5c-a610ab3ff7c4,Chauhan Yunushmiya  ,QS1680272@gmail.com,7802801310,"{'gender': 'Male', 'birth_date': '1990-01-01'}",AVJPC8680J,14386,SYS100007(Invalid State)/ SYS100005 (Additional Address Mandatory field missing)
278,a39b957a-3513-4d7a-bcdc-f21cd16331c4,Manoj Kumar Gouda ,sushantrnaik79@gmail.com,9437235083,"{'gender': 'Male', 'birth_date': '1980-04-20'}",ATRPG8977C,29184,Wrong State Code 
279,be2a354e-5b7e-4f18-8be5-ae48f422b8de,Pradyumna ,pradyu1973@gmail.com,9902956986,"{'gender': 'Male', 'birth_date': '1973-10-09'}",AOQPP9101D,21425,Last name is Missing
280,465ec262-91ef-4cd8-9c2c-0a73b92921f3,Mohammed Rooshan Ali ,Q1098717@gmail.com,8688218132,"{'gender': 'Male', 'birth_date': '1999-11-29'}",CVAPA8871L,16539,Wrong State Code 
282,11d8dda4-3ea6-48eb-a5b6-c3ad6ede19bc,Kocharala Ravinder Kumar ,QS1805654@gmail.com,8978300456,"{'gender': 'Male', 'birth_date': '1995-05-21'}",BLEPR0183D,43538,Wrong State Code 
284,c7a6a2fb-6048-489f-8c44-fb8ba0cf6895,Ajay Kumar ,Q1116632@gmail.com,9717933912,"{'gender': 'Male', 'birth_date': '1981-09-28'}",Bxipk4511q,13271,SYS100007(Invalid State)/ SYS100005 (Additional Address Mandatory field missing)
286,4065878b-eeea-4213-bd56-79ab50004887,RAJ KISHOR MAHTO ,raj.mahto@bizsupporta.com,9310689244,"{'gender': 'Male', 'birth_date': '1989-01-01'}",BFMPM6920H,23605,SYS100007(Invalid State)/ SYS100005 (Additional Address Mandatory field missing)
288,db56f755-db50-435c-a2fa-c501861cd982,CHITTURI SUDHEERKUMAR ,chitturisudheerkumar@gmail.com,9603980318,"{'gender': 'Male', 'birth_date': '1991-11-20'}",ATXPC9670N,20800,Wrong State Code 
290,778e747b-8397-453d-967d-0385a9c68167,NAEEM ,QS2154607@gmail.com,8802084808,"{'gender': 'Male', 'birth_date': '1994-01-25'}",AUKPN4879N,16552,Last name is Missing
291,e3a1ba95-cb33-4d00-8b73-f313fbc2fe4f,Arijit Biswas =UPPER(B92),ab.arijit2013@gmail.com,9733949689,"{'gender': 'MALE', 'birth_date': '1989-01-25'}",BJRPB0557N,16619,SYS100005 (Mandatory field missing)
292,e2f26199-ac48-4595-b9a7-cd26ab33f4a6,GAGANDEEP MORIA ,gagandeep.moria@bizsupporta.com,7355655278,"{'gender': 'Male', 'birth_date': '1986-03-04'}",BUMPM7247N,15119,SYS100007(Invalid State)/ SYS100005 (Additional Address Mandatory field missing)
293,55760325-4e0f-4187-b46a-5b596fe109c3,SATISH SHUKLA ,satishshukla485@gmail.com,9625993309,"{'gender': 'Male', 'birth_date': '1970-01-01'}",EMVPS3421J,11711,Wrong State Code 
295,2853e3c2-a60f-4670-801d-7df730f7ddd4,MOHAMED ASARUDEEN M ,asarudeen.jilani@gmail.com,9688825905,"{'gender': 'MALE', 'birth_date': '1998-05-15'}",EEOPM9004J,8301,SYS00601 The server did not respond. Please contact Customer Support Helpdesk at +91 (0) 22 6641 9010 for technical assistance.
296,583a9beb-1732-4f6b-ba24-2de881a205ce,SUMIT KUMAR ,Sumitnarya1403@gmail.com,8579992101,"{'gender': 'MALE', 'birth_date': '1997-03-14'}",EBVPK1377J,15367,SYS00601 The server did not respond. Please contact Customer Support Helpdesk at +91 (0) 22 6641 9010 for technical assistance.
297,d466766d-404e-443b-9337-739b79788344,MUKESH SINGH RATHORE  ,QS2181149@gmail.com,6375882138,"{'gender': 'Male', 'birth_date': '2001-06-25'}",ESNPR0073P ,634,SYS00601 The server did not respond. Please contact Customer Support Helpdesk at +91 (0) 22 6641 9010 for technical assistance.
298,13e6bf58-4737-4c56-83cf-8d45dba99e8e,HARSH DODIYA ,harsh.dodiya1998@gmail.com,9998120745,"{'gender': 'Male', 'birth_date': '1998-10-15'}",DISPD5190M,9217,SYS00601 The server did not respond. Please contact Customer Support Helpdesk at +91 (0) 22 6641 9010 for technical assistance.
299,5646a161-8b4c-44e5-8508-5128f0776faf,ANIL RAJU ,Bachhavanil021@gmail.com,8369934146,"{'gender': 'MALE', 'birth_date': '1980-09-10'}",DOYPB8504R,14093,SYS00601 The server did not respond. Please contact Customer Support Helpdesk at +91 (0) 22 6641 9010 for technical assistance.
300,aef01911-0510-4362-bd30-e38e57d13607,MANJEET SINGH ,manjeet2789@gmail.com,9958409363,"{'gender': 'Male', 'birth_date': '1989-09-13'}",CKIPS8876G,20270,SYS00601 The server did not respond. Please contact Customer Support Helpdesk at +91 (0) 22 6641 9010 for technical assistance.
301,576f0e81-8c02-4139-bbd6-fb95f173fab2,SURYA MUKHERJEE ,QS2057305@gmail.com,7551889743,"{'gender': 'MALE', 'birth_date': '1998-05-05'}",EFZPM6293H,5879,SYS00601 The server did not respond. Please contact Customer Support Helpdesk at +91 (0) 22 6641 9010 for technical assistance.
304,05be5e6e-2fcb-4f77-8deb-bc4da4e8c465,Dalbir Singh ,it.dalbir77@gmail.com,8837736385,"{'gender': 'Male', 'birth_date': '1997-04-06'}",MWKPS8943N,0,SYS00601 The server did not respond. Please contact Customer Support Helpdesk at +91 (0) 22 6641 9010 for technical assistance.
305,dc0237eb-5c23-4227-8f37-732779c258a9,ALOK KUMAR VINOD KUMAR SINGH ,alok_singh011@hotmail.com,8953565786,"{'gender': 'Male', 'birth_date': '1990-01-01'}",DMBPS9596B,17513,SYS00601 The server did not respond. Please contact Customer Support Helpdesk at +91 (0) 22 6641 9010 for technical assistance.
306,e5ef85ca-9e35-47a2-a984-abc05b4a7443,SANDIP MUKHERJEE ,QS1966443@gmail.com,7003613948,"{'gender': 'Male', 'birth_date': '1980-10-31'}",AQRPM6970E,20000,SYS100007(Invalid State)/ SYS100005 (Additional Address Mandatory field missing)
307,291ca43d-4729-4729-b579-11ad2754d26c,RAVINDRA VINAYAK JOSHI ,QS2078617@gmail.com,7020626719,"{'gender': 'MALE', 'birth_date': '1988-11-21'}",AIZPJ1215F,31235,SYS100007(Invalid State)/ SYS100005 (Additional Address Mandatory field missing)
309,406ec944-cafe-492f-ba84-5ce7b0f38080,KIRANKUMAR N BORAWAT ,borawat1993@gmail.com,7899456038,"{'gender': 'Male', 'birth_date': '1993-04-02'}",CALPB3821R,30576,Wrong State Code 
310,bbb587b2-c8a3-470c-ba1b-e41b9c056a87,SONU ,sonusharma2141993@gmail.com,9654071049,"{'gender': 'Male', 'birth_date': '1993-04-21'}",EEYPS1023F,17482,Last name is Missing
311,772aeb44-ffe0-421a-bde0-2adeb021804d,ASHUTOSH PATEL ,ashutoshbpl.patel@gmail.com,8839548066,"{'gender': 'MALE', 'birth_date': '1990-09-05'}",BQNPP3064M,29688,SYS100004  (No record found)
312,4bd865c6-24a0-4606-9740-1db2c209e0fa,GADDAM SURESH KUMAR REDDY ,sureshkumar.reddy@gmail.com,9700840011,"{'gender': 'Male', 'birth_date': '1991-01-01'}",BJHPR1469K,28000,Wrong State Code 
314,8f45febd-3eb9-4640-a2ff-4e7d10104a48,Ruthipakam Prashanth ,QS1593229@gmail.com,6281853527,"{'gender': 'Male', 'birth_date': '1990-01-01'}",DVGPR5250F,18140,SYS100007(Invalid State)/ SYS100005 (Additional Address Mandatory field missing)
315,ffaca924-8fe4-4ae7-bfa0-37c6597268e0,VISHNU ,QS2220855@gmail.com,9108512102,"{'gender': 'Male', 'birth_date': '2002-04-30'}",MZRPS8426E,14698,Last name is Missing
317,b372dd6e-6081-4e15-8b91-db0ae1e7d04f,GURMEL SINGH ,QS2109580@gmail.com,8572073744,"{'gender': 'Male', 'birth_date': '1989-05-05'}",FRCPS2470G,13471,SYS100007(Invalid State)/ SYS100005 (Additional Address Mandatory field missing)
318,45ab8001-d639-4f72-b23c-b42691bede98,BELLAMKONDA SIVA PRASAD ,sivap605@gmail.com,8688188255,"{'gender': 'Male', 'birth_date': '1991-06-04'}",CNXPB4322E,17492,SYS100007(Invalid State)/ SYS100005 (Additional Address Mandatory field missing)
319,f57a82f8-4ece-467d-914b-5741d0e249fe,SONU SINGH ,2001648594@gmail.com,9354664230,"{'gender': 'MALE', 'birth_date': '1995-12-31'}",IHTPS5510R,15606,SYS100007(Invalid State)/ SYS100005 (Additional Address Mandatory field missing)
322,0ba9e70e-e708-4c5e-bce9-ecc22e09b9ca,Manneti Gangadhar Reddy ,gangadharmanneti@gmail.com,9966336704,"{'gender': 'Male', 'birth_date': '1995-04-10'}",EOGPM4285H,20262,
325,9cd822bb-9f60-4d65-b5bb-374c46911b9c,PIUSH CHAUBEY ,80099723758060@dummy.com,8009972375,"{'gender': 'MALE', 'birth_date': '1996-01-01'}",BXGPC3001H,9202,SYS100007(Invalid State)/ SYS100005 (Additional Address Mandatory field missing)
327,ffb2dd9c-3502-41b2-8da0-3c6baba92037,ASHOK KUMAR NIGAM ,ashoknigam36@gmail.com,9009414476,"{'gender': 'male', 'birth_date': '1987-03-09'}",ARTPN4433G,12800,SYS100007(Invalid State)/ SYS100005 (Additional Address Mandatory field missing)
329,90db7124-7d5a-4906-8c2c-51676ac2df61,SIDRAMA ,2001489669@gmail.com,9035855595,"{'gender': 'Male', 'birth_date': '1995-01-29'}",GNJPS2481F,20137,Last name is Missing
330,1fcb8727-f512-4e05-912e-9b4cecd13cb0,NEERAJ KUMAR ,neerajcoo1007@live.com,8860088676,"{'gender': 'Male', 'birth_date': '1991-01-08'}",BGAPK1308J,34624,SYS100007(Invalid State)/ SYS100005 (Additional Address Mandatory field missing)
331,5bfe20f3-90c5-4712-a9b3-0c509c411aa1,Lakshami Narayan Choudhary ,lakshminarayan670@gmail.com,7011136535,"{'gender': 'Male', 'birth_date': '1995-06-05'}",BBCPC6444G,20961,SYS100007(Invalid State)/ SYS100005 (Additional Address Mandatory field missing)
332,1f8eb64b-4891-453b-b5dc-43c23a1f09a6,KAMLESH VERMA ,2001129638@gmail.com,9625174631,"{'gender': ' FEMALE ', 'birth_date': '1990-01-01'}",BKWPV5083K,17184,SYS100007(Invalid State)/ SYS100005 (Additional Address Mandatory field missing)
333,1b7ea19a-e568-4c01-816e-5787556b00f7,Nikhil Singla ,SINGLA.NIKHIL542@GMAIL.COM,8427844542,"{'gender': 'Male', 'birth_date': '1997-04-06'}",DSTPS3246E,4550,SYS100007(Invalid State)/ SYS100005 (Additional Address Mandatory field missing)
334,4169cbbe-cc8e-4a59-b51c-301c01a0d8d3,VAJITHA PARVIN ,VAJITHA2008@GMAIL.COM,7401020224,"{'gender': 'female', 'birth_date': '1984-08-03'}",AOBPV3545E,37658,SYS100007(Invalid State)/ SYS100005 (Additional Address Mandatory field missing)
335,4a0ff395-8885-4007-9864-31d0e7d6d2fb,RAMESH RAJENDRA KONDA ,QS1907205@gmail.com,7276338876,"{'gender': 'Male', 'birth_date': '1990-01-01'}",BOXPK4234C,16000,SYS100007(Invalid State)/ SYS100005 (Additional Address Mandatory field missing)
338,63278471-5317-495e-88ec-5ed071a4c606,Ritika Sharma ,ritikasharma1505@gmail.com,8962324550,"{'gender': 'F', 'birth_date': '1997-05-15'}",GWPPS5834F,19850,SYS100007(Invalid PIN Code/Invalid Additional Address PIN)
339,9abcd673-2ab7-44a5-a9b0-4d158a7ca4a8,CHANDRESH KUMAR ,2001695466@gmail.com,8960380305,"{'gender': 'MALE', 'birth_date': '1994-07-20'}",DDFPK0406P,21045,SYS100007(Invalid State)/ SYS100005 (Additional Address Mandatory field missing)
340,ba9825da-713f-4a30-ad69-d500b3a15945,NALLAGINALA SAI RAM ,QS2239802@gmail.com,8340995901,"{'gender': 'Male', 'birth_date': '1996-08-14'}",Blppr5342k,4822,SYS100007(Invalid State)/ SYS100005 (Additional Address Mandatory field missing)
343,8f21ea36-1398-4408-bc8e-fa2f5232e247,MAMAS KUMAR MAHANTA ,mamas.mahanta@bizsupporta.com,8658067392,"{'gender': 'Male', 'birth_date': '1995-07-10'}",CXNPM6636G,9338,Wrong State Code 
344,dbc2f6f5-938d-43de-9ff6-581162d78677,Anurag Mishra ,anuragmishraje@gmail.com,8756710635,"{'gender': 'Male', 'birth_date': '1998-07-10'}",EETPM2040R ,19356,Wrong State Code 
345,8b862b05-86cd-42a6-b749-fa63e36ccfad,RAVINDER SINGH ,QS2166530@gmail.com,7015215115,"{'gender': 'Male', 'birth_date': '1985-10-12'}",CQLPS9077G,19745,SYS100007(Invalid State)/ SYS100005 (Additional Address Mandatory field missing)
347,c0b6bccb-6f8c-4418-854f-8482d168040b,Manoj kumar,QS2123994@gmal.com,9306738704,"{'gender': 'Male', 'birth_date': '1989-01-01'}",EPEPK7251G,21883,SYS100007(Invalid State)/ SYS100005 (Additional Address Mandatory field missing)
349,b853bb3d-70da-4991-bffc-d1ec3b8d39ab,REVANTH BOLLAM Bollam,QS1789490@gmail.com,9550565174,"{'gender': 'Male', 'birth_date': '1997-03-04'}",EEIPB7436H,12487,Wrong State Code 
352,bc4deafb-8a8a-4f8d-b1ac-399fe6a76ca6,Rathod Digvijay,QS2200626@gmail.com,7202838538,"{'gender': 'Male', 'birth_date': '2001-01-02'}",GWVPD4609F,11667,SYS100004  (No record found)
354,fcfe5272-ac69-4b93-b977-738fe32f644f,Manasi Pathak,QS2211704@gmail.com,8789274250,"{'gender': 'Female', 'birth_date': '1997-07-11'}",EURPP8343E,20000,SYS100004  (No record found)
355,1fd0da57-65f9-471f-8699-ae16432570d8,Asif  Pathan,QS2192930@gmail.com,9870004618,"{'gender': 'Male', 'birth_date': '2001-08-21'}",FPKPP9757K,10117,SYS100004  (No record found)
358,36180007-6e04-40ef-aa5e-2c9eb064dca9,AKASH  BANGWAL,akash.bangwal@bizsupporta.com,8368274769,"{'gender': 'Male', 'birth_date': '1995-11-26'}",ERLPB2458D,39726,SYS100007(Invalid State)/ SYS100005 (Additional Address Mandatory field missing)
359,e42de22f-9616-4984-8f5a-3a88704ae099,IDUPULAPATI  ROSAIAH,2001554860@gmail.com,9848808639,"{'gender': 'Male', 'birth_date': '1995-01-29'}",EVFPR3413C,12804,New
