{"itemCount":10217,"md5Checksum":"YdVyrNDJxpDl0KTLSyuc2Q==","etag":"f6027d413b01c323270032c308282ea2-1","dataFileS3Key":"AWSDynamoDB/01644637572266-686692b4/data/wi2fnoemzm3jrhp6awhzc5htse.json.gz"}
{"itemCount":10473,"md5Checksum":"pwSKfzbyPY22wG7fr7u9ig==","etag":"291c9cf999fd7de05d342c58c87bd155-1","dataFileS3Key":"AWSDynamoDB/01644637572266-686692b4/data/uxj3a6phde5gpgep4xn3mqouc4.json.gz"}
{"itemCount":10519,"md5Checksum":"KZz9dSkGKvziUEH/QT0gkw==","etag":"08d67af5a1fbce70e52eee32b2a2d142-1","dataFileS3Key":"AWSDynamoDB/01644637572266-686692b4/data/cqrnegc4zi7d3pngtn2djw77ne.json.gz"}
{"itemCount":10392,"md5Checksum":"lssERJRsFlMTauOX/84vJw==","etag":"fd338108b24247d76ba89abd22142d6e-1","dataFileS3Key":"AWSDynamoDB/01644637572266-686692b4/data/w4p2qadrfizjzj5earc3456roy.json.gz"}
