{"itemCount":7625,"md5Checksum":"tNWXYH/m3C10fkJD5PHSHQ==","etag":"4ce04b5c9a5f611c8a1ced58ed501e3b-1","dataFileS3Key":"AWSDynamoDB/01640754860288-55d62fa0/data/fdqgpoqsd4ycpo2lokr4athuui.json.gz"}
{"itemCount":7761,"md5Checksum":"X+JfInAjLB3ZRaSrn86ntA==","etag":"7b379db005520fee5adede654fbdc5fa-1","dataFileS3Key":"AWSDynamoDB/01640754860288-55d62fa0/data/chqwovsuamygta2nijf3trths4.json.gz"}
{"itemCount":7835,"md5Checksum":"9Xt6YRBTWh42ctHbWf0Fgw==","etag":"a948de469939496d2f537a77f9efeb93-1","dataFileS3Key":"AWSDynamoDB/01640754860288-55d62fa0/data/v2azjvxu7izvvarf43iwde33cq.json.gz"}
{"itemCount":7772,"md5Checksum":"7Fx/pfaNnoStYYMUIDYYqA==","etag":"d01f050c1acd4e1af336b1753675892b-1","dataFileS3Key":"AWSDynamoDB/01640754860288-55d62fa0/data/eik56ynbhizwdcrlwomvultoqu.json.gz"}
