{"itemCount":10973,"md5Checksum":"K1x6fcs6rmonbIYBhbRQkQ==","etag":"c39883cc890de00554f0c7cf6a734346-1","dataFileS3Key":"AWSDynamoDB/01646059535037-2e0dac6d/data/l7a6r7mmfa2f5d6rdcgvg5arou.json.gz"}
{"itemCount":11242,"md5Checksum":"J+2wYmjAGIppB9p5w8LHEQ==","etag":"6bf22aee9ed9fc877e6ca94c24048e9a-1","dataFileS3Key":"AWSDynamoDB/01646059535037-2e0dac6d/data/rwmyzhklxqy3fag2lfh4of7kmq.json.gz"}
{"itemCount":11247,"md5Checksum":"tv9lamtaXsBIBZWduJL/JA==","etag":"db03e54269239c402905da0c11452923-1","dataFileS3Key":"AWSDynamoDB/01646059535037-2e0dac6d/data/zmwxas2lpi37lkyv2uv2ngnz5a.json.gz"}
{"itemCount":11153,"md5Checksum":"ND6M4p8D8eiyq2z442R3zg==","etag":"9f641cd88cf096738467841ecb73a0a9-1","dataFileS3Key":"AWSDynamoDB/01646059535037-2e0dac6d/data/hnpnp2j4la62lhvuzjhyhhv6xq.json.gz"}
