,created_at,phone_number
0,2021-09-07,7045209712
1,2021-09-08,9042203533
32,2021-09-01,6362822404
33,2021-09-01,8017249590
36,2021-09-01,7738984805
38,2021-09-08,9545816213
40,2021-09-01,9881474116
41,2021-09-08,9754028329
42,2021-09-08,8660112596
43,2021-09-08,8978299264
44,2021-09-08,7620515850
46,2021-09-08,7898615182
47,2021-09-08,7036865345
48,2021-09-08,9985956480
50,2021-09-01,9685143314
51,2021-09-08,9945744470
52,2021-09-01,9903338777
54,2021-09-01,9359723232
57,2021-09-01,7058760748
58,2021-09-08,9852625735
59,2021-09-08,9372233684
60,2021-09-01,7383239704
62,2021-09-01,9640461331
63,2021-09-08,9967257974
65,2021-09-01,7338911997
67,2021-09-08,9725473231
68,2021-09-01,8104609239
69,2021-09-08,6301238083
72,2021-09-08,9136771645
73,2021-09-01,8660575862
75,2021-09-09,9918336852
77,2021-09-09,7373917779
78,2021-09-01,7004571848
79,2021-09-09,9098444652
83,2021-09-01,9003022745
84,2021-09-09,9003413748
85,2021-09-09,8839977123
86,2021-09-09,8125147011
87,2021-09-01,7411101104
88,2021-09-09,9986215755
89,2021-09-09,7830210877
91,2021-09-09,8880039119
94,2021-09-21,7470843713
97,2021-09-08,8579010040
100,2021-09-01,7448368818
102,2021-09-08,9966781191
103,2021-09-01,7907560566
104,2021-09-08,6302110308
105,2021-09-08,7738556507
108,2021-09-01,8903726481
109,2021-09-08,9986286862
110,2021-09-08,7297932806
111,2021-09-01,8309615548
112,2021-09-01,9052083693
113,2021-09-01,8147315159
114,2021-09-01,8128202278
116,2021-09-01,8484900910
117,2021-09-08,9676858545
118,2021-09-01,9885927680
119,2021-09-01,9975618782
120,2021-09-01,7209387517
121,2021-09-08,9717882248
122,2021-09-08,7337675148
123,2021-09-01,8291171053
124,2021-09-01,9754482000
126,2021-09-08,7054126517
127,2021-09-08,9951248786
128,2021-09-08,7387063033
130,2021-09-01,9831789998
131,2021-09-01,9945049786
132,2021-09-01,7507898323
133,2021-09-08,7043981435
134,2021-09-01,9567341542
135,2021-09-01,9398286313
136,2021-09-08,9049377779
137,2021-09-01,9800871871
139,2021-09-08,9852377462
140,2021-09-08,7258996463
141,2021-09-08,7255903226
142,2021-09-08,9579796590
144,2021-09-08,8952968938
145,2021-09-08,7010552616
149,2021-09-08,8777460450
154,2021-09-09,8008582775
156,2021-09-09,9080363815
157,2021-09-09,9866177441
158,2021-09-09,7016146843
159,2021-09-21,8178461880
161,2021-09-01,9894274946
162,2021-09-08,9766002174
163,2021-09-08,9645686561
164,2021-09-08,8075123624
165,2021-09-01,7070966301
166,2021-09-08,9096225225
167,2021-09-08,8454895297
168,2021-09-08,9601149337
169,2021-09-08,9035180597
171,2021-09-08,9966110507
172,2021-09-08,7356853158
173,2021-09-08,8334816184
174,2021-09-08,9324373319
176,2021-09-08,9920958019
177,2021-09-08,9717707714
178,2021-09-08,9342854314
179,2021-09-08,9912004292
180,2021-09-08,9494796970
181,2021-09-08,9708161247
182,2021-09-08,9600045020
185,2021-09-08,9566610317
188,2021-09-08,8500251152
189,2021-09-08,9758093678
190,2021-09-08,7075453183
191,2021-09-08,9887311666
192,2021-09-21,9824004350
194,2021-09-08,8675503997
195,2021-09-08,9741015190
196,2021-09-08,8284003220
197,2021-09-08,8608603876
198,2021-09-08,9883509224
199,2021-09-08,9699761275
200,2021-09-01,9986250830
201,2021-09-08,9711912193
202,2021-09-08,9122594990
204,2021-09-08,7498428467
205,2021-09-08,9975507182
206,2021-09-08,8375989769
207,2021-09-08,9824756126
208,2021-09-08,8090908005
211,2021-09-08,8742927612
212,2021-09-08,9916473964
213,2021-09-08,7348813412
215,2021-09-09,9712912037
216,2021-09-09,9700780142
217,2021-09-09,8405959569
218,2021-09-09,7377634709
219,2021-09-09,7983099430
222,2021-09-09,9568694045
223,2021-09-09,9652055648
225,2021-09-09,9182263001
226,2021-09-08,8625079018
227,2021-09-08,6267156350
228,2021-09-01,7029330918
230,2021-09-08,9792000293
231,2021-09-08,9379203436
232,2021-09-08,7096702674
233,2021-09-08,9955221668
234,2021-09-08,8793633123
235,2021-09-08,8149202398
238,2021-09-08,7021037653
239,2021-09-08,9036167789
241,2021-09-08,9487343696
242,2021-09-08,7499561471
244,2021-09-08,7893988414
249,2021-09-08,8950418386
250,2021-09-01,8746966176
251,2021-09-08,7680036205
254,2021-09-08,9946036437
255,2021-09-08,9867416866
257,2021-10-02,6266418501
259,2021-09-08,6295422070
260,2021-09-08,8143624006
262,2021-09-08,9346058530
263,2021-09-08,9898286866
265,2021-09-08,8534915575
266,2021-09-08,7528852845
268,2021-09-08,9561099168
269,2021-09-08,8360164772
270,2021-09-08,8056522634
273,2021-09-09,9104652309
275,2021-09-09,8825469317
276,2021-09-09,7337279923
277,2021-09-09,7483479571
278,2021-09-09,8983094863
279,2021-09-09,8285242358
280,2021-09-09,7013099720
281,2021-09-09,8899073420
282,2021-09-09,6377128158
285,2021-09-09,9629011323
286,2021-09-09,7259126940
287,2021-09-09,9339424699
289,2021-10-02,8904120560
290,2021-09-08,9949839199
291,2021-09-08,9895335986
292,2021-09-08,9700582308
293,2021-09-08,9769686634
295,2021-09-08,9072290006
296,2021-09-08,9960217867
298,2021-09-09,9611202297
299,2021-09-09,7498522842
300,2021-09-09,9819993815
302,2021-09-09,7874209209
305,2021-09-09,6369380601
306,2021-09-09,9159185506
307,2021-09-09,9561956255
308,2021-09-09,9978229091
314,2021-09-09,8709612581
315,2021-09-09,7978489945
316,2021-09-09,7366012155
318,2021-09-09,9976161122
320,2021-09-21,8970115515
321,2021-09-09,9405356835
325,2021-09-08,9952262299
326,2021-09-08,9542921696
328,2021-09-08,9445873537
329,2021-09-08,7366838317
330,2021-09-08,9144547088
331,2021-09-08,7668688661
332,2021-09-08,8169002349
333,2021-09-08,9176643078
334,2021-09-08,8006864178
335,2021-09-08,8424899828
337,2021-09-08,9840812628
338,2021-09-09,8886669697
340,2021-09-09,6363509016
341,2021-09-09,7894396561
345,2021-09-09,9079774712
346,2021-09-09,9032334477
347,2021-09-09,8652850115
349,2021-09-09,9870913230
350,2021-09-09,8394939895
351,2021-09-09,9583498248
354,2021-09-01,9677056340
355,2021-09-01,9112623395
356,2021-09-08,7488290641
357,2021-09-08,8019864043
358,2021-09-08,8000990021
360,2021-09-08,7500287845
364,2021-09-08,9100253098
365,2021-09-08,8727092212
366,2021-09-08,6360771941
367,2021-09-01,9751024706
368,2021-09-08,9920864432
369,2021-09-08,9919248208
370,2021-09-08,7696214364
373,2021-09-08,8317630676
374,2021-09-08,8099355599
376,2021-09-01,9662233222
377,2021-09-01,8248222967
378,2021-09-08,8218495772
379,2021-09-08,9016078571
380,2021-09-08,9351513751
382,2021-09-09,8317679630
383,2021-10-02,8310398432
384,2021-09-01,8100122055
385,2021-10-17,9739193040
386,2021-09-01,8358824000
387,2021-09-08,8850460378
388,2021-09-08,6393116114
389,2021-09-08,7397365951
394,2021-09-08,9000150853
395,2021-09-08,7002240913
396,2021-09-09,8090339066
397,2021-09-09,9008476480
399,2021-09-09,7888769628
400,2021-09-09,9104304283
401,2021-09-09,9108581378
402,2021-09-09,9656425122
403,2021-09-09,8073911316
404,2021-09-09,8127210396
406,2021-09-09,7795472262
408,2021-09-09,9822420878
410,2021-09-09,9997725911
411,2021-09-09,9880157640
412,2021-09-09,9594135313
413,2021-09-09,9182747534
415,2021-09-09,9767233494
416,2021-09-21,8970222322
419,2021-09-08,7973161983
420,2021-09-08,9773414963
422,2021-09-08,9633646465
423,2021-09-08,9073100589
424,2021-09-08,8423290450
425,2021-09-08,9206929200
426,2021-09-08,9243232323
427,2021-09-08,8425096952
428,2021-09-08,7043597817
429,2021-09-08,8709313166
430,2021-09-08,9873116950
432,2021-09-08,9947812008
433,2021-09-08,9137634535
434,2021-09-08,9825013603
435,2021-09-08,9428148797
436,2021-09-08,8238181964
438,2021-09-08,9074606534
439,2021-09-08,8249205974
440,2021-09-08,7278463447
441,2021-09-08,9980680311
442,2021-09-08,8741027525
444,2021-09-08,7907304538
446,2021-09-08,9788624492
447,2021-09-08,8660617816
448,2021-09-08,6369001904
449,2021-09-08,9761636272
450,2021-09-09,9664515339
452,2021-09-08,9841499075
453,2021-09-08,9910026064
454,2021-09-08,6360460525
456,2021-09-08,9920222095
458,2021-09-08,9560948308
460,2021-09-08,9380827094
463,2021-09-01,9901288871
464,2021-09-08,8369107394
465,2021-09-08,7987386665
466,2021-09-08,8376950437
467,2021-09-01,9702401333
468,2021-09-08,7905920797
470,2021-09-09,8442974543
471,2021-09-01,9774293436
472,2021-09-02,8904700892
473,2021-09-03,7411311052
474,2021-09-09,9501245555
475,2021-09-09,9611250792
476,2021-09-03,7338448409
477,2021-09-03,7846045478
479,2021-09-04,9513132333
480,2021-09-04,7619449349
481,2021-09-04,8123324516
482,2021-09-09,9887582727
483,2021-09-21,8002657506
484,2021-09-04,9844235391
486,2021-09-08,9175338459
488,2021-09-08,9163141919
491,2021-09-08,9971292955
492,2021-09-08,8000643242
493,2021-09-04,9036162639
494,2021-09-09,9872032689
495,2021-09-05,9862058786
496,2021-09-05,7075109725
498,2021-09-05,8547884268
500,2021-09-09,7645012360
501,2021-09-09,8141104144
502,2021-09-09,8982895088
503,2021-09-06,9739458787
504,2021-09-09,9662495557
506,2021-09-06,9705446882
507,2021-09-06,9764685239
510,2021-09-06,9284607097
511,2021-09-09,9063678566
512,2021-09-06,8919968400
513,2021-09-06,9008043497
516,2021-09-08,6394470019
517,2021-09-08,9904743288
518,2021-09-08,9571594104
519,2021-09-07,8074917536
520,2021-09-08,9889422411
521,2021-09-08,8460527824
522,2021-09-07,9895023110
523,2021-09-07,8825851621
524,2021-09-08,6388110758
526,2021-09-08,9593416698
527,2021-09-08,9995540903
528,2021-09-07,8299258287
529,2021-09-07,7875351236
531,2021-09-07,7779045754
532,2021-09-08,7725866303
534,2021-09-08,9008237419
536,2021-09-09,9098166566
537,2021-09-09,9008444793
539,2021-09-09,9328129471
540,2021-09-09,7032028633
541,2021-09-09,9490049534
542,2021-09-09,9979640319
544,2021-09-09,9979596548
547,2021-09-09,9958623975
549,2021-09-09,7012397931
552,2021-09-09,9920350816
554,2021-09-21,8983262629
555,2021-09-21,7000234263
556,2021-09-21,9887310773
557,2021-09-21,9337886645
558,2021-09-21,9160609430
559,2021-09-21,9381811920
560,2021-09-21,9494970755
561,2021-09-21,9729345625
563,2021-09-21,7096671688
564,2021-09-22,7093676655
565,2021-09-22,8867372709
567,2021-09-22,9861137556
569,2021-09-23,7337796213
570,2021-09-23,9662067542
571,2021-09-23,8452858640
574,2021-09-23,8448765060
576,2021-09-23,8054279373
577,2021-09-23,8344225357
579,2021-09-09,8861515784
580,2021-09-09,9560963632
583,2021-09-09,9837049959
585,2021-09-09,8299036353
586,2021-09-09,7007679468
587,2021-09-09,9833876606
588,2021-09-09,8417848500
591,2021-09-09,9319762446
592,2021-09-09,8726641655
593,2021-09-09,9538945931
598,2021-09-09,8974022598
599,2021-09-09,7802801310
600,2021-09-09,7001535080
601,2021-09-09,9437235083
602,2021-09-10,9894015429
603,2021-09-10,8788894394
604,2021-09-10,8087390119
607,2021-09-10,8960932325
613,2021-09-11,8978300456
616,2021-09-21,9346739793
617,2021-09-21,9608094516
618,2021-09-21,9110736665
619,2021-09-21,7981648506
620,2021-09-21,9540914333
621,2021-09-21,7896456722
622,2021-09-23,6393237150
624,2021-09-23,9985572267
625,2021-09-23,7888665699
629,2021-09-24,7209887406
632,2021-09-25,9730575991
633,2021-09-25,9619851686
635,2021-09-26,7887508298
636,2021-09-26,9663152234
637,2021-09-26,9146331883
639,2021-09-26,9755238271
641,2021-09-26,9442183143
642,2021-09-26,9304759169
644,2021-09-11,7709690117
645,2021-09-11,9717933912
646,2021-09-11,6350256236
647,2021-09-11,9819840739
648,2021-09-12,9398282833
650,2021-09-12,9310689244
653,2021-09-12,8870188970
654,2021-09-12,9603980318
658,2021-09-13,7355655278
659,2021-09-13,7005611197
660,2021-09-13,9126443323
662,2021-09-13,8084874875
664,2021-09-13,7098332007
666,2021-09-13,9711156331
667,2021-09-13,9688825905
668,2021-09-13,8579992101
669,2021-09-13,6375882138
671,2021-09-13,8369934146
672,2021-09-13,9958409363
673,2021-09-13,7551889743
674,2021-10-17,8886223525
675,2021-09-12,7303682822
676,2021-09-13,9106627553
677,2021-09-13,8884385551
678,2021-09-13,8837736385
680,2021-09-13,7003613948
681,2021-09-13,9840699484
682,2021-09-13,7020626719
683,2021-09-13,7720929390
684,2021-09-13,9874204209
685,2021-09-13,7903940228
687,2021-09-13,9654071049
688,2021-09-13,9611163501
689,2021-09-13,8888887767
690,2021-09-13,8839548066
691,2021-09-13,9700840011
693,2021-09-13,9823229227
694,2021-09-13,9164797204
695,2021-09-13,7903496995
696,2021-09-13,7448990308
697,2021-09-13,8555041432
698,2021-09-13,8367311906
699,2021-09-13,8015232409
701,2021-09-13,9836366552
703,2021-09-13,9958505392
704,2021-09-13,8572073744
705,2021-09-13,8688188255
708,2021-09-13,8957871612
710,2021-09-13,7980109964
711,2021-09-13,7499432184
712,2021-09-13,7008830755
713,2021-09-13,8009972375
714,2021-09-13,9705076367
715,2021-09-13,7359329631
716,2021-09-13,7019427311
717,2021-09-13,9009414476
718,2021-09-21,9164911514
719,2021-09-21,9996773582
720,2021-09-21,8286530409
722,2021-09-21,9885806972
724,2021-09-21,7880249003
725,2021-09-21,9958615764
726,2021-09-20,7742779680
727,2021-09-23,7533961959
729,2021-09-23,8200395593
730,2021-09-23,8142125912
733,2021-09-23,8114757345
734,2021-09-23,7737186282
735,2021-09-23,9834436739
736,2021-09-23,8092609040
737,2021-09-23,9133106042
738,2021-09-23,8254022376
740,2021-09-13,9940488086
741,2021-09-13,9035855595
745,2021-09-13,9625174631
746,2021-09-13,8427844542
747,2021-09-13,7401020224
748,2021-09-13,7276338876
749,2021-09-13,9455333244
750,2021-09-13,7893504076
751,2021-09-13,8297949400
752,2021-09-13,6393628494
753,2021-09-13,8962324550
755,2021-09-13,7381791996
757,2021-09-13,7021328353
758,2021-09-13,9701185955
759,2021-09-14,8658067392
760,2021-09-14,8756710635
763,2021-09-14,9061244289
764,2021-09-14,7738856380
765,2021-09-14,8766765441
767,2021-09-14,8747974097
768,2021-09-17,7306172520
769,2021-09-17,8489142106
770,2021-09-17,9556246704
771,2021-10-02,9008204028
772,2021-09-17,8169605939
773,2021-09-17,8500267673
774,2021-09-21,7406833075
775,2021-09-21,9876275176
776,2021-09-21,7899685848
777,2021-09-21,8619758569
778,2021-09-23,7027506312
780,2021-09-23,6302512456
781,2021-09-23,7359275720
783,2021-09-23,9558379614
785,2021-09-25,8949724875
788,2021-09-25,8850267220
789,2021-09-25,8087247924
797,2021-09-26,9707435805
798,2021-09-26,9836343040
799,2021-09-26,8460414446
800,2021-09-26,9960262738
801,2021-09-26,8639454742
802,2021-09-26,8287965554
803,2021-09-26,8179048629
806,2021-09-17,9613414967
807,2021-09-17,9959317027
809,2021-09-21,8123648373
811,2021-09-21,9482202700
812,2021-09-21,9561566672
813,2021-09-21,8378090117
815,2021-09-22,8329552040
818,2021-09-23,9703125121
819,2021-09-23,9567676018
820,2021-09-23,9600149754
821,2021-09-23,9830836096
822,2021-09-23,9113096523
823,2021-09-23,9666679067
824,2021-09-23,9179793887
826,2021-09-24,9177192794
827,2021-09-24,9405739395
828,2021-09-24,9085482575
829,2021-09-24,9893430438
831,2021-09-25,9745622383
832,2021-09-25,9952216233
833,2021-09-25,6361765799
834,2021-09-25,7875868424
835,2021-09-25,8707813766
836,2021-09-26,9603031681
838,2021-09-17,9892239585
839,2021-09-17,9550565174
841,2021-09-17,9179498379
842,2021-09-17,8884168983
843,2021-09-17,8553174540
844,2021-09-17,9831293141
845,2021-09-17,8149149871
846,2021-09-17,9848796183
847,2021-09-17,9431007258
848,2021-09-17,7202838538
849,2021-09-17,9620102037
850,2021-09-17,9626836084
851,2021-09-17,9952722634
853,2021-09-17,9508544804
854,2021-09-17,9865459284
855,2021-09-17,8789274250
856,2021-09-17,9870004618
857,2021-09-17,9623831427
859,2021-09-17,9558770067
860,2021-09-17,8412000177
861,2021-09-17,8209443406
862,2021-09-17,9028989796
863,2021-09-17,8638226158
864,2021-09-17,7275567013
865,2021-09-17,7219087307
870,2021-09-18,9431551980
872,2021-09-18,7737539979
873,2021-09-21,9052540996
874,2021-09-21,9505547168
875,2021-09-21,9807001743
877,2021-09-21,9487515963
878,2021-09-21,7299598961
879,2021-09-21,8329732262
883,2021-09-22,8329625170
884,2021-09-22,9360687977
885,2021-09-22,9536377131
886,2021-09-22,9347848534
887,2021-09-22,9571830723
888,2021-09-22,7620944437
890,2021-09-22,9353432074
891,2021-09-22,9353123108
893,2021-09-22,8930740045
894,2021-09-22,8740917141
895,2021-09-22,9640964026
896,2021-09-22,8129125358
897,2021-09-22,9988166429
898,2021-09-24,8688828288
899,2021-09-24,9025965852
901,2021-09-22,8291781518
902,2021-09-18,9053001300
904,2021-09-18,6301108046
905,2021-09-18,9467060921
906,2021-09-18,7829089375
907,2021-09-18,7807331150
908,2021-09-18,9767193224
909,2021-09-18,9378076366
910,2021-09-21,8095964747
911,2021-09-21,9503488954
912,2021-09-21,8178645664
913,2021-09-21,8222833171
914,2021-09-21,8239389222
915,2021-09-21,8779717825
916,2021-09-21,9456187492
917,2021-09-21,7678246403
918,2021-09-21,7848908836
919,2021-09-22,8380983122
920,2021-09-22,9666359494
921,2021-09-24,8101049232
922,2021-09-24,7039388402
923,2021-09-24,8001642262
924,2021-09-24,9607727777
925,2021-09-24,9815091960
926,2021-09-24,7569142143
928,2021-09-24,8374839392
929,2021-09-24,8178459612
930,2021-09-24,7364073555
931,2021-09-24,8660279408
932,2021-09-24,9595139791
933,2021-09-24,9535130544
935,2021-09-18,8445473955
936,2021-09-18,9311859299
937,2021-09-18,8805994015
938,2021-09-18,7600111122
939,2021-09-18,8297453551
940,2021-09-18,9993921279
942,2021-09-18,8197915983
943,2021-09-18,6264648713
944,2021-09-18,9990427492
945,2021-09-18,8008101562
946,2021-09-18,7019241442
948,2021-09-18,7398879119
949,2021-09-18,9701006027
950,2021-09-18,9938261831
951,2021-09-18,9173111115
952,2021-09-18,8460797787
953,2021-09-18,7022051892
954,2021-09-18,8485828682
955,2021-09-18,9110385671
956,2021-09-18,9502624152
957,2021-09-18,9673691129
958,2021-09-18,8169025817
959,2021-09-18,7536975074
960,2021-09-18,9634388234
961,2021-09-18,9699262432
962,2021-09-18,9717922967
963,2021-09-18,9026868383
964,2021-09-18,7009851502
965,2021-09-18,9028516983
966,2021-10-02,7042090884
967,2021-09-18,8147474741
968,2021-09-18,7572979873
969,2021-09-18,8435308170
971,2021-09-18,9877576824
972,2021-09-18,7908246362
973,2021-09-18,9591857048
974,2021-09-21,9558951050
975,2021-09-21,9938966860
977,2021-09-21,9847696379
978,2021-09-22,8849091509
979,2021-09-22,8923874240
980,2021-09-22,8169214409
981,2021-09-22,8050062032
982,2021-09-22,9725713854
983,2021-09-22,8219386880
984,2021-09-22,9711018809
986,2021-09-22,7979838850
987,2021-09-22,7792956268
989,2021-09-22,8486232500
990,2021-09-22,8888804345
991,2021-09-24,8617835501
992,2021-09-24,8422022539
993,2021-09-24,8054275270
994,2021-09-24,8097004843
996,2021-09-24,8122525704
997,2021-09-24,7499195705
998,2021-09-25,9600880869
1000,2021-09-25,7997670682
1001,2021-09-18,8109515521
1002,2021-09-22,8879668585
1004,2021-09-22,7827052224
1005,2021-09-22,8348430390
1007,2021-09-22,8460006311
1008,2021-09-22,8440014159
1009,2021-09-22,9100836289
1010,2021-09-22,7006118409
1011,2021-09-22,9325560250
1012,2021-09-22,7829821794
1013,2021-09-22,9555222832
1014,2021-09-22,9010264420
1015,2021-09-22,7986730117
1018,2021-09-22,9026249226
1020,2021-09-22,8169871359
1022,2021-09-22,8692073139
1023,2021-09-22,7204819978
1024,2021-09-22,9586161464
1025,2021-09-22,7997001189
1026,2021-09-22,7008950559
1027,2021-09-22,8374663841
1028,2021-09-24,7908173124
1030,2021-09-24,8668131764
1033,2021-09-18,8438858684
1034,2021-09-18,9097837933
1035,2021-09-18,9678959559
1036,2021-09-18,9910791626
1037,2021-09-18,9389530847
1038,2021-09-18,6363055156
1039,2021-09-18,7676522856
1040,2021-09-18,7978319721
1041,2021-09-18,7057096987
1043,2021-09-18,8124335754
1044,2021-09-22,7000767457
1046,2021-09-22,8143688739
1047,2021-09-22,6363242076
1048,2021-09-22,9623122191
1049,2021-09-22,9030252939
1050,2021-09-22,7829843130
1051,2021-09-22,7991093514
1052,2021-09-22,8493904996
1053,2021-09-22,8971728066
1054,2021-09-22,8910586621
1055,2021-09-22,8210557470
1057,2021-09-22,8074888929
1058,2021-09-22,8778258894
1059,2021-09-22,9694777101
1060,2021-09-22,7398406625
1061,2021-09-22,8602228497
1062,2021-09-22,6289400561
1063,2021-09-22,8007788929
1064,2021-09-24,9891003039
1065,2021-09-18,6362584598
1066,2021-09-18,9886272372
1067,2021-09-18,9919820203
1069,2021-09-18,6291600861
1070,2021-09-18,8923784742
1072,2021-09-18,6363704701
1073,2021-09-18,8800675753
1074,2021-09-18,9618686646
1075,2021-09-18,9649407284
1076,2021-09-18,9728329029
1077,2021-09-18,7021720150
1078,2021-09-18,9890006797
1079,2021-09-18,8754290850
1080,2021-09-18,6382225049
1081,2021-09-18,9224000143
1082,2021-09-18,9123384143
1083,2021-09-18,9992211333
1085,2021-09-18,9418238023
1086,2021-09-18,7623947132
1087,2021-09-18,7528852746
1088,2021-09-18,8837804300
1089,2021-09-18,7259318596
1091,2021-09-18,8958220817
1092,2021-09-18,6297610596
1093,2021-09-18,7235882571
1095,2021-09-18,7090373312
1096,2021-09-18,9832091763
1097,2021-09-18,9398160782
1098,2021-09-18,9594495962
1099,2021-09-18,6291168890
1100,2021-09-18,8527674936
1101,2021-09-18,8700564010
1102,2021-09-18,9549999933
1103,2021-09-18,6260797340
1105,2021-09-22,8977558216
1106,2021-09-22,9284510894
1107,2021-09-22,9874393163
1108,2021-09-24,7385704395
1109,2021-09-24,8249748298
1110,2021-09-24,9513079733
1111,2021-09-24,7893689716
1112,2021-09-24,8019693656
1115,2021-09-24,7004674856
1116,2021-09-24,6001832122
1117,2021-09-24,7428108986
1118,2021-09-24,8810685415
1119,2021-09-24,9601251736
1120,2021-09-24,8652722000
1122,2021-09-24,8959315343
1123,2021-09-24,7975047560
1126,2021-09-25,9993222793
1130,2021-09-18,9133527430
1132,2021-09-18,8750602782
1133,2021-09-18,9989863130
1135,2021-09-22,9925315601
1136,2021-09-22,7741909808
1137,2021-09-22,7903755550
1138,2021-09-22,9830615900
1139,2021-09-22,8750321463
1140,2021-09-22,8008346262
1141,2021-09-22,7014260828
1142,2021-09-22,9716363234
1143,2021-09-22,9168885922
1144,2021-09-22,8115454894
1145,2021-09-22,9622419671
1146,2021-09-24,9867080431
1147,2021-09-24,6202698935
1148,2021-09-24,9964959402
1149,2021-09-25,7348463559
1150,2021-09-26,9999370749
1151,2021-09-26,9025529683
1152,2021-09-26,7065420420
1153,2021-09-26,8076401681
1154,2021-09-26,9155757613
1158,2021-09-26,9944782789
1160,2021-09-26,8827553353
1161,2021-09-26,9706283896
1163,2021-09-18,8574333184
1164,2021-09-18,7986639135
1165,2021-09-18,8076987432
1168,2021-09-18,9910445328
1169,2021-09-18,7252809571
1170,2021-09-18,9915266578
1171,2021-09-18,9999477458
1172,2021-09-18,7995725978
1173,2021-09-18,9885938216
1174,2021-09-18,9860695845
1175,2021-09-18,9860228383
1176,2021-09-18,9752396639
1177,2021-09-18,9471047310
1178,2021-09-18,9878716364
1179,2021-09-18,7591928308
1180,2021-09-18,7780561871
1182,2021-09-18,7498769587
1183,2021-09-18,9875161878
1184,2021-09-18,9741659918
1185,2021-09-18,7483272958
1186,2021-09-18,9727743004
1187,2021-09-18,9940434147
1189,2021-09-18,7506814852
1190,2021-09-18,9988833346
1191,2021-09-18,8329614037
1192,2021-09-18,9315394781
1193,2021-09-18,8089550917
1196,2021-09-19,8217639273
1197,2021-09-19,7892807481
1199,2021-09-20,9885231588
1200,2021-09-20,9830913815
1201,2021-09-20,9892431671
1202,2021-09-20,9655792836
1203,2021-09-20,8602509624
1204,2021-09-20,9831506334
1206,2021-09-20,9998844665
1207,2021-09-20,8897476946
1208,2021-09-20,8638436902
1209,2021-09-22,8918935884
1210,2021-09-22,9998016630
1211,2021-09-22,9867577188
1213,2021-09-22,9990981455
1214,2021-09-22,9560454246
1215,2021-09-22,8800128670
1216,2021-09-22,9886094123
1217,2021-09-22,6382448987
1218,2021-09-22,7830333026
1219,2021-09-22,9315643544
1221,2021-09-22,9782209402
1222,2021-09-22,8087025586
1223,2021-09-22,8897778739
1224,2021-09-22,8900686487
1225,2021-09-22,7898177930
1226,2021-09-22,9576059876
1228,2021-09-20,8055694125
1229,2021-09-20,7609080203
1230,2021-09-20,7040403566
1231,2021-09-20,8918439150
1232,2021-09-20,9018937870
1233,2021-09-20,9001493211
1234,2021-09-22,9799071683
1235,2021-09-22,9088888805
1236,2021-09-22,9429211401
1237,2021-09-22,8296428401
1238,2021-09-22,9439753222
1239,2021-09-22,8870337037
1240,2021-09-22,9099943748
1241,2021-09-22,9700446160
1242,2021-09-22,9038027480
1243,2021-09-22,8974841652
1244,2021-09-22,6207531581
1246,2021-09-22,9823901255
1248,2021-09-24,8686948262
1249,2021-09-24,9741360043
1250,2021-09-24,8827409170
1251,2021-09-24,6395812475
1253,2021-09-24,7702602680
1254,2021-09-24,9176990126
1255,2021-09-24,9604749691
1256,2021-09-24,8957894635
1257,2021-09-24,9720537694
1259,2021-09-24,7083198343
1260,2021-09-20,7075347437
1261,2021-09-20,8269574915
1262,2021-09-20,9819296424
1263,2021-09-20,9130590073
1265,2021-09-20,9517430906
1266,2021-09-20,7021815301
1267,2021-09-20,9581792098
1268,2021-09-20,9179550425
1269,2021-09-20,7482843538
1270,2021-09-20,9604341077
1271,2021-09-20,9047719407
1273,2021-09-20,8094400829
1274,2021-09-20,7822903905
1276,2021-09-20,9537012128
1278,2021-09-20,9062974001
1280,2021-09-20,9999445970
1281,2021-09-20,9848896369
1283,2021-09-20,7006672982
1284,2021-09-20,7083080892
1285,2021-09-20,7003738196
1286,2021-09-20,9769306589
1289,2021-09-20,8309980835
1290,2021-09-20,9359916462
1291,2021-09-20,7701879700
1293,2021-09-20,9495572237
1294,2021-09-20,9040374526
1295,2021-09-20,8801853787
1297,2021-09-20,9994509190
1298,2021-09-20,9686427501
1299,2021-09-20,7837894671
1300,2021-09-22,9992802406
1301,2021-09-24,9851642876
1302,2021-09-18,8867243336
1303,2021-09-24,9004560855
1304,2021-09-24,9768156962
1305,2021-09-24,8013413071
1306,2021-09-24,9803220681
1307,2021-09-24,9702818464
1308,2021-09-24,7978923018
1311,2021-09-24,8334987537
1313,2021-09-25,7075008339
1315,2021-09-25,7990997106
1316,2021-09-25,9492777625
1318,2021-09-25,9319477952
1319,2021-09-26,7276404898
1321,2021-09-26,9616745544
1323,2021-09-26,8469701882
1325,2021-10-17,6385856168
1326,2021-09-20,9004636046
1327,2021-09-20,9898794080
1328,2021-09-20,7095083191
1329,2021-09-20,8285241930
1330,2021-09-20,9688913953
1332,2021-09-20,6397060672
1333,2021-09-22,9943615988
1334,2021-09-22,9354585230
1335,2021-09-22,6260893957
1337,2021-09-22,9527710738
1338,2021-09-22,9424634715
1340,2021-09-22,8960284650
1342,2021-09-22,8660214847
1344,2021-09-22,6392278076
1345,2021-09-24,9057766835
1346,2021-09-24,8766729079
1348,2021-09-24,9585888375
1350,2021-09-24,9726148682
1351,2021-09-24,9347461183
1353,2021-09-24,6204344481
1354,2021-09-24,7012588280
1355,2021-09-24,7042724607
1356,2021-09-24,9767438655
1357,2021-09-24,8098095753
1358,2021-10-17,9750831409
1359,2021-09-20,8972190595
1360,2021-09-20,7507400840
1361,2021-09-20,8208104862
1362,2021-09-20,9010956134
1363,2021-09-20,9665499521
1365,2021-09-20,8669132746
1366,2021-09-20,9238786143
1367,2021-09-20,8758123637
1369,2021-09-20,9990257293
1370,2021-09-20,9705566039
1371,2021-09-20,9098727450
1372,2021-09-20,7206079192
1375,2021-09-20,8623025951
1376,2021-09-20,9888290450
1377,2021-09-20,8788201110
1378,2021-09-20,9310151360
1379,2021-09-20,7736338660
1380,2021-09-20,7569249687
1381,2021-09-20,9910247718
1382,2021-09-20,9302239140
1383,2021-09-20,8160099033
1384,2021-09-20,9980671695
1385,2021-09-20,9866410060
1386,2021-09-20,9961844826
1387,2021-09-20,8591541823
1388,2021-09-20,8169432940
1389,2021-09-20,9819025924
1390,2021-09-20,9718358658
1392,2021-09-20,9573235601
1393,2021-09-20,9810823188
1394,2021-09-21,8074102305
1395,2021-09-21,8956208210
1396,2021-09-21,7057154092
1397,2021-09-21,9691878067
1398,2021-09-21,7083183815
1399,2021-09-21,6370443620
1401,2021-09-22,9585485324
1402,2021-09-22,8421462200
1403,2021-09-22,9666306549
1404,2021-09-22,8435407748
1405,2021-09-22,9614308319
1406,2021-09-22,9315585601
1407,2021-09-22,9830022766
1408,2021-09-22,7036471654
1409,2021-09-22,9179995666
1410,2021-09-22,7533915702
1412,2021-09-22,8555865916
1413,2021-09-22,9002999969
1414,2021-09-22,9391331492
1415,2021-09-22,9101963694
1416,2021-09-22,9791272720
1418,2021-09-22,6301144939
1419,2021-09-22,7829343872
1420,2021-09-22,8108916818
1422,2021-09-22,8825658567
1423,2021-09-22,8355909561
1424,2021-09-25,9122308002
1426,2021-09-21,9947265672
1427,2021-09-21,8108912574
1429,2021-09-21,8221887143
1432,2021-09-22,9164183050
1433,2021-09-22,9804548358
1434,2021-09-24,9896773462
1435,2021-09-24,9560950686
1437,2021-09-24,9884940680
1441,2021-09-24,8220557111
1443,2021-09-24,9922643230
1444,2021-09-24,9963873109
1445,2021-09-24,9833539227
1447,2021-09-24,7834819965
1449,2021-09-24,9871191592
1451,2021-09-24,6360126216
1453,2021-10-02,8422022322
1454,2021-09-24,7559376555
1455,2021-09-24,9328144629
1456,2021-09-24,8807703505
1457,2021-09-26,7032438309
1458,2021-09-21,9992997018
1460,2021-09-21,9344261314
1462,2021-09-22,9072606843
1463,2021-09-22,9540714191
1465,2021-09-22,9739050731
1467,2021-09-22,9568410781
1468,2021-09-22,9687781869
1469,2021-09-22,7019797769
1470,2021-09-22,8668424270
1471,2021-09-22,8485888588
1472,2021-09-22,7001208750
1474,2021-09-22,8087900800
1476,2021-09-22,8788989559
1477,2021-09-22,9963577234
1478,2021-09-22,8830939679
1479,2021-09-22,8712320631
1480,2021-09-22,9599464106
1481,2021-09-22,9814900590
1482,2021-09-22,8130373444
1483,2021-09-22,7696003551
1484,2021-09-22,9158091450
1485,2021-09-22,9620739840
1486,2021-09-22,8409929667
1487,2021-09-22,8898440743
1488,2021-09-22,9158761376
1491,2021-09-21,9614858343
1492,2021-09-21,9962986782
1493,2021-09-21,8951656476
1494,2021-09-21,9654134929
1497,2021-09-21,8690111700
1499,2021-09-21,9836712301
1500,2021-09-21,8000053338
1501,2021-09-21,8309413517
1502,2021-09-22,9797803344
1503,2021-09-22,8296195241
1504,2021-09-25,9993677739
1505,2021-09-26,8000531162
1506,2021-09-26,7083607671
1509,2021-09-26,8123160083
1510,2021-09-26,9597291623
1511,2021-09-26,8918497903
1512,2021-09-26,9773571705
1513,2021-09-26,8017850265
1515,2021-09-26,8637051632
1517,2021-09-26,9940284853
1518,2021-09-26,8130661093
1519,2021-09-26,9905279043
1521,2021-09-26,8423942009
1522,2021-09-26,9500947775
1523,2021-09-26,9070312780
1524,2021-09-26,9880495217
1526,2021-09-26,9891704002
1527,2021-09-26,9899895741
1528,2021-09-26,7509963417
1529,2021-09-26,6002151713
1530,2021-09-26,7001932309
1531,2021-09-26,9036367795
1532,2021-09-26,7755007725
1535,2021-09-26,7355154486
1536,2021-09-26,7001490144
1537,2021-09-26,7293746456
1539,2021-09-26,8507022601
1541,2021-09-26,7735381575
1544,2021-09-26,7351359167
1547,2021-10-02,8830621882
1548,2021-10-02,7978692853
1549,2021-10-03,9827747759
1550,2021-10-03,7678341543
1551,2021-10-03,8077830517
1552,2021-10-03,9589924777
1553,2021-10-03,9495845396
1554,2021-10-03,8072162632
1557,2021-09-26,7789861573
1558,2021-09-26,9098253189
1559,2021-09-26,9618197950
1560,2021-09-26,9871260940
1561,2021-10-02,7003635335
1562,2021-10-02,9815222272
1563,2021-10-02,6382383867
1564,2021-10-03,9860300907
1565,2021-10-03,9750837092
1566,2021-10-03,9985822101
1567,2021-10-03,7036230539
1568,2021-10-03,7735507782
1569,2021-10-03,9434162162
1570,2021-10-03,9004555559
1571,2021-10-03,9850654238
1572,2021-10-03,9676434422
1573,2021-10-03,9686740931
1574,2021-10-03,9881773333
1575,2021-10-03,6204569096
1576,2021-10-03,8809947960
1577,2021-10-03,6370913556
1579,2021-10-03,9985597000
1580,2021-10-03,9360808608
1581,2021-10-03,8224889600
1582,2021-10-03,7779998869
1587,2021-10-04,9050244296
1588,2021-09-26,9657381600
1589,2021-09-26,9495116884
1592,2021-09-26,8953761815
1594,2021-09-26,8240828157
1595,2021-10-02,9935435431
1596,2021-10-02,9866532933
1597,2021-10-03,8341222431
1598,2021-10-03,9711061990
1602,2021-10-03,7878957830
1603,2021-10-03,9626232922
1604,2021-10-03,9703402111
1605,2021-10-03,7665050257
1606,2021-10-03,6281611174
1608,2021-10-03,9702098922
1609,2021-10-03,7409675647
1610,2021-10-03,9798892991
1612,2021-10-03,8876310430
1613,2021-10-03,7013449099
1614,2021-10-03,7001828697
1615,2021-10-03,9419069619
1616,2021-10-03,9914105432
1617,2021-10-03,7836927165
1618,2021-10-03,7898357545
1619,2021-10-03,8130769047
1620,2021-09-26,8618882523
1621,2021-09-26,9902724234
1623,2021-09-26,8828374920
1624,2021-09-26,7599888869
1625,2021-09-26,9365315137
1626,2021-09-26,8390475047
1627,2021-09-26,8956725647
1628,2021-09-26,9042650727
1629,2021-09-26,7506902691
1630,2021-09-26,9146660666
1632,2021-09-27,6266330750
1633,2021-10-17,9949312090
1639,2021-09-27,9164792317
1640,2021-09-27,9372315967
1642,2021-09-27,9988033989
1643,2021-09-27,7004100591
1646,2021-09-27,9373999949
1647,2021-09-27,7046826420
1648,2021-09-27,8296548581
1651,2021-09-27,8250517364
1654,2021-09-27,9359293902
1655,2021-09-27,9901715346
1656,2021-09-27,9710693314
1657,2021-09-27,7483440590
1658,2021-09-27,9644962196
1660,2021-10-02,9106102236
1661,2021-10-02,9746934275
1662,2021-10-02,6282626380
1663,2021-10-02,8850115602
1664,2021-10-02,8855955119
1665,2021-10-02,7011531397
1666,2021-10-02,9693909139
1668,2021-10-02,7017286449
1669,2021-10-02,7708128776
1670,2021-10-02,9864500660
1671,2021-10-03,9776415699
1672,2021-10-03,8710092395
1673,2021-10-03,7973879480
1674,2021-10-03,9444466614
1675,2021-10-03,8089873851
1676,2021-10-03,7007443711
1677,2021-10-03,9696593761
1678,2021-10-03,7566421374
1679,2021-10-03,9649445533
1680,2021-10-03,7002568295
1681,2021-10-03,9334784246
1682,2021-10-03,8389994732
1683,2021-10-04,7651870602
1684,2021-10-04,9967088372
1685,2021-10-04,6305867898
1686,2021-09-27,9970631435
1687,2021-09-27,9154713313
1688,2021-09-27,8274993676
1689,2021-09-27,7043611289
1690,2021-09-27,7066781478
1692,2021-10-02,9624431427
1694,2021-10-02,8878400781
1695,2021-10-02,6371920278
1696,2021-10-02,8000435555
1697,2021-10-02,9431220227
1698,2021-10-02,7678344120
1699,2021-10-02,9489570007
1701,2021-10-02,8687739766
1702,2021-10-02,9884847530
1704,2021-10-02,9398480173
1705,2021-10-02,9871215271
1708,2021-10-02,8979007111
1710,2021-10-02,9555156755
1712,2021-10-02,9004501313
1713,2021-10-02,8975527501
1716,2021-10-02,9603225309
1717,2021-10-02,7988579169
1718,2021-09-27,9994150621
1719,2021-09-27,9637372952
1722,2021-09-28,9811918215
1723,2021-09-28,9429786444
1725,2021-09-28,9066832455
1726,2021-09-28,7970972383
1727,2021-09-28,9408644218
1728,2021-09-28,8939659773
1729,2021-09-28,9098478153
1730,2021-09-28,9654621005
1731,2021-09-28,7096312143
1732,2021-10-02,7987712283
1733,2021-10-02,8422914320
1734,2021-10-02,8318750828
1737,2021-10-02,7074109861
1738,2021-10-02,8088016005
1740,2021-10-02,6360411439
1741,2021-10-02,9845353383
1742,2021-10-02,8179167472
1743,2021-10-02,7045076829
1744,2021-10-03,9506482239
1746,2021-10-03,8051587757
1748,2021-10-03,9399049788
1752,2021-09-28,8828143800
1753,2021-09-28,8887474795
1754,2021-09-28,8658532636
1756,2021-09-28,7847034982
1757,2021-09-28,7349484790
1760,2021-09-28,8499968338
1764,2021-09-28,8108709208
1765,2021-09-28,9535665551
1766,2021-09-28,9652816345
1767,2021-09-28,7801090997
1770,2021-09-28,7015028798
1772,2021-09-28,9620639862
1773,2021-09-28,9754672675
1774,2021-09-28,9905436188
1775,2021-09-28,9922277336
1778,2021-09-28,6360631193
1779,2021-09-28,6202235230
1780,2021-09-28,8683978767
1781,2021-09-28,9795580430
1782,2021-09-25,9654975474
1783,2021-09-28,9319660344
1784,2021-09-28,9652953720
1785,2021-09-28,6351918531
1786,2021-09-28,8982613732
1788,2021-09-28,9373349169
1789,2021-09-28,9952120866
1790,2021-10-02,9913253562
1791,2021-10-02,7383037701
1792,2021-10-02,8770761732
1793,2021-10-17,7356316283
1794,2021-10-02,9021262950
1795,2021-10-02,7278379108
1797,2021-10-02,7000818218
1798,2021-10-02,9595470484
1799,2021-10-02,7681059587
1800,2021-10-02,8240734054
1802,2021-10-02,9030308380
1804,2021-10-02,9160215581
1805,2021-10-02,6305722077
1808,2021-10-02,9906935559
1809,2021-10-02,8688413625
1810,2021-10-02,7411558697
1812,2021-10-02,7973462021
1814,2021-10-02,9581043032
1815,2021-09-28,9620642458
1817,2021-09-28,9877664424
1819,2021-09-28,9437170682
1820,2021-09-28,8169174382
1821,2021-09-28,9340804200
1822,2021-09-28,9629193315
1823,2021-09-28,9004067079
1824,2021-09-28,8503944528
1826,2021-09-28,7602855866
1827,2021-09-28,9787310386
1829,2021-09-28,9848168333
1830,2021-09-28,9833721903
1832,2021-09-28,8858200824
1833,2021-09-28,8123482572
1834,2021-09-28,9361312051
1835,2021-09-28,8142597548
1836,2021-09-28,9820187585
1837,2021-09-28,7001304293
1839,2021-09-28,9691259282
1840,2021-09-28,9650522252
1841,2021-09-28,9886355221
1842,2021-09-28,8660997932
1844,2021-09-28,9064329084
1847,2021-09-28,8605188867
1849,2021-09-28,9702636401
1852,2021-09-28,8185809338
1853,2021-09-28,9705493601
1854,2021-10-02,9546187111
1855,2021-10-03,9971201413
1857,2021-10-03,9540766523
1859,2021-10-04,9880128077
1860,2021-10-04,9821435868
1861,2021-10-04,8700714572
1862,2021-10-04,7981086663
1863,2021-10-04,9593302736
1864,2021-10-04,8553336698
1865,2021-10-04,6360965105
1866,2021-10-05,6374900376
1867,2021-10-05,9966640221
1868,2021-10-05,7265036963
1869,2021-10-05,9023248757
1871,2021-10-06,9284623671
1872,2021-10-06,8754580602
1873,2021-10-06,8726339012
1874,2021-10-06,8777835426
1875,2021-10-06,8856962010
1876,2021-10-06,9834611578
1877,2021-10-06,8888583197
1878,2021-10-06,9614633752
1879,2021-10-06,6900584050
1880,2021-09-28,9123925628
1882,2021-09-28,8459990738
1883,2021-09-28,8870770740
1884,2021-09-27,7978357683
1885,2021-09-28,7568525619
1888,2021-09-28,6379296910
1890,2021-09-28,9179317908
1891,2021-09-28,7074543121
1892,2021-09-28,8170987706
1893,2021-09-28,7057311322
1894,2021-09-28,9884501005
1895,2021-09-28,9585224233
1896,2021-09-28,8871812885
1897,2021-09-28,9934931003
1898,2021-09-28,9156288910
1900,2021-09-28,7416050371
1902,2021-09-28,8208985198
1904,2021-09-28,9629440499
1905,2021-09-28,8989891060
1906,2021-09-28,6359549331
1907,2021-09-28,9738746304
1908,2021-09-28,9886301231
1909,2021-09-28,8692930224
1912,2021-10-17,9338403733
1913,2021-09-28,7697235125
1914,2021-09-28,9007397431
1915,2021-09-29,9965465809
1916,2021-09-29,9313536865
1917,2021-09-29,8928665862
1918,2021-09-29,7204330484
1919,2021-09-29,7013494327
1921,2021-09-29,9617296385
1923,2021-09-29,9583109331
1924,2021-09-29,9182643969
1925,2021-09-29,9605393434
1926,2021-09-29,9910229847
1927,2021-09-29,9008570925
1928,2021-09-29,7888353710
1929,2021-10-02,9783144850
1930,2021-10-02,7975087625
1931,2021-10-02,9052077833
1932,2021-10-02,8871192660
1934,2021-10-02,7275632733
1935,2021-10-02,9304728711
1936,2021-10-02,7353858921
1939,2021-10-02,9038244134
1942,2021-10-03,8984420430
1943,2021-10-03,7401285328
1944,2021-10-03,7990962969
1946,2021-09-28,8945976320
1947,2021-09-29,7043281423
1949,2021-09-29,8898522254
1951,2021-09-29,8089100564
1952,2021-09-29,7670823254
1953,2021-09-29,9373131155
1954,2021-09-29,9668742506
1955,2021-09-29,9008055717
1956,2021-09-29,9178856393
1958,2021-10-02,8758613922
1960,2021-10-02,9870034413
1962,2021-10-02,7666721038
1963,2021-10-02,7265087931
1964,2021-10-02,7096046282
1965,2021-10-02,9174451353
1966,2021-10-02,9701446902
1967,2021-10-02,7000488421
1968,2021-10-02,8686446840
1970,2021-10-02,9034955153
1971,2021-10-02,9732686935
1972,2021-10-02,9343418710
1975,2021-10-02,7762924917
1976,2021-10-02,7428073329
1978,2021-10-17,9934055611
1979,2021-09-28,6291953858
1980,2021-09-29,8830151079
1981,2021-09-29,8249146228
1982,2021-09-29,7060011500
1983,2021-09-29,9535978173
1984,2021-09-29,6386179998
1985,2021-09-29,9620048860
1986,2021-09-29,9964472584
1987,2021-09-29,9994829182
1988,2021-10-02,7559047288
1989,2021-10-02,8340905428
1990,2021-10-02,6350637985
1991,2021-10-02,8870059612
1994,2021-10-03,9582795880
1995,2021-10-03,9595113097
1996,2021-10-03,8450902161
1997,2021-10-03,9665917670
1998,2021-10-03,7008549612
1999,2021-10-03,9372088888
2000,2021-10-03,8897777200
2001,2021-10-03,9584743738
2002,2021-10-03,9177087299
2004,2021-10-03,8303870767
2006,2021-10-04,9301691242
2007,2021-10-04,7501540453
2008,2021-10-04,8940437585
2009,2021-10-04,7846862933
2010,2021-10-04,8073999321
2011,2021-10-17,9630584132
2012,2021-09-28,9939650082
2014,2021-09-29,7687874200
2017,2021-09-29,9847847358
2018,2021-09-29,6204834483
2019,2021-09-29,6300034864
2020,2021-09-29,8446074269
2021,2021-09-29,7000470558
2022,2021-09-29,6371381834
2023,2021-09-29,9989777747
2024,2021-09-29,9574573043
2025,2021-09-29,6388593651
2026,2021-09-29,8104494787
2027,2021-09-29,6360696554
2028,2021-09-29,9907125886
2029,2021-09-29,9069230622
2030,2021-09-29,9925890727
2031,2021-09-29,9600738944
2032,2021-09-24,9346340929
2033,2021-09-29,9071029027
2034,2021-09-29,9289035008
2035,2021-09-29,8735882190
2036,2021-09-29,9748945284
2037,2021-09-29,8050502548
2038,2021-09-29,9559465823
2039,2021-09-29,9500937353
2042,2021-10-02,7977437676
2043,2021-10-02,6391223784
2044,2021-10-04,9471021802
2046,2021-09-30,8747097410
2047,2021-09-30,7827462487
2048,2021-09-30,8341210195
2049,2021-09-30,6360256776
2050,2021-09-30,8552850386
2051,2021-09-30,8088485600
2052,2021-09-30,8431445026
2053,2021-09-30,8217766734
2054,2021-09-30,9987164777
2055,2021-09-30,9588337894
2056,2021-09-30,6380879169
2057,2021-09-30,9466962021
2058,2021-09-30,9064601107
2059,2021-09-30,9310210209
2063,2021-09-30,9823246213
2064,2021-10-01,8228895488
2065,2021-10-02,9966789431
2068,2021-10-02,6305094953
2069,2021-10-02,7676046315
2071,2021-10-02,8770747953
2072,2021-10-02,9616182221
2074,2021-10-03,9755887276
2076,2021-10-03,7095890924
2077,2021-10-17,7021107511
2078,2021-09-30,8686990869
2079,2021-09-30,9104699005
2083,2021-09-30,7503002676
2084,2021-09-30,9309582409
2085,2021-09-30,8697402153
2086,2021-09-30,9776339559
2089,2021-10-02,9170267516
2091,2021-10-02,7798732707
2092,2021-10-02,9100832849
2093,2021-10-03,8777425134
2094,2021-10-03,9765912539
2096,2021-10-03,8269460908
2097,2021-10-03,7897750245
2098,2021-10-03,9505084580
2100,2021-10-03,7432861849
2101,2021-10-03,9766568716
2102,2021-10-04,9064588323
2103,2021-10-04,7776957404
2104,2021-10-04,7870114670
2105,2021-10-04,9000064121
2106,2021-10-04,9092733530
2107,2021-10-04,7043315080
2108,2021-10-04,9158435749
2109,2021-10-04,8766302150
2110,2021-10-04,8918618024
2111,2021-09-30,7008210897
2112,2021-09-30,8610938109
2113,2021-10-03,9689251983
2114,2021-10-03,7509517546
2117,2021-10-03,7020701177
2118,2021-10-04,6388277518
2119,2021-10-04,9981622990
2120,2021-10-04,8758372685
2121,2021-10-04,8601481009
2123,2021-10-04,9791246484
2124,2021-10-04,9974349165
2125,2021-10-04,8106586966
2126,2021-10-04,8805137675
2127,2021-10-05,9492301055
2128,2021-10-05,9149896989
2130,2021-10-05,8468876199
2131,2021-10-06,7799400274
2132,2021-10-06,9237801171
2133,2021-10-06,9311519608
2134,2021-10-06,7557252122
2136,2021-10-06,8709685980
2137,2021-10-06,7893932592
2138,2021-10-06,8617668335
2139,2021-10-06,7908825272
2140,2021-10-06,9553040501
2141,2021-10-06,9128325400
2142,2021-10-06,9011756282
2143,2021-10-17,8329293149
2144,2021-09-30,9121423389
2146,2021-09-30,9644633993
2147,2021-09-30,9385847322
2148,2021-09-30,7448141203
2149,2021-09-30,6361665261
2150,2021-09-30,7317291199
2151,2021-09-30,9344800692
2152,2021-09-30,8081883820
2153,2021-09-30,7677899596
2154,2021-09-30,9040151473
2155,2021-09-30,7209118579
2156,2021-10-01,9673764871
2157,2021-10-01,7306261010
2158,2021-10-01,8369171432
2159,2021-10-01,7427077969
2160,2021-10-01,9544631377
2161,2021-10-01,9665898888
2165,2021-10-01,7717735756
2166,2021-10-01,8806105260
2167,2021-10-01,9892593483
2168,2021-10-01,8085811899
2169,2021-10-01,6300474541
2170,2021-10-01,9561474697
2171,2021-10-01,7878195577
2172,2021-10-01,8788372998
2176,2021-10-17,7906039320
2177,2021-10-01,9540752749
2178,2021-10-01,8720826417
2179,2021-10-01,9790898564
2180,2021-10-01,9038220622
2181,2021-10-01,9207070372
2184,2021-10-01,9164646136
2185,2021-10-01,7355396412
2186,2021-10-01,7094030103
2187,2021-10-01,9366238418
2188,2021-10-01,9691802506
2190,2021-10-01,9709608598
2191,2021-10-01,7093645403
2192,2021-10-01,6263201636
2193,2021-10-01,9773769702
2195,2021-10-01,6383528839
2196,2021-10-01,9895792462
2197,2021-10-03,9535495528
2198,2021-10-03,7010183223
2199,2021-10-04,7411483814
2200,2021-10-04,7987414759
2201,2021-10-04,9777079277
2202,2021-10-04,9846264656
2204,2021-10-04,9886088909
2205,2021-10-04,9051579588
2207,2021-10-04,7012475781
2208,2021-10-04,8239888298
2209,2021-10-17,9981408027
2210,2021-10-01,7780545513
2211,2021-10-01,9818469762
2212,2021-10-01,9045144228
2213,2021-10-01,7013484001
2214,2021-10-01,9901111475
2215,2021-10-01,9727472472
2217,2021-10-01,9082489412
2218,2021-10-01,9152728083
2219,2021-10-01,9591116896
2220,2021-10-01,9990884595
2221,2021-10-01,9668623623
2223,2021-10-01,9871928300
2226,2021-10-01,8390909411
2227,2021-10-01,8730860017
2228,2021-10-01,9154114984
2229,2021-10-03,9972081995
2230,2021-10-03,7530013127
2231,2021-10-03,9242991324
2232,2021-10-03,8001138318
2233,2021-10-03,7718000786
2234,2021-10-03,9861858843
2235,2021-10-03,9970412477
2236,2021-10-03,7879151800
2237,2021-10-03,8506807866
2238,2021-10-03,7492031225
2239,2021-10-03,9933342267
2240,2021-10-03,9619388193
2241,2021-10-03,9870119520
2242,2021-10-17,9921999516
2245,2021-10-01,8115935971
2246,2021-10-01,9749543426
2248,2021-10-01,7980070720
2249,2021-10-01,9940243171
2250,2021-10-01,9666622532
2252,2021-10-01,8766842649
2253,2021-10-01,7796103710
2255,2021-10-01,9523693866
2257,2021-10-01,9035579501
2258,2021-10-01,9108362899
2259,2021-10-01,7525990598
2260,2021-10-01,7376154994
2261,2021-10-01,9542146471
2263,2021-10-01,9716962564
2264,2021-10-01,8840666135
2265,2021-10-01,8095341709
2266,2021-10-02,9687557975
2267,2021-10-02,8903713346
2268,2021-10-02,9945446859
2269,2021-10-02,9825825819
2270,2021-10-02,8477888968
2271,2021-10-02,6362451108
2272,2021-10-02,8630561384
2273,2021-10-02,7032174053
2274,2021-10-11,8875258425
2276,2021-10-02,9354515578
2277,2021-10-02,7338313133
2278,2021-10-02,8125327290
2279,2021-10-02,7987734524
2281,2021-10-02,9597589833
2282,2021-10-02,9627950907
2283,2021-10-02,8468845855
2284,2021-10-02,8861938633
2285,2021-10-02,9809888774
2286,2021-10-02,7358032393
2287,2021-10-03,7000108152
2288,2021-10-03,7503625460
2289,2021-10-03,9853670043
2290,2021-10-03,6290053839
2291,2021-10-03,9758083528
2292,2021-10-03,7503076566
2293,2021-10-03,9160207355
2295,2021-10-03,8733008136
2297,2021-10-03,9593482146
2298,2021-10-04,9078391905
2299,2021-10-04,9853121345
2301,2021-10-04,7205273566
2303,2021-10-04,9010364165
2304,2021-10-04,7785958622
2305,2021-10-04,9000364477
2306,2021-10-04,8838467426
2307,2021-10-04,9619054584
2308,2021-10-17,9354001997
2309,2021-10-02,7439110418
2310,2021-10-02,8168230571
2311,2021-10-02,9705797013
2314,2021-10-02,9182031771
2316,2021-10-02,9839859736
2319,2021-10-03,8686978742
2321,2021-10-03,7744822741
2323,2021-10-03,9852327948
2324,2021-10-03,9030360529
2326,2021-10-03,9096111452
2328,2021-10-03,9542498544
2330,2021-10-03,7890673358
2331,2021-10-03,9937544033
2332,2021-10-03,8963005531
2333,2021-10-03,6238426618
2334,2021-10-03,9742800100
2335,2021-10-03,8446385488
2336,2021-10-03,8859736640
2337,2021-10-03,9019890864
2339,2021-10-03,8744921162
2340,2021-10-03,9886561516
2341,2021-10-17,9177431278
2342,2021-10-02,6303668528
2344,2021-10-02,6300889958
2346,2021-10-02,8013469725
2347,2021-10-02,9532684993
2348,2021-10-02,8668377361
2351,2021-10-02,8762682003
2353,2021-10-03,7842552345
2354,2021-10-03,9958750321
2355,2021-10-03,9844884348
2356,2021-10-03,8460453233
2357,2021-10-03,6362602075
2358,2021-10-03,7729915522
2359,2021-10-03,9959970606
2360,2021-10-03,9064887984
2361,2021-10-03,6005738539
2362,2021-10-03,8282912466
2363,2021-10-03,8448593837
2364,2021-10-03,9642058893
2365,2021-10-03,9100476910
2366,2021-10-03,7738045769
2367,2021-10-04,9990822200
2368,2021-10-04,8291502282
2369,2021-10-04,8884562391
2370,2021-10-04,7338537207
2371,2021-10-04,8789194011
2372,2021-10-04,9700945056
2373,2021-10-17,8686600099
2374,2021-10-02,9116007954
2375,2021-10-02,7569088156
2376,2021-10-02,7002593450
2377,2021-10-02,7871883009
2378,2021-10-02,7081845852
2379,2021-10-02,9347006067
2380,2021-10-02,8961249721
2381,2021-10-02,8458801077
2382,2021-10-02,7415422038
2383,2021-10-02,9601411136
2385,2021-10-02,7567782460
2386,2021-10-03,7065869147
2387,2021-10-03,8000047470
2388,2021-10-03,9998966090
2389,2021-10-03,7992308613
2390,2021-10-03,8369256941
2391,2021-10-03,7016050466
2392,2021-10-03,9393493933
2393,2021-10-03,9320058870
2394,2021-10-03,9058883038
2395,2021-10-03,9742087014
2396,2021-10-03,9833941176
2397,2021-10-03,8328267523
2398,2021-10-03,9987000017
2400,2021-10-03,6371232592
2401,2021-10-03,8945988262
2403,2021-10-04,9512369797
2404,2021-10-04,9999887622
2405,2021-10-03,9779554501
2406,2021-10-18,7981168929
2408,2021-10-06,7004278323
2409,2021-10-06,9884950376
2410,2021-10-06,9714224000
2411,2021-10-06,9035961395
2412,2021-10-07,9089741742
2413,2021-10-08,9653130635
2414,2021-10-09,7982784419
2415,2021-10-17,9220564645
2416,2021-10-17,9335844599
2417,2021-10-17,9741605897
2418,2021-10-18,9065309731
2419,2021-10-06,9502249714
2420,2021-10-06,7620200354
2421,2021-10-06,9886760972
2422,2021-10-06,7016547075
2423,2021-10-06,9372766594
2424,2021-10-06,7602185081
2425,2021-10-06,9870945936
2426,2021-10-07,9004451555
2427,2021-10-07,8551058895
2428,2021-10-08,8303414379
2429,2021-10-08,9386139191
2430,2021-10-08,9676154941
2431,2021-10-08,9628938687
2432,2021-10-09,9680453598
2433,2021-10-09,9870583902
2434,2021-10-09,8217518389
2435,2021-10-10,8010470226
2436,2021-10-17,9708337025
2437,2021-10-18,7970601777
2438,2021-10-18,9699330238
2439,2021-10-06,9951420411
2440,2021-10-06,9813017705
2441,2021-10-06,9927804198
2442,2021-10-06,7981684704
2443,2021-10-07,7845435301
2444,2021-10-07,8660901244
2445,2021-10-07,8858244976
2446,2021-10-07,8670899738
2447,2021-10-07,8815878543
2448,2021-10-07,9928502384
2449,2021-10-07,8143708903
2450,2021-10-08,8858116122
2452,2021-10-09,9337494996
2453,2021-10-09,7228914723
2454,2021-10-10,9996829047
2455,2021-10-17,8090530398
2456,2021-10-18,9878907810
2457,2021-10-18,9172244281
2458,2021-10-18,8347919653
2459,2021-10-18,9033245097
2460,2021-10-19,8318653418
2461,2021-10-19,9891102629
2462,2021-10-19,9930139144
2463,2021-10-19,8102222976
2464,2021-10-06,8756157661
2465,2021-10-07,7871306011
2467,2021-10-07,9345475842
2468,2021-10-07,7077033524
2469,2021-10-07,9618272384
2470,2021-10-07,9587226056
2471,2021-10-07,6201437223
2472,2021-10-07,9822338099
2473,2021-10-07,8883775666
2474,2021-10-08,9591116345
2475,2021-10-08,8928252556
2476,2021-10-08,9069902113
2477,2021-10-08,9326236441
2478,2021-10-08,9535860786
2479,2021-10-08,8801988029
2480,2021-10-08,8285082402
2482,2021-10-08,8347910096
2483,2021-10-08,7082710184
2484,2021-10-08,7983789096
2485,2021-10-08,8447932324
2486,2021-10-08,9390082544
2488,2021-10-08,9629034337
2489,2021-10-08,9131739824
2490,2021-10-08,8974446816
2491,2021-10-08,8889548921
2492,2021-10-08,7075300631
2493,2021-10-09,9570210181
2494,2021-10-09,8956548927
2495,2021-10-09,9110917348
2497,2021-10-09,9753581925
2498,2021-10-09,8019062015
2499,2021-10-17,8329863625
2500,2021-10-17,8777761660
2501,2021-10-18,9911223237
2502,2021-10-18,9504237298
2503,2021-10-18,7899451820
2504,2021-10-09,8555023042
2505,2021-10-09,7093286101
2506,2021-10-10,9108272061
2507,2021-10-10,8871035126
2508,2021-10-17,9826733191
2509,2021-10-18,9985103857
2511,2021-10-18,9766178065
2512,2021-10-18,9932686464
2513,2021-10-10,9870562533
2514,2021-10-10,8287599835
2515,2021-10-17,9072367655
2516,2021-10-10,9051656713
2517,2021-10-10,7006468618
2518,2021-10-10,6297341215
2519,2021-10-10,9964488794
2520,2021-10-10,7019009344
2521,2021-10-10,9732379091
2522,2021-10-10,7779992462
2523,2021-10-10,9999143275
2524,2021-10-10,8107814245
2525,2021-10-10,7773857368
2526,2021-10-10,7620217493
2527,2021-10-10,7404528563
2528,2021-10-10,8467880976
2529,2021-10-10,9056304234
2530,2021-10-10,8083115076
2531,2021-10-10,6204688154
2532,2021-10-10,9952435070
2533,2021-10-10,9049269706
2534,2021-10-10,7377775456
2535,2021-10-11,9353939102
2536,2021-10-11,9533939040
2537,2021-10-11,9885486162
2538,2021-10-11,7027175011
2539,2021-10-11,8509434046
2541,2021-10-11,9777117894
2542,2021-10-11,9672475710
2543,2021-10-11,7497042141
2544,2021-10-11,8198809164
2546,2021-10-11,9887492666
2547,2021-10-12,7789844096
2548,2021-10-13,9001740695
2549,2021-10-13,9974409861
2550,2021-10-17,9967722115
2551,2021-10-18,9161172968
2552,2021-10-18,8675142495
2553,2021-10-11,8460082839
2554,2021-10-11,9381056048
2555,2021-10-11,9052903790
2556,2021-10-11,7292849608
2557,2021-10-12,9657826802
2558,2021-10-12,7378401242
2559,2021-10-13,9591074019
2560,2021-10-17,7208847958
2561,2021-10-18,9721501371
2562,2021-10-18,9611531610
2563,2021-10-18,6302859956
2564,2021-10-18,6203411488
2565,2021-10-18,8770278752
2566,2021-10-11,6202633343
2567,2021-10-11,9265828881
2568,2021-10-12,8770415389
2569,2021-10-12,9583256391
2570,2021-10-12,8431452795
2571,2021-10-13,9945610054
2573,2021-10-17,9121408575
2574,2021-10-18,7980952535
2575,2021-10-18,9899790740
2577,2021-10-18,9990557192
2578,2021-10-18,9820761727
2579,2021-10-18,7503410351
2581,2021-10-11,8019882527
2582,2021-10-11,8541834546
2583,2021-10-12,9908700127
2584,2021-10-17,8594036862
2585,2021-10-18,7033386408
2587,2021-10-11,7808187407
2588,2021-10-12,7405102932
2589,2021-10-12,9561226759
2590,2021-10-12,7718092262
2591,2021-10-12,9919364550
2592,2021-10-12,8568850034
2593,2021-10-12,7787067129
2594,2021-10-12,7602380830
2595,2021-10-12,8144170192
2596,2021-10-12,7237846361
2597,2021-10-17,9609114452
2598,2021-10-18,9074002626
2599,2021-10-18,9813090386
2600,2021-10-18,8059686769
2601,2021-10-18,9455768117
2602,2021-10-19,7798817357
2603,2021-10-19,6361143572
2604,2021-10-11,9783954955
2605,2021-10-11,8449152073
2606,2021-10-12,9644911689
2607,2021-10-12,6382159236
2608,2021-10-17,7059192936
2609,2021-10-17,8509631805
2610,2021-10-18,8766259067
2611,2021-10-18,7009883372
2612,2021-10-18,9913536354
2615,2021-10-18,9676866741
2616,2021-10-18,7611019103
2617,2021-10-18,9028805251
2618,2021-10-18,8249944073
2619,2021-10-18,9958233513
2620,2021-10-18,7676759219
2621,2021-10-11,8517846403
2622,2021-10-11,9812950646
2623,2021-10-11,9964194006
2624,2021-10-12,8171507370
2625,2021-10-12,8160292365
2626,2021-10-17,7007458143
2627,2021-10-17,7546004301
2628,2021-10-18,8072472152
2630,2021-10-18,9164240076
2631,2021-10-18,8553804601
2632,2021-10-18,9944092008
2633,2021-10-18,7887907777
2634,2021-10-18,8722858555
2636,2021-10-18,8169262413
2637,2021-10-18,8851545224
2638,2021-10-19,9136208547
2639,2021-10-19,9992668872
2640,2021-10-11,8296368428
2641,2021-10-11,7871684204
2642,2021-10-12,7974985442
2643,2021-10-12,6002340354
2644,2021-10-12,9265700708
2645,2021-10-12,9080453922
2646,2021-10-12,9968628072
2647,2021-10-12,7977522784
2648,2021-09-01,8608094304
2650,2021-10-17,9591743987
2651,2021-10-17,9953700086
2652,2021-10-18,9304655061
2654,2021-10-18,9137020033
2655,2021-10-18,9687456430
2656,2021-10-18,9537312276
2657,2021-10-18,8977855914
2659,2021-10-18,7010923321
2660,2021-10-19,7358068395
2661,2021-10-19,8218458652
2662,2021-10-19,9895459196
2663,2021-10-11,8447380242
2664,2021-10-12,9998688375
2665,2021-10-12,8072437354
2666,2021-10-13,7986592018
2667,2021-10-17,9165845269
2669,2021-10-18,9309728875
2670,2021-10-18,9082331036
2672,2021-10-18,9632742321
2673,2021-10-19,7776091291
2674,2021-10-12,9315350565
2675,2021-10-12,9593449740
2676,2021-10-13,7017724383
2678,2021-10-13,9875225900
2680,2021-10-13,9086770721
2682,2021-10-13,9966213770
2685,2021-10-13,9823005870
2687,2021-10-13,9528572735
2690,2021-10-13,9889250570
2691,2021-10-13,9510044486
2693,2021-10-13,9729100060
2694,2021-10-13,9872772865
2695,2021-10-13,7895824569
2699,2021-10-13,8286491210
2707,2021-10-14,8329652424
2708,2021-10-14,9751147899
2709,2021-10-14,9016889242
2711,2021-10-17,9711269929
2712,2021-10-18,8309517146
2713,2021-10-18,9896644844
2714,2021-10-14,9518551842
2715,2021-10-14,7908460213
2716,2021-10-14,9953956109
2717,2021-10-14,9340787655
2718,2021-10-14,9008096154
2719,2021-10-14,9011392530
2720,2021-10-14,9718999020
2721,2021-10-14,9515977068
2723,2021-10-14,9918104277
2724,2021-10-14,8880103925
2726,2021-10-14,7993461629
2728,2021-10-14,9609705400
2729,2021-10-17,7741956626
2730,2021-10-17,9019889166
2731,2021-10-18,6355715417
2733,2021-10-14,9594604647
2734,2021-10-14,9606627655
2735,2021-10-17,7888834998
2736,2021-10-18,8124556386
2737,2021-10-18,9535304507
2738,2021-10-18,8319351413
2739,2021-10-18,7534942565
2740,2021-10-18,8999366609
2741,2021-10-14,8826404984
2745,2021-10-14,7271887432
2746,2021-10-14,7020172759
2747,2021-10-14,9486772535
2748,2021-10-14,7541004151
2751,2021-10-17,8791193737
2752,2021-10-18,9884209590
2753,2021-10-18,9123356326
2754,2021-10-18,8877333318
2755,2021-10-18,9620803171
2756,2021-10-14,9515080098
2757,2021-10-14,7985623864
2758,2021-10-14,7349029785
2759,2021-10-17,8299652195
2761,2021-10-18,9589077625
2762,2021-10-18,7982649597
2763,2021-10-18,9740306962
2764,2021-10-18,7007428073
2765,2021-10-18,9911633318
2766,2021-10-14,9779490070
2767,2021-10-14,8319816962
2768,2021-10-14,9665736159
2769,2021-10-14,8807682988
2770,2021-10-14,9005932670
2771,2021-10-14,9155523688
2772,2021-10-17,9727212169
2773,2021-10-18,8750944688
2774,2021-10-18,8123293663
2775,2021-10-18,7075661108
2776,2021-10-18,6265492153
2777,2021-10-18,9942224660
2778,2021-10-18,9073142848
2779,2021-10-18,8486212332
2780,2021-10-18,8850452707
2782,2021-10-14,8250483960
2783,2021-10-14,9755353964
2784,2021-10-14,9583850305
2785,2021-10-14,8500430170
2786,2021-10-14,7411001717
2787,2021-10-14,7984546805
2788,2021-10-17,9623959885
2789,2021-10-18,7385057853
2790,2021-10-18,7090485526
2791,2021-10-14,8249161517
2792,2021-10-14,9705661803
2793,2021-10-14,7906721223
2796,2021-10-14,8485981738
2797,2021-10-18,7836989261
2798,2021-10-18,8686490660
2799,2021-10-18,7750918131
2800,2021-10-18,9047373263
2801,2021-10-18,9510636376
2802,2021-10-14,9438317180
2803,2021-10-14,7876733033
2804,2021-10-14,9029048628
2806,2021-10-14,8731958082
2807,2021-10-18,9538230145
2808,2021-10-18,9575663003
2809,2021-10-18,9953982918
2810,2021-10-18,7407302574
2811,2021-10-18,6238572322
2812,2021-10-18,9608435780
2813,2021-10-14,6360648542
2814,2021-10-14,9769179191
2818,2021-10-14,7900023982
2820,2021-10-14,7990749692
2822,2021-10-14,9910863878
2823,2021-10-14,7661869666
2828,2021-10-14,7088136367
2830,2021-10-14,8601770170
2831,2021-10-14,7738484950
2832,2021-10-14,7044075994
2833,2021-10-14,9600591011
2836,2021-10-14,9646938442
2837,2021-10-14,9909616699
2839,2021-10-14,7248596446
2840,2021-10-14,9829013867
2842,2021-10-15,9087763540
2844,2021-10-14,7022262282
2846,2021-10-15,8200081405
2847,2021-10-15,7539953337
2848,2021-10-15,7405803465
2849,2021-10-15,9032852938
2851,2021-10-16,9931755854
2852,2021-10-16,7470473771
2853,2021-10-18,9644620691
2854,2021-10-18,9702333321
2855,2021-10-18,8390206390
2856,2021-10-18,8861558326
2857,2021-10-18,7024023015
2858,2021-10-15,8927700133
2859,2021-10-15,9101400070
2860,2021-10-15,8487087660
2861,2021-10-15,8910685756
2862,2021-10-15,9713605068
2864,2021-10-18,9574709660
2866,2021-10-15,8425881376
2868,2021-10-15,9791736561
2869,2021-10-15,7383556443
2870,2021-10-15,9704729471
2871,2021-10-15,9700765240
2873,2021-10-15,9719445073
2874,2021-10-15,9861487341
2875,2021-10-18,7405481093
2876,2021-10-18,8939276275
2877,2021-10-18,9811898200
2878,2021-10-18,6360556967
2881,2021-10-15,9957538367
2883,2021-10-15,9092565267
2884,2021-10-15,7656827804
2885,2021-10-10,9871013565
2886,2021-10-18,7088212991
2887,2021-10-18,7057741441
2888,2021-10-18,8882274200
2889,2021-10-18,8142513148
2891,2021-10-15,9503446617
2892,2021-10-15,9398073376
2894,2021-10-15,8374222879
2895,2021-10-15,7978784026
2896,2021-10-15,7977145881
2898,2021-10-18,9953748568
2899,2021-10-18,7906359557
2900,2021-10-18,9137789348
2901,2021-10-18,9645952058
2903,2021-10-15,7982792481
2904,2021-10-15,7993842952
2905,2021-10-15,9845624942
2906,2021-10-15,9265066009
2907,2021-10-16,9964368339
2908,2021-10-16,8177863434
2909,2021-10-18,7040008000
2910,2021-10-18,8531941120
2911,2021-10-18,9354491337
2912,2021-10-18,9971708011
2913,2021-10-18,9709290808
2914,2021-10-18,9036215725
2916,2021-10-15,6383055756
2917,2021-10-15,8094047664
2919,2021-10-18,8073406194
2920,2021-10-18,7409835039
2921,2021-10-18,8197238081
2922,2021-10-18,9618206547
2923,2021-10-18,8329692827
2924,2021-09-26,7702755065
2925,2021-10-15,9814305405
2927,2021-10-15,9333204774
2928,2021-10-15,7013915116
2929,2021-10-15,8555051800
2930,2021-10-15,9407016651
2931,2021-10-15,7787818351
2932,2021-10-15,7377918990
2933,2021-10-15,9724285115
2935,2021-10-18,9987316851
2936,2021-10-18,9524652084
2937,2021-10-18,7007889729
2938,2021-10-18,9879907077
2939,2021-10-18,9815727196
2942,2021-10-15,8766829221
2943,2021-10-15,7020432487
2944,2021-10-16,9182408244
2945,2021-10-16,9980227228
2946,2021-10-18,6003127172
2947,2021-10-18,9875527720
2949,2021-10-18,9090901017
2950,2021-10-18,6002195795
2951,2021-10-15,7488268562
2952,2021-10-15,9308843395
2954,2021-10-16,8928298476
2955,2021-10-16,8054222211
2956,2021-10-16,7908312405
2957,2021-10-16,8369015624
2958,2021-10-16,9540154290
2959,2021-10-16,9867046104
2960,2021-10-16,8013997775
2961,2021-10-16,7829215999
2962,2021-10-16,9634413150
2964,2021-10-16,8073477875
2965,2021-10-16,8309632852
2966,2021-10-16,9582161125
2968,2021-10-16,9899436601
2969,2021-10-16,7013106942
2971,2021-10-16,8777475032
2972,2021-10-16,8697777977
2973,2021-10-16,8007587674
2974,2021-10-16,9811666857
2975,2021-10-16,8017555554
2976,2021-10-16,8510081645
2977,2021-10-16,8617502664
2978,2021-10-16,9088554409
2979,2021-10-16,9061271603
2980,2021-10-16,9556268574
2981,2021-10-16,9676161673
2982,2021-10-16,7304107376
2983,2021-10-16,8790626818
2984,2021-10-16,9657432054
2985,2021-10-17,9035997447
2986,2021-10-17,7022911831
2987,2021-10-16,9538244483
2988,2021-10-17,8886408325
2989,2021-10-17,9892512615
2990,2021-10-17,9618180556
2991,2021-10-17,8818080889
2992,2021-10-17,7802059797
2993,2021-10-17,8484944338
2994,2021-10-17,9818444880
2995,2021-10-17,9897514518
2996,2021-10-17,9911012334
2997,2021-10-17,9370258001
2998,2021-10-17,9564026466
2999,2021-10-17,9864422673
3000,2021-10-17,6359124362
3001,2021-10-18,8428329652
3002,2021-10-18,7002746100
3003,2021-10-18,9527513090
3004,2021-10-18,7021309064
3005,2021-10-17,9994894450
3006,2021-10-17,7020227494
3007,2021-10-17,9663235356
3008,2021-10-17,9725901582
3009,2021-10-17,7095014143
3010,2021-10-18,9145253301
3011,2021-10-18,7081797000
3012,2021-10-18,9040033792
3013,2021-10-18,8237799982
3014,2021-10-18,8978006322
3015,2021-10-17,9311431436
3016,2021-10-17,7887311402
3017,2021-10-17,9148683196
3018,2021-10-17,8668873382
3019,2021-10-17,9776030850
3021,2021-10-17,9136627666
3022,2021-10-17,7386730883
3023,2021-10-17,7543085768
3024,2021-10-17,9717255872
3025,2021-10-17,7065212971
3028,2021-10-17,7903276443
3029,2021-10-17,7221900063
3030,2021-10-18,8190818819
3031,2021-10-18,9300910094
3032,2021-10-18,9054086025
3033,2021-10-18,7303356088
3035,2021-10-17,8668364955
3038,2021-10-17,7014228470
3039,2021-10-17,8600133007
3040,2021-10-18,9877298949
3041,2021-10-18,8296581415
3042,2021-10-18,9582962557
3043,2021-10-18,9405779674
3044,2021-10-18,9380107110
3045,2021-10-18,9166819968
3046,2021-10-18,9845393501
3047,2021-10-18,8007440404
3048,2021-10-18,8872841023
3049,2021-10-17,9599519695
3050,2021-10-17,9633160659
3051,2021-10-17,7222916680
3052,2021-10-17,7799058729
3053,2021-10-17,9011133045
3054,2021-10-17,8191840321
3057,2021-10-17,7083406050
3058,2021-10-17,9092860722
3059,2021-10-17,7227913764
3060,2021-10-17,9867598946
3061,2021-10-18,9602409625
3062,2021-10-18,9172708514
3063,2021-10-18,8369427055
3064,2021-10-18,8383087289
3065,2021-10-18,9724225386
3066,2021-10-17,9870183174
3067,2021-10-17,8050731006
3068,2021-10-17,8128044243
3069,2021-10-17,9940339934
3070,2021-10-17,9136284616
3071,2021-10-17,8817781581
3072,2021-10-18,8309699393
3073,2021-10-18,9769812708
3074,2021-10-18,8939642040
3075,2021-10-18,9730492446
3076,2021-10-18,8368983744
3077,2021-10-18,9926467546
3078,2021-10-17,7095388794
3079,2021-10-17,8888680269
3080,2021-10-17,9606130225
3081,2021-10-18,9860555534
3082,2021-10-18,9160616166
3083,2021-10-18,8377990727
3084,2021-10-18,8637250520
3085,2021-10-18,7359075123
3086,2021-10-18,8319740234
3087,2021-10-18,9074432330
3088,2021-10-17,9344769040
3089,2021-10-17,9205831145
3090,2021-10-17,9899250996
3091,2021-10-17,8080902559
3092,2021-10-18,7068137242
3093,2021-10-18,9529649215
3094,2021-10-18,9431470412
3095,2021-10-18,9560531739
3096,2021-10-18,9845524478
3097,2021-10-18,9333277004
3098,2021-10-18,9555202816
3099,2021-10-18,8951296122
3100,2021-10-18,9207786787
3101,2021-10-18,8929635062
3102,2021-10-17,9004295753
3103,2021-10-17,8651294359
3104,2021-10-17,7557014480
3106,2021-10-17,9035255205
3107,2021-10-17,6361843051
3108,2021-10-17,9835820331
3109,2021-10-17,7995912450
3110,2021-10-17,8919932856
3111,2021-10-17,9810543321
3112,2021-10-17,8511544193
3113,2021-10-17,8637576491
3115,2021-10-17,7999799117
3116,2021-10-17,9482227581
3117,2021-10-17,7709257743
3118,2021-10-17,9899391818
3119,2021-10-17,8709025603
3120,2021-10-17,7204649088
3122,2021-10-17,9340009009
3123,2021-10-17,8506847499
3124,2021-10-17,7549260001
3125,2021-10-17,9719309614
3126,2021-10-17,7426834575
3127,2021-10-17,7483819724
3128,2021-10-17,7301985857
3129,2021-10-17,8787644064
3130,2021-10-17,7501712032
3131,2021-10-17,7359101469
3132,2021-10-17,7276918777
3133,2021-10-18,7020995089
3134,2021-10-17,7872661513
3135,2021-10-17,9700673593
3136,2021-10-17,7675877927
3137,2021-10-17,6385456867
3138,2021-10-17,8708878017
3139,2021-10-17,9646503211
3140,2021-10-17,8420786358
3141,2021-10-17,7018318051
3142,2021-10-17,9789848484
3143,2021-10-18,8763476435
3144,2021-10-18,9033016131
3145,2021-10-18,7039162597
3146,2021-10-18,9758319881
3147,2021-10-18,8409076553
3148,2021-10-17,9143842959
3149,2021-10-17,7697690820
3151,2021-10-17,9560399848
3152,2021-10-17,7208764603
3153,2021-10-17,9986833161
3154,2021-10-17,7600881325
3155,2021-10-17,9340808016
3156,2021-10-17,6381771001
3157,2021-10-18,9924336101
3158,2021-10-18,9669851694
3159,2021-10-18,9502531304
3160,2021-10-18,9702220978
3161,2021-10-18,7004847393
3162,2021-10-18,9910813571
3164,2021-10-17,9871591066
3165,2021-10-17,9739576507
3166,2021-10-17,8180033700
3167,2021-10-17,9624361200
3168,2021-10-17,9929285646
3169,2021-10-17,9604730835
3170,2021-10-17,8099593225
3171,2021-10-18,8073617112
3172,2021-10-18,9119207906
3173,2021-10-17,9007106641
3174,2021-10-17,9650626961
3175,2021-10-17,8929566980
3177,2021-10-17,7888856405
3178,2021-10-17,9819279074
3179,2021-10-17,6366329279
3181,2021-10-17,9718219636
3182,2021-10-18,7004069640
3183,2021-10-18,9991567801
3185,2021-10-17,9164684131
3186,2021-10-17,8618764358
3187,2021-10-17,9937283518
3188,2021-10-17,8750554724
3189,2021-10-17,9555788975
3190,2021-10-17,7059322640
3191,2021-10-18,8750892527
3192,2021-10-17,7982843438
3193,2021-10-17,7580865555
3194,2021-10-17,9141840176
3195,2021-10-18,7098382933
3196,2021-10-18,8668130165
3197,2021-10-18,8777294983
3198,2021-10-18,9540979968
3199,2021-10-19,7338912525
3200,2021-10-19,8830135967
3201,2021-10-17,9045329286
3202,2021-10-18,7995520099
3203,2021-10-18,9657716226
3204,2021-10-18,8950818900
