{"itemCount":11437,"md5Checksum":"cq/GNVcXD9nPRkumk4yjaA==","etag":"e454cfd7beefe15e66365544052fe073-1","dataFileS3Key":"AWSDynamoDB/01647340454652-a6e8113d/data/oig7vcqf6m22vitr6mafqo3kma.json.gz"}
{"itemCount":11684,"md5Checksum":"aQwzDQcsejZnSyFp21qYrg==","etag":"ac7edb86c0339c45df0316c02e84899e-1","dataFileS3Key":"AWSDynamoDB/01647340454652-a6e8113d/data/xwi7nfdtbe4mtkbx73se76nreu.json.gz"}
{"itemCount":11699,"md5Checksum":"3ofKIVQWWB1gfyjDIEpjFg==","etag":"9fad98089aa1faaae54ac966fcff3f0c-1","dataFileS3Key":"AWSDynamoDB/01647340454652-a6e8113d/data/kd6ihzg26m65plqjipehekotay.json.gz"}
{"itemCount":11607,"md5Checksum":"qov0OTiyqWX3uhPregatJw==","etag":"281cfbeb2a1b513eb4a457aca54db885-1","dataFileS3Key":"AWSDynamoDB/01647340454652-a6e8113d/data/khbrg5pbpe4nzewphlo4jdfpvm.json.gz"}
