,OMS ID,DOJ,PAN_Number,Mobile_Number,Company_Code,Company_Name,Employee_Code,Employee_Name,Salary_Status,Bank_Name,Account_No,IFSC_Code,Salary_Release_Date,2021-06-01 00:00:00,2021-07-01 00:00:00,2021-08-01 00:00:00
0,QS2283473,2021-08-26,CSIPB4364G,8793633123.0,PSL01570,JOHN DEERE INDIA PVT LTD,2001822001,SHWETA UDAY KARPE,RELEASED,HDFC BANK,:50100302021545,HDFC0000794,2021-09-07,,,5071.0
1,808270,2021-08-25,CDRPM9681D,9831035275.0,GTS00154,VMWARE SOFTWARE INDIA PRIVATE LIMITED,2001820273,BANHISHIKHA MITRA,RELEASED,ICICI BANK LIMITED,:695001501954,ICIC0006950,2021-09-07,,,19423.0
2,808153,2021-08-23,CRPPD2557K,9645686561.0,GTS00007,ACCENTURE SOLUTIONS PVT LTD,2001816164,JITHIN D,RELEASED,FEDERAL BANK,:99980110478075,FDRL0001407,2021-09-03,,,5037.0
3,QS2286582,2021-08-21,EFHPR1082H,8521312343.0,PSL00417,BEHARIJI MILLS PVT LTD,2001816497,ABHIMNYOU KUMAR RAM,RELEASED,SIWAN CENTRAL CO OPERATIVE BANK,:001134021100206,IBKL01076SB,2021-08-31,,,806.0
4,QS2273436,2021-08-19,CAPPM6979R,7207880087.0,PSL00123,RELIANCE PROJECTS AND PROPERTY MANAGEMENT SERVICES LIMITED,2001815178,MOHAMMAD AMEER PASHA,RELEASED,STATE BANK OF INDIA,:62297077541,SBIN0021165,2021-09-03,,,0.0
5,IFMGAUG2021_001751,2021-08-18,COCPS6428A,9082195461.0,FMS00005,AVON FACILITY MANAGEMENT SERVICES,2001829745,AKHILESH RAVINDRAPRATAP SINGH,RELEASED,STATE BANK OF INDIA,:20490409218,SBIN0000567,2021-09-09,,,18692.0
6,QS2281099,2021-08-17,AKQPI6140M,7483479571.0,PSL00123,RELIANCE PROJECTS AND PROPERTY MANAGEMENT SERVICES LIMITED,2001815083,MOHAMMED IMRAN,RELEASED,DEVELOPMENT BANK OF SINGAPORE,:881033003917,DBSS0IN0811,2021-09-03,,,5742.0
7,QS2281806,2021-08-17,BNUPA1588F,8957871612.0,PSL01726,BAJAJ FINANCE LIMITED,2001817379,NAVED AHMAD,RELEASED,IDFC FIRST BANK LIMITED,:10058215450,IDFB0021252,2021-09-07,,,4676.0
8,807952,2021-08-16,FMDPM4180F,7387063033.0,GTS00063,HEWLETT PACKARD ENTERPRISE INDIA PVT LTD,2001801670,MHASKE VAIBHAV TUKARAM,RELEASED,BANK OF INDIA,:050810110013974,BKID0000508,2021-09-01,,,9291.0
9,QS2279970,2021-08-16,CHSPS7719F,8090339066.0,TSD00003,VEDANTA FOUNDATION,2001810848,VINEET SINGH,RELEASED,HDFC BANK,:50100280347479,HDFC0000078,2021-09-01,,,4173.0
10,QS2280105,2021-08-16,EYVPK9934C,9910791626.0,PSL01928,INSTAKART SERVICES PRIVATE LIMITED,2001822680,SONU KUMAR,RELEASED,CANARA BANK,:5081101001957,CNRB0005081,2021-09-07,,,6421.0
11,808229,2021-08-13,ADNPZ2721M,6369001904.0,GTS00035,IBM INDIA PRIVATE LIMITED,2001819728,KUMAR R,RELEASED,INDIAN OVERSEAS BANK,:130701000041510,IOBA0001307,2021-09-09,,,8050.0
12,808269,2021-08-12,ANWPC6385R,9701185955.0,GTS00035,IBM INDIA PRIVATE LIMITED,2001820272,CHEEDELLA KIRAN KUMAR,RELEASED,STATE BANK OF INDIA,:20169620058,SBIN0012919,2021-09-08,,,24262.0
13,QS2273034,2021-08-12,EGWPS0785J,8870188970.0,PSL00963,BAJAJ FINANCE LIMITED,2001802187,RAJKRISHNAN,RELEASED,INDUSIND BANK,:100055563427,INDB0000339,2021-08-31,,,6639.0
14,QS2276804,2021-08-12,NOT_AVAILABLE,9649407284.0,PSL01954,INSTAKART SERVICES PRIVATE LIMITED,2001826302,SUMAN SINGH JATAV,RELEASED,STATE BANK OF INDIA,:61347690165,SBIN0031771,2021-09-08,,,6626.0
15,QS2278610,2021-08-12,BYPPT9083G,7011880900.0,PSL00413,BALAJI CELLPHONE PVT LTD,2001815374,SUMT KUMAR THAKUR,RELEASED,CANARA BANK,:4324101000665,CNRB0004324,2021-09-03,,,2258.0
16,QS2275268,2021-08-11,BFNPC8680R,7278463447.0,PSL01946,INSTAKART SERVICES PRIVATE LIMITED,2001824701,MEGHASREE CHAKRABORTY,RELEASED,BANK OF BARODA,:43118100002587,BARB0KANCHR,2021-09-07,,,7090.0
17,QS2278982,2021-08-11,BIFPR3336G,6388110758.0,PSL00057,BRITANNIA INDUSTRIES LTD,2001816307,RAVI RANJAN,RELEASED,STATE BANK OF INDIA,:30679795626,SBIN0000010,2021-09-02,,,3929.0
18,QS2276418,2021-08-10,BGIPK5889E,8169002349.0,PSL01550,ADITYA BIRLA FASHION AND RETAIL LIMITED,2001811878,SHOUKAT ILYAS KHAN,RELEASED,KOTAK MAHINDRA BANK LIMITED,:1312564655,KKBK0001382,2021-09-01,,,1645.0
19,QS2277676,2021-08-10,CRFPS4924R,9821756487.0,PSL00002,SAMSUNG INDIA ELECTRONICS PRIVATE LIMITED,2001815928,MOHD NADEEM SHAIKH,RELEASED,BHARAT CO OPERATIVE BANK,:008610100010296,BCBM0000087,2021-09-01,,,8203.0
20,QS2268243,2021-08-09,DJDPR2679H,9100253098.0,PSL01958,ANI TECHNOLOGIES PVT  LTD,2001812127,MACHARLA RAHUL,RELEASED,KOTAK MAHINDRA BANK LIMITED,:1111878939,KKBK0000958,2021-09-06,,,22093.0
21,QS2270392,2021-08-09,GUYPM2895D,9398160782.0,PSL00123,RELIANCE PROJECTS AND PROPERTY MANAGEMENT SERVICES LIMITED,2001814278,ELKATURTHI MOJESH,RELEASED,STATE BANK OF INDIA,:62449749265,SBIN0020569,2021-09-03,,,6773.0
22,QS2271957,2021-08-09,DIRPM8775E,7498428467.0,PSL00123,RELIANCE PROJECTS AND PROPERTY MANAGEMENT SERVICES LIMITED,2001814186,MOHAN SURYAKANT MANDODE,RELEASED,IDFC FIRST BANK LIMITED,:10049181598,IDFB0041358,2021-09-03,,,18429.0
23,QS2272889,2021-08-09,BLPPP9777A,9892239585.0,PSL00406,SHAREKHAN LIMITED,2001810380,NITIN MOHAN PADAYA,RELEASED,FEDERAL BANK,:99980106794766,FDRL0001099,2021-08-30,,,10275.0
24,QS2273512,2021-08-09,DBQPM3673F,8967454855.0,PSL01946,INSTAKART SERVICES PRIVATE LIMITED,2001824919,TANMAY MANDAL,RELEASED,STATE BANK OF INDIA,:34530143421,SBIN0012370,2021-09-07,,,6397.0
25,QS2275162,2021-08-09,BZZPT9639R,9342854314.0,PSL00255,VODAFONE IDEA LIMITED,2001802281,S THULASI PRABHA,RELEASED,KOTAK MAHINDRA BANK LIMITED,:0745351160,KKBK0000463,2021-08-31,,,10193.0
26,QS2267517,2021-08-07,HRLPK3310Q,9521238208.0,PSL01954,INSTAKART SERVICES PRIVATE LIMITED,2001826037,AJAY KUMAR JANGIR,RELEASED,STATE BANK OF INDIA,:38489505174,SBIN0031292,2021-09-08,,,8283.0
27,QS2270430,2021-08-07,DAJPK1550B,9179498379.0,PSL01905,IDBI BANK LIMITED,2001801369,SHAFEEQ KHAN,RELEASED,HDFC BANK,:50100316478484,HDFC0004665,2021-09-04,,,13754.0
28,QS2269940,2021-08-06,HKGPK8037N,8006864178.0,PSL01954,INSTAKART SERVICES PRIVATE LIMITED,2001826216,PRAVIN KUMAR,RELEASED,STATE BANK OF INDIA,:36019088912,SBIN0001073,2021-09-08,,,9006.0
29,QS2270961,2021-08-06,IKTPK5458R,6350256236.0,PSL00963,BAJAJ FINANCE LIMITED,2001800920,VIKAS KUMAR KANKAR,RELEASED,PUNJAB NATIONAL BANK,:02622011006178,PUNB0117510,2021-08-31,,,6789.0
30,QS2263746,2021-08-05,ARNPN6184G,9652055648.0,PSL00451,SBI CARDS AND PAYMENT SERVICES LIMITED,2001822896,B NARSIMULU,RELEASED,ICICI BANK LIMITED,:004801641044,ICIC0000048,2021-09-04,,,8308.0
31,QS2271003,2021-08-05,CVXPM9431P,7989096362.0,PSL00931,SAMSUNG INDIA ELECTRONICS PRIVATE LIMITED,2001812449,MUJAWAR GOUSE SAMDANI,RELEASED,BANK OF INDIA,:567810110005512,BKID0005678,2021-09-01,,,17937.0
32,QS2271988,2021-08-05,AXEPN9031D,9951248786.0,PSL00931,SAMSUNG INDIA ELECTRONICS PRIVATE LIMITED,2001812453,NALLA RAVI,RELEASED,KOTAK MAHINDRA BANK LIMITED,:7111951542,KKBK0000958,2021-09-01,,,16638.0
33,QS2273912,2021-08-04,GOMPS3991N,8750602782.0,PSL00125,LG ELECTRONICS INDIA PRIVATE LTD,2001809932,UDIT SINGH,RELEASED,STATE BANK OF INDIA,:33989331943,SBIN0001679,2021-08-31,,,17763.0
34,QS2262864,2021-08-03,DXGPR0389B,7893504076.0,PSL00963,BAJAJ FINANCE LIMITED,2001801108,MEKA RAVIKUMAR,RELEASED,KARUR VYSYA BANK,:1467155000077791,KVBL0001467,2021-08-31,,,10864.0
35,QS2266142,2021-08-03,EYKPK8084G,8099355599.0,PSL00963,BAJAJ FINANCE LIMITED,2001802663,KOLAKALURI PAVAN KUMAR,RELEASED,CENTRAL BANK OF INDIA,:4031599586,CBIN0280837,2021-08-31,,,10610.0
36,QS2267368,2021-08-03,DWDPA6214C,7483333733.0,PSL01958,ANI TECHNOLOGIES PVT  LTD,2001813100,MAHESHAGOUDA BHIMANGOUDA AVANNAVAR,RELEASED,KARNATAKA VIKAS GRAMEENA BANK,:89043399988,KVGB0006011,2021-09-06,,,11893.0
37,QS2270651,2021-08-03,NOT_AVAILABLE,7348813412.0,PSL01075,AVENUE SUPERMARTS LTD,2001815301,ARUN M,RELEASED,BANK OF BARODA,:89590100013134,BARB0VJHBRL,2021-08-30,,,5741.0
38,807708,2021-08-02,BTDPN9455R,7008830755.0,GTS00007,ACCENTURE SOLUTIONS PVT LTD,2001800187,SWARAJ NAYAK,RELEASED,PUNJAB NATIONAL BANK,:6769001500001313,PUNB0676900,2021-09-03,,,19259.0
39,QS2256254,2021-08-02,EBDPS2153E,9867922717.0,PSL01477,BHANIX FINANCE AND INVESTMENT LIMITED,2001811741,SAMEER SHABUDDIN SAYYED,RELEASED,STATE BANK OF INDIA,:20101301255,SBIN0016879,2021-09-01,,,23215.0
40,QS2262492,2021-08-02,CGMPD8963M,9848796183.0,PSL00451,SBI CARDS AND PAYMENT SERVICES LIMITED,2001822937,DHARAVATH SUNIL,RELEASED,STATE BANK OF INDIA,:38950039296,SBIN0021927,2021-09-04,,,11469.0
41,QS2265395,2021-08-02,ECNPD2746F,9206929200.0,PSL00123,RELIANCE PROJECTS AND PROPERTY MANAGEMENT SERVICES LIMITED,2001815055,VISHNU RAMRAO DAUD,RELEASED,BANK OF BARODA,:66810100035539,BARB0VJJALN,2021-09-03,,,10934.0
42,QS2252421,2021-08-01,ECAPK3627M,9467060921.0,PSL01726,BAJAJ FINANCE LIMITED,2001818293,PRADEEP KUMAR,RELEASED,CORPORATION BANK,:520101069275129,CORP0001804,2021-09-07,,,24410.0
43,QS2252923,2021-08-01,BDKPB5150L,9769686634.0,PSL01726,BAJAJ FINANCE LIMITED,2001816853,JIVAN BHAGWAT BHISE,RELEASED,DOMBIVLI NAGARI SAHAKARI BANK LIMITED,:008010101428235,DNSB0000008,2021-09-07,,,35726.0
44,QS2253005,2021-08-01,ABOPE6792J,9656425122.0,PSL01726,BAJAJ FINANCE LIMITED,2001817462,SAMJITH E K,RELEASED,STATE BANK OF INDIA,:31720718217,SBIN0007941,2021-09-07,,,29661.0
45,QS2253043,2021-08-01,GWQPK7607P,7255903226.0,PSL01726,BAJAJ FINANCE LIMITED,2001817175,VIKRANT KUMAR,RELEASED,BANDHAN BANK LIMITED,:50190014724149,BDBL0001114,2021-09-07,,,21293.0
46,QS2253145,2021-08-01,DVNPD5879K,8299258287.0,PSL01726,BAJAJ FINANCE LIMITED,2001817920,AJAY DUBEY,RELEASED,KOTAK MAHINDRA BANK LIMITED,:5412133186,KKBK0000958,2021-09-07,,,15623.0
47,QS2253589,2021-08-01,FSJPS2144M,8960932325.0,PSL01726,BAJAJ FINANCE LIMITED,2001817554,RITURAJ SINGH,RELEASED,STATE BANK OF INDIA,:37476241929,SBIN0010887,2021-09-07,,,27920.0
48,QS2279010,2021-08-01,EGYPD8677L,9508544804.0,PSL00187,VIP INDUSTRIES LIMITED,2001812207,BISWAJIT DEKA,RELEASED,UNION BANK OF INDIA,:551802120000709,UBIN0555185,2021-08-31,,,4344.0
49,QS2295674,2021-08-01,KENPS4251G,6291168890.0,PSL01408,RELIANCE SMSL LIMITED,2001821185,RAHUL SAHA,RELEASED,UJJIVAN SMALL FINANCE BANK,:3307110010050320,UJVN0003307,2021-09-07,,,12235.0
50,QS2295676,2021-08-01,DLPPS6437E,7980109964.0,PSL01408,RELIANCE SMSL LIMITED,2001820891,RAJESH SINGH,RELEASED,KOTAK MAHINDRA BANK LIMITED,:5812391315,KKBK0006566,2021-09-07,,,12980.0
51,QS2295909,2021-08-01,OCPPS2275Q,6291600861.0,PSL01408,RELIANCE SMSL LIMITED,2001820807,SUJAN SUTRADHAR,RELEASED,STATE BANK OF INDIA,:35082783133,SBIN0006809,2021-09-07,,,12987.0
52,QS2265572,2021-07-31,AKOPC6510D,7295901639.0,PSL01954,INSTAKART SERVICES PRIVATE LIMITED,2001827869,ARUNKUMAR CHAUDHARI,RELEASED,KOTAK MAHINDRA BANK LIMITED,:0845239412,KKBK0000958,2021-09-08,,,11611.0
53,QS2267340,2021-07-31,FFPPS5175R,9455333244.0,PSL00372,PERFETTI VAN MELLE INDIA PRIVATE LIMITED,2001812175,ABHISHEK SINGH,RELEASED,UNION BANK OF INDIA,:392702010329092,UBIN0545643,2021-08-31,,,12387.0
54,QS2259224,2021-07-30,BSYPS8015A,9883509224.0,PSL00191,QWIK SUPPLY CHAIN PRIVATE LIMITED,2001811344,AJOY SEN,RELEASED,STATE BANK OF INDIA,:20106273447,SBIN0006809,2021-09-07,,,19013.0
55,QS2264738,2021-07-30,NOT_AVAILABLE,8741027525.0,PSL01954,INSTAKART SERVICES PRIVATE LIMITED,2001827919,HEMANT SAINI,RELEASED,STATE BANK OF INDIA,:61329265008,SBIN0031774,2021-09-08,,,10011.0
56,QS2262429,2021-07-29,EIOPM6107A,9001875672.0,PSL00963,BAJAJ FINANCE LIMITED,2001801088,KULDEEP MEGHWAL,RELEASED,BANK OF INDIA,:666810110001543,BKID0006668,2021-08-31,,,8878.0
57,QS2263555,2021-07-29,AGGPM7594M,9901169957.0,PSL00123,RELIANCE PROJECTS AND PROPERTY MANAGEMENT SERVICES LIMITED,2001814639,MOHAN MARIYAPPA,RELEASED,KOTAK MAHINDRA BANK LIMITED,:3613115215,KKBK0008072,2021-09-03,,,16557.0
58,QS2255198,2021-07-28,CRTPG4563J,8127210396.0,PSL00963,BAJAJ FINANCE LIMITED,2001802207,TUSHAR GULATI,RELEASED,UNION BANK OF INDIA,:215610100043154,UBIN0821560,2021-08-31,,,12067.0
59,QS2259914,2021-07-28,CDPPB7776J,8638226158.0,PSL00375,AMAZON TRANSPORTATION SERVICES PRIVATE LIMITED,2001811472,MANOJ BORO,RELEASED,STATE BANK OF INDIA,:20367338771,SBIN0002093,2021-08-31,,,13834.0
60,QS2261384,2021-07-28,JYEPS8108E,8919968400.0,PSL00083,BSH HOUSEHOLD APPLIANCES MANUFACTURING PVT LTD,2001802757,S R SURESH,RELEASED,CANARA BANK,:1821101110909,CNRB0001921,2021-09-02,,,12020.0
61,QS2261387,2021-07-28,ATPPV6550J,8939967507.0,PSL00083,BSH HOUSEHOLD APPLIANCES MANUFACTURING PVT LTD,2001802786,VENKATESH M,RELEASED,CANARA BANK,:0976131000897,CNRB0000976,2021-08-31,,,10375.0
62,QS2261253,2021-07-27,BFTPT1691B,7411311052.0,PSL00002,SAMSUNG INDIA ELECTRONICS PRIVATE LIMITED,2001816096,TANVEER KHAN,RELEASED,HDFC BANK,:50100442735482,HDFC0001747,2021-09-01,,,17425.0
63,QS2253992,2021-07-26,BEQPN8210N,9885938216.0,PSL00123,RELIANCE PROJECTS AND PROPERTY MANAGEMENT SERVICES LIMITED,2001814662,N NARESH REDDY,RELEASED,STATE BANK OF INDIA,:62477614745,SBIN0020086,2021-09-03,,,11807.0
64,QS2254758,2021-07-26,ELYPR1555Q,8367311906.0,PSL00123,RELIANCE PROJECTS AND PROPERTY MANAGEMENT SERVICES LIMITED,2001814250,RATHOD MANOJ,RELEASED,HDFC BANK,:50100408952174,HDFC0001621,2021-09-03,,,12025.0
65,QS2257795,2021-07-26,DUBPK0056A,9123384143.0,PSL01322,ADANI WILMAR LIMITED,2001811577,GOLAM JAKIRUDDIN KHAN,RELEASED,STATE BANK OF INDIA,:38235475148,SBIN0017991,2021-08-31,,,30675.0
66,QS2259885,2021-07-26,HCVPS6001P,9623831427.0,PSL01147,APPL INDUSTRIES LIMITED,2001793808,SANTOSH BHAGCHAND SHINDE,RELEASED,STATE BANK OF INDIA,:62498767366,SBIN0021739,2021-08-11,,3023.0,
68,QS2248339,2021-07-24,BZWPG5164M,9311859299.0,PSL00963,BAJAJ FINANCE LIMITED,2001802184,RAHUL GUPTA,RELEASED,BANK OF INDIA,:601610110007049,BKID0006016,2021-08-31,,,23659.0
69,QS2250845,2021-07-24,LUDPS5594P,8839977123.0,PSL00123,RELIANCE PROJECTS AND PROPERTY MANAGEMENT SERVICES LIMITED,2001815064,VRUSHABH UDAY SURE,RELEASED,CORPORATION BANK,:520291022222575,CORP0002913,2021-09-03,,,7075.0
70,QS2257382,2021-07-24,NOT_AVAILABLE,,PSL00375,AMAZON TRANSPORTATION SERVICES PRIVATE LIMITED,2001785626,RAJU SHARMA,RELEASED,STATE BANK OF INDIA,:39786914580,SBIN0011642,2021-09-06,,,2.0
72,QS2258909,2021-07-24,AHEPN6702F,9378076366.0,PSL00191,QWIK SUPPLY CHAIN PRIVATE LIMITED,2001811354,BAPI NAYAK,RELEASED,CANARA BANK,:0190108018107,CNRB0000190,2021-09-07,,,21912.0
73,QS2251715,2021-07-23,DSAPM3264H,8147474741.0,PSL00963,BAJAJ FINANCE LIMITED,2001801102,MARUTHI E,RELEASED,CITY UNION BANK,:168001000839830,CIUB0000168,2021-08-31,,,17883.0
74,QS2254932,2021-07-23,BLVPR9766F,9940434147.0,PSL00963,BAJAJ FINANCE LIMITED,2001800968,AMARNATH R,RELEASED,INDIAN BANK,:6188648421,IDIB000V001,2021-08-31,,,13142.0
75,QS2256926,2021-07-23,MMJPS1675Q,7471142190.0,PSL00123,RELIANCE PROJECTS AND PROPERTY MANAGEMENT SERVICES LIMITED,2001814882,SHUBHAM SHAHIR,RELEASED,KOTAK MAHINDRA BANK LIMITED,:8213265599,KKBK0005886,2021-09-03,,,13140.0
76,QS2266280,2021-07-23,AHSPH5329N,9985956480.0,PSL00434,UPL LIMITED,2001821870,HANUMANNA GARI NAGARAJU,RELEASED,STATE BANK OF INDIA,:32375062644,SBIN0012737,2021-09-07,,,0.0
78,QS2256244,2021-07-22,GNJPM0635K,9351513751.0,PSL01954,INSTAKART SERVICES PRIVATE LIMITED,2001827865,ARIF MOHAMMAD,RELEASED,STATE BANK OF INDIA,:38983065059,SBIN0031125,2021-09-08,,,12390.0
79,QS2247194,2021-07-20,DYUPP1584D,9900994468.0,PSL00963,BAJAJ FINANCE LIMITED,2001801972,PAVAN KUMAR J K,RELEASED,HDFC BANK,:50100370402202,HDFC0004876,2021-08-31,,,21546.0
80,QS2256183,2021-07-20,AZJPT1123B,8209443406.0,PSL01704,UJJIVAN SMALL FINANCE BANK LIMITED,2001812775,ALPESH TAILOR,RELEASED,STATE BANK OF INDIA,:34101874199,SBIN0006851,2021-08-31,,,10565.0
81,QS2234998,2021-07-19,AOQPL5680P,9410994577.0,PSL00375,AMAZON TRANSPORTATION SERVICES PRIVATE LIMITED,2001784306,BEERU LAL,RELEASED,PUNJAB NATIONAL BANK,:1462001500001947,PUNB0146200,2021-07-31,,4788.0,
83,QS2246791,2021-07-19,BUBPJ3065L,7356853158.0,PSL01944,BHARTI AIRTEL SERVICES LIMITED,2001801743,JINU B S,RELEASED,STATE BANK OF INDIA,:33223331344,SBIN0010595,2021-09-01,,,15490.0
84,QS2249766,2021-07-18,JVPPS8265G,9579796590.0,PSL00963,BAJAJ FINANCE LIMITED,2001801189,RIYAZAHAMAD,RELEASED,HDFC BANK,:50100303087640,HDFC0002819,2021-08-31,,,19484.0
85,QS2246994,2021-07-17,BYYPK9413J,8141104144.0,PSL00963,BAJAJ FINANCE LIMITED,2001800923,VIKRAM KUMAR,RELEASED,AXIS BANK,:916010029336536,UTIB0000003,2021-08-31,,,13828.0
86,QS2248028,2021-07-16,AHWPY9118Q,9792000293.0,PSL00258,VODAFONE IDEA LIMITED,2001811584,SHAILESH KUMAR,RELEASED,AXIS BANK,:912010026762253,UTIB0001261,2021-09-02,,,28400.0
87,QS2240098,2021-07-08,BPPPB2255H,9920222095.0,PSL01905,IDBI BANK LIMITED,2001783704,KALPESH SHANKAR BHOIR,RELEASED,AXIS BANK,:919010092523416,UTIB0000036,2021-08-05,,15087.0,
88,QS2248359,2021-07-07,AFLPU1645P,7972850798.0,PSL01910,VODAFONE IDEA LIMITED,2001775615,VISHAL JAYPRAKASH UPADHYAY,RELEASED,BANK OF BARODA,:07120100048145,BARB0DAHISA,2021-09-04,,,16317.0
90,QS2235007,2021-07-06,ABXPO8819M,8880039119.0,PSL01377,POLYCAB INDIA LIMITED,2001787351,OMKAR BIRADAR,RELEASED,CANARA BANK,:0448101062045,CNRB0000448,2021-08-02,,10101.0,
92,QS2235720,2021-07-05,NOT_AVAILABLE,7696214364.0,PSL01704,UJJIVAN SMALL FINANCE BANK LIMITED,2001786001,MANPREET SINGH,RELEASED,CENTRAL BANK OF INDIA,:3755367072,CBIN0281542,2021-08-10,,6257.0,
94,QS2226594,2021-06-29,FEKPP7793L,9727743004.0,PSL00963,BAJAJ FINANCE LIMITED,2001774607,PATHAN AAMIRKHAN AFZALKHAN,RELEASED,KOTAK MAHINDRA BANK LIMITED,:9914870938,KKBK0000958,2021-07-31,,9380.0,
96,QS2203219,2021-06-21,AQKPY0983E,9634388234.0,PSL01886,CHEMETALL INDIA PRIVATE LIMITED,2001783197,PURUSHOTTAM YADAV,RELEASED,PUNJAB NATIONAL BANK,:1836001509117044,PUNB0183600,2021-09-03,,,12695.0
98,QS2228930,2021-06-16,FRQPK1135J,7235882571.0,PSL00638,SARDAR MOTORS AUTOWHEEL PVT LTD,2001773274,ROHIT KUMAR,RELEASED,STATE BANK OF INDIA,:32557325632,SBIN0006049,2021-08-11,,5000.0,
101,QS1972215,2020-09-24,AUHPN1454C,7021328353.0,PSL00451,SBI CARDS AND PAYMENT SERVICES LIMITED,2001589424,DILIP NAYAK,RELEASED,AXIS BANK,:918010105892318,UTIB0000395,2021-09-04,,,22774.0
104,QS1558010,2019-04-16,NOT_AVAILABLE,,NEM00014,KEWAL KIRAN CLOTHING LIMITED,2001176954,RAJA KUMAR,Released,STATE BANK OF INDIA,:20314176742,SBIN0002991,2021-07-09,4979.0,,
