{"itemCount":8842,"md5Checksum":"fi1otala35yWaKoYXBBUEQ==","etag":"c44dddaad1ba8dad29b906a7906839e9-1","dataFileS3Key":"AWSDynamoDB/01642475500126-b28a77a2/data/3cvdj7zc6u5udpdflbmq3jjmhy.json.gz"}
{"itemCount":9045,"md5Checksum":"005GqdIKN0Nf7yQHO0PUkQ==","etag":"8bd1f9917654b010379e6599be7abe78-1","dataFileS3Key":"AWSDynamoDB/01642475500126-b28a77a2/data/ulffxi3zgq5lnerhevdevbwj3y.json.gz"}
{"itemCount":9145,"md5Checksum":"AHoPcJcKJUEuTkDFYhZpkA==","etag":"ebeba15389e221bbbdfd870ff859eb76-1","dataFileS3Key":"AWSDynamoDB/01642475500126-b28a77a2/data/ukuc2eoqi44h5f7wju2dyjh2bi.json.gz"}
{"itemCount":9043,"md5Checksum":"4VUTb9Cw54NyxG0UCxqKBg==","etag":"6dba838773969d63f48b3a3fcb5c1a36-1","dataFileS3Key":"AWSDynamoDB/01642475500126-b28a77a2/data/nae4xz7dtm25lddbkvaoyunjya.json.gz"}
