,userID,Date,Host,Service,Message
0,00550a37-9346-45a8-9a6f-16a6cab943f1,2022-01-06T08:28:56.054Z,i-0369b2e17c5932ada,kyc,http: no such file
1,0270bc8e-dc19-49c3-b9cc-bcd2b07de88a,2021-12-31T15:21:55.451Z,i-06bda28c2d22bebc8,kyc,http: no such file
2,0518f453-2763-4a1f-b18d-aaa6435dc0f9,2022-01-03T06:03:06.188Z,i-0369b2e17c5932ada,kyc,http: no such file
3,060bac15-76a4-488b-942d-de27f2679adc,2022-01-01T13:42:23.211Z,i-0369b2e17c5932ada,kyc,http: no such file
4,065cda70-a57e-4450-ad97-9cacc43d281c,2022-01-01T10:01:10.750Z,i-0369b2e17c5932ada,kyc,http: no such file
5,0ac2089d-725e-4e45-bbcc-979586bf0a3b,2022-01-04T11:24:47.087Z,i-06bda28c2d22bebc8,kyc,http: no such file
6,0adabc42-d1a9-4a85-a70b-3ceaa04392ba,2022-01-04T11:26:02.283Z,i-0369b2e17c5932ada,kyc,http: no such file
7,0c0eaeea-5d7e-49e8-ac07-5e488721b31a,2022-01-05T07:21:36.115Z,i-0369b2e17c5932ada,kyc,http: no such file
8,0e5930c8-7390-4e11-9b7f-8efb6675e1a2,2022-01-06T10:34:23.511Z,i-06bda28c2d22bebc8,kyc,http: no such file
9,12bcdaba-4523-4070-b3a9-f398034e5a7f,2022-01-06T07:56:35.834Z,i-0369b2e17c5932ada,kyc,http: no such file
10,138863c3-36d1-4367-b00c-f840b5732e0a,2022-01-06T12:53:28.335Z,i-06bda28c2d22bebc8,kyc,http: no such file
11,13f89418-88d8-4a48-9005-a96af80c9af7,2022-01-05T07:28:48.628Z,i-06bda28c2d22bebc8,kyc,http: no such file
12,1457d10e-fe37-42f0-aa80-ae722a1efa18,2022-01-01T05:25:25.840Z,i-06bda28c2d22bebc8,kyc,http: no such file
13,1570ae51-d5e3-4c77-91cf-72582fa6bd8b,2022-01-02T11:37:04.166Z,i-06bda28c2d22bebc8,kyc,http: no such file
14,15bcfbac-6616-43b0-9ce4-04a1af093096,2022-01-03T08:45:50.580Z,i-0369b2e17c5932ada,kyc,http: no such file
15,165dfd9e-9fde-447b-a420-6a956e2fde31,2022-01-04T15:31:41.359Z,i-06bda28c2d22bebc8,kyc,http: no such file
16,16bfa5fb-bdd7-4610-8878-b0d027c45edb,2022-01-03T05:50:38.115Z,i-06bda28c2d22bebc8,kyc,http: no such file
17,170f0a85-f381-4100-ab2a-23143cacf2df,2021-12-31T14:17:39.032Z,i-0369b2e17c5932ada,kyc,http: no such file
18,185d76c5-afcc-49ea-b7c3-64b5a1b1f835,2022-01-01T07:52:54.388Z,i-0369b2e17c5932ada,kyc,http: no such file
19,18909b3d-45b3-4c99-9cc0-4eb25f2322d7,2022-01-04T09:09:19.365Z,i-0369b2e17c5932ada,kyc,http: no such file
20,1c520f55-e3ec-4c91-8069-165ad083b7fa,2022-01-02T12:53:47.176Z,i-0369b2e17c5932ada,kyc,http: no such file
21,1cb6df96-b81c-4958-b05a-58ec7582378b,2022-01-03T13:13:39.823Z,i-0369b2e17c5932ada,kyc,http: no such file
22,1d5eff26-76c1-4e2f-ac35-bf039a628ce7,2022-01-06T12:56:40.569Z,i-0369b2e17c5932ada,kyc,http: no such file
23,1e348362-afc9-4d86-bd31-ca12105e43ee,2022-01-03T16:13:55.833Z,i-06bda28c2d22bebc8,kyc,http: no such file
24,1e9e8d04-83d2-4056-b1be-aafc81696004,2022-01-01T12:32:05.985Z,i-0369b2e17c5932ada,kyc,http: no such file
25,1ee9b1a0-9bcf-44a2-9335-057aa0b98bfb,2022-01-05T08:51:43.163Z,i-06bda28c2d22bebc8,kyc,http: no such file
26,20b4f88d-798c-4deb-bd5d-1838814ece69,2022-01-01T10:19:37.605Z,i-0369b2e17c5932ada,kyc,http: no such file
27,21852ae9-5214-49a7-a1b5-dc21d6d84d70,2022-01-03T10:32:30.304Z,i-0369b2e17c5932ada,kyc,http: no such file
28,23646604-f0d4-45f4-9580-bba09830885b,2022-01-06T16:20:29.283Z,i-06bda28c2d22bebc8,kyc,http: no such file
29,23e68da9-9e98-4f14-ae99-f084ddb72fa5,2022-01-03T08:11:21.752Z,i-06bda28c2d22bebc8,kyc,http: no such file
30,2407e326-a4cb-498e-8fb2-a14da7bd55d9,2022-01-04T10:36:54.318Z,i-0369b2e17c5932ada,kyc,http: no such file
31,245ebbba-e04d-487f-b763-0ad34bc46d12,2022-01-05T10:58:59.002Z,i-06bda28c2d22bebc8,kyc,http: no such file
32,2d8022d8-7754-4b7f-b978-88fca66a546b,2022-01-04T06:39:18.045Z,i-0369b2e17c5932ada,kyc,http: no such file
33,2dd3ed56-0f28-43b3-9fed-2bdcaffa88f4,2022-01-05T07:48:44.263Z,i-0369b2e17c5932ada,kyc,http: no such file
34,2e7c544c-602a-4859-bc2f-e69953b80e58,2022-01-05T05:54:30.248Z,i-06bda28c2d22bebc8,kyc,http: no such file
35,30789ba4-48d9-4869-a9d9-09c4adfab14a,2022-01-04T15:01:07.787Z,i-06bda28c2d22bebc8,kyc,http: no such file
36,34a4ba8d-e5b7-418f-ba32-5fe4ed77f9e6,2022-01-05T13:35:20.661Z,i-06bda28c2d22bebc8,kyc,http: no such file
37,356bc337-51e2-48be-9e96-7e9b60c5de00,2022-01-01T18:35:45.091Z,i-0369b2e17c5932ada,kyc,http: no such file
38,37051be0-68bb-4eb0-b80c-483d88c015fb,2022-01-05T14:30:45.766Z,i-06bda28c2d22bebc8,kyc,http: no such file
39,37ba3735-37cf-456e-bf86-04dd04fdbab9,2022-01-03T06:21:49.169Z,i-06bda28c2d22bebc8,kyc,http: no such file
40,39670bae-3953-4857-aa3e-db113688388b,2022-01-07T03:15:42.487Z,i-06bda28c2d22bebc8,kyc,http: no such file
41,3acfd7db-e8a5-48fe-bd9a-c47bc65c3f28,2022-01-02T13:57:50.095Z,i-06bda28c2d22bebc8,kyc,http: no such file
42,3d4d7a4c-edc6-4c02-be7e-17602ab1fe81,2022-01-03T22:32:14.382Z,i-06bda28c2d22bebc8,kyc,http: no such file
43,3d7153a4-1cc2-46be-88fd-174c48a55fec,2022-01-06T02:43:54.451Z,i-06bda28c2d22bebc8,kyc,http: no such file
44,3eb8983b-3d05-4884-b272-c6aec85dde5c,2022-01-01T10:17:25.139Z,i-0369b2e17c5932ada,kyc,http: no such file
45,3f2ddea2-676a-499c-9ed2-b1c8e4e964e8,2022-01-01T14:44:57.457Z,i-0369b2e17c5932ada,kyc,http: no such file
46,42f81941-0cce-41d7-9e6d-054bd2367fb4,2022-01-02T13:31:41.265Z,i-06bda28c2d22bebc8,kyc,http: no such file
47,44557355-af8a-4dd4-bcfb-a9ed67c99807,2021-12-31T16:36:51.869Z,i-06bda28c2d22bebc8,kyc,http: no such file
48,4486ecd4-6472-43d5-a9c1-829d3860da52,2022-01-06T05:25:15.228Z,i-06bda28c2d22bebc8,kyc,http: no such file
49,449388f3-afac-4545-994c-79b5ce7f34a0,2022-01-05T08:16:09.121Z,i-06bda28c2d22bebc8,kyc,http: no such file
50,481c6d0e-9353-4065-9f40-2ec694fe47ee,2022-01-05T14:17:57.783Z,i-06bda28c2d22bebc8,kyc,http: no such file
51,4b89dc0f-94e1-48c8-b613-7dec7832df30,2022-01-06T07:55:07.361Z,i-06bda28c2d22bebc8,kyc,http: no such file
52,4b9bbd8f-23e0-475c-94d2-21546ea7f11f,2022-01-05T16:01:55.478Z,i-06bda28c2d22bebc8,kyc,http: no such file
53,4d09b438-7e93-4eb5-832c-3ff5488bf536,2022-01-01T07:12:42.581Z,i-06bda28c2d22bebc8,kyc,http: no such file
54,4e31d917-90d5-4c61-ab55-aeb8bdb839d8,2022-01-06T03:57:53.559Z,i-0369b2e17c5932ada,kyc,http: no such file
55,4ed948c4-a7b5-47fa-b691-627184b6b3e9,2021-12-31T14:33:17.146Z,i-0369b2e17c5932ada,kyc,http: no such file
56,4efca9b9-38d0-460d-9461-0a2c601f344b,2022-01-03T07:55:24.253Z,i-06bda28c2d22bebc8,kyc,http: no such file
57,4f2522b8-fcc1-4658-8708-ef479088fa78,2022-01-01T16:31:52.653Z,i-0369b2e17c5932ada,kyc,http: no such file
58,4f618a47-57f0-413b-abb2-f0c902f05ff0,2022-01-01T08:30:11.670Z,i-0369b2e17c5932ada,kyc,http: no such file
59,4fa3b1f3-c77e-43a4-8d4b-c00eaebed45b,2022-01-01T15:03:03.014Z,i-0369b2e17c5932ada,kyc,http: no such file
60,50912351-cdf9-4f20-b9bb-53d3db4daa14,2021-12-31T13:55:28.168Z,i-06bda28c2d22bebc8,kyc,http: no such file
61,554fd606-b861-41b2-a9d2-3a6eab3d0ba4,2022-01-01T08:55:40.215Z,i-0369b2e17c5932ada,kyc,http: no such file
62,56d0866f-5eee-4f86-adb6-8da89afa8291,2022-01-02T07:19:51.998Z,i-0369b2e17c5932ada,kyc,http: no such file
63,57292c1f-98b0-4ea9-be27-ae2d8c817691,2022-01-01T13:03:00.905Z,i-0369b2e17c5932ada,kyc,http: no such file
64,58f93779-ddcc-4c8f-a521-14693ab75703,2021-12-31T14:07:48.448Z,i-06bda28c2d22bebc8,kyc,http: no such file
65,5a6c1afe-a9c9-4754-969e-af9c36ba45ec,2022-01-01T12:32:28.966Z,i-0369b2e17c5932ada,kyc,http: no such file
66,5c670f84-3814-4907-bcc9-c347ab38e7c8,2021-12-31T13:56:55.009Z,i-06bda28c2d22bebc8,kyc,http: no such file
67,5f7ca5d0-f362-481f-be32-7d1187eeed73,2022-01-06T01:55:04.133Z,i-0369b2e17c5932ada,kyc,http: no such file
68,64ecb7e3-dabf-4655-a40c-6afa00508000,2022-01-02T14:21:14.343Z,i-0369b2e17c5932ada,kyc,http: no such file
69,6baa5e07-8339-4598-920e-496a689fa38a,2022-01-04T15:27:59.842Z,i-0369b2e17c5932ada,kyc,http: no such file
70,6e9370cd-4bcb-4395-9adc-5742959bfff3,2022-01-06T14:53:38.488Z,i-06bda28c2d22bebc8,kyc,http: no such file
71,70fc8cb3-1ad3-47a0-a485-68957fb3ba50,2022-01-06T06:59:45.154Z,i-0369b2e17c5932ada,kyc,http: no such file
72,710ecfbb-da5f-4416-9fe1-c709c449e790,2022-01-05T16:50:04.654Z,i-06bda28c2d22bebc8,kyc,http: no such file
73,71839be9-fcf7-4c7b-a5ab-631ee32e8a6c,2022-01-01T04:44:51.511Z,i-06bda28c2d22bebc8,kyc,http: no such file
74,7a6e40e7-1947-474c-adcd-a7d488cf0eae,2022-01-04T13:18:29.698Z,i-0369b2e17c5932ada,kyc,http: no such file
75,7c9e2911-ecb4-41e0-8544-2aab5a81aad6,2022-01-01T07:46:34.881Z,i-0369b2e17c5932ada,kyc,http: no such file
76,7db057e5-5e9b-4816-a272-c07f39577e9d,2021-12-31T16:55:26.039Z,i-06bda28c2d22bebc8,kyc,http: no such file
77,80abf18c-cca6-41b1-a911-071fb46fb166,2022-01-01T02:38:16.910Z,i-06bda28c2d22bebc8,kyc,http: no such file
78,81e0ebbf-7b87-4b55-95ed-d4b5e44bf1ab,2022-01-05T17:37:36.226Z,i-0369b2e17c5932ada,kyc,http: no such file
79,8319fbf9-ca83-4ad0-9dd8-9b62c848a732,2022-01-03T06:26:45.482Z,i-0369b2e17c5932ada,kyc,http: no such file
80,8346e65b-cadf-4155-93da-b35c60c6b5d4,2022-01-02T13:31:33.221Z,i-06bda28c2d22bebc8,kyc,http: no such file
81,83a54a39-475a-4e94-9548-8b24057abf6b,2022-01-01T13:43:54.876Z,i-06bda28c2d22bebc8,kyc,http: no such file
82,84f9b795-01b7-499f-bb7c-794d604d2e26,2022-01-01T08:33:37.553Z,i-0369b2e17c5932ada,kyc,http: no such file
83,869f3c7c-ff72-4e3d-b992-2b741ef67fbe,2022-01-02T13:59:29.270Z,i-0369b2e17c5932ada,kyc,http: no such file
84,89327577-2ae1-4f92-a4f4-cfe21c7d0f05,2022-01-05T07:11:31.502Z,i-0369b2e17c5932ada,kyc,http: no such file
85,8a1e1d4d-13f0-4b2c-8e6b-5b8b429d2d56,2021-12-31T13:49:55.283Z,i-06bda28c2d22bebc8,kyc,http: no such file
86,8ac96094-7771-4749-a10a-bbe7f67444d3,2022-01-03T08:19:03.167Z,i-06bda28c2d22bebc8,kyc,http: no such file
87,8df43253-1046-411d-845d-477d38f3e644,2022-01-02T13:37:56.001Z,i-06bda28c2d22bebc8,kyc,http: no such file
88,91c3b11a-6965-4088-bcb0-a19676cc0f78,2022-01-05T13:08:49.091Z,i-06bda28c2d22bebc8,kyc,http: no such file
89,921cf80d-80bc-486c-bedf-38fbd1ba6775,2022-01-06T00:59:26.077Z,i-0369b2e17c5932ada,kyc,http: no such file
90,940e449e-9ef7-462f-a824-6fc92430ab09,2022-01-02T11:12:42.913Z,i-0369b2e17c5932ada,kyc,http: no such file
91,9ed3bebb-b698-42d3-8a24-d21151435203,2022-01-02T20:18:10.929Z,i-0369b2e17c5932ada,kyc,http: no such file
92,9f593492-f9ee-4c97-8586-c3b995ba9c15,2022-01-05T03:34:59.511Z,i-06bda28c2d22bebc8,kyc,http: no such file
93,a02e4eb8-725c-4399-a3ea-8867bb95235d,2022-01-06T02:33:44.163Z,i-06bda28c2d22bebc8,kyc,http: no such file
94,a1723768-058d-41c4-a349-dbd00499f781,2022-01-05T04:52:31.515Z,i-06bda28c2d22bebc8,kyc,http: no such file
95,a26c79d6-e5c1-4c7f-afd1-e7b907facfc5,2022-01-04T15:48:41.068Z,i-0369b2e17c5932ada,kyc,http: no such file
96,a2755341-5a4e-4435-a7d3-7f1a501be868,2022-01-04T06:17:16.605Z,i-06bda28c2d22bebc8,kyc,http: no such file
97,a6778333-cda4-4cf8-b472-017c2a69a913,2022-01-04T04:18:49.306Z,i-0369b2e17c5932ada,kyc,http: no such file
98,a6cff52d-4343-4455-8d6d-735eb61c665e,2022-01-01T07:08:53.151Z,i-06bda28c2d22bebc8,kyc,http: no such file
99,a8a55f14-af2a-4de4-a4d8-35b414d44759,2022-01-05T07:38:02.588Z,i-06bda28c2d22bebc8,kyc,http: no such file
100,a9699339-831a-42b7-985d-d448fbf6394c,2022-01-06T15:23:01.609Z,i-0369b2e17c5932ada,kyc,http: no such file
101,adfff73d-542f-45c6-a091-9771a4cf961e,2022-01-03T08:07:47.869Z,i-06bda28c2d22bebc8,kyc,http: no such file
102,b13875a5-9f8b-4d88-8a7d-b35340810b80,2022-01-01T05:43:24.574Z,i-06bda28c2d22bebc8,kyc,http: no such file
103,b1f88bd9-9f0f-4c81-8a1e-945ac2e36175,2022-01-03T01:57:08.991Z,i-0369b2e17c5932ada,kyc,http: no such file
104,b521d688-3ce4-4e47-b710-b0ade12b80f2,2022-01-05T14:27:08.035Z,i-0369b2e17c5932ada,kyc,http: no such file
105,b54d6a07-a68f-491d-8eb4-234d3e5b5135,2022-01-04T11:22:41.955Z,i-0369b2e17c5932ada,kyc,http: no such file
106,b85b52ba-6af5-42b1-99bb-cca1932f50bf,2022-01-05T08:18:54.015Z,i-06bda28c2d22bebc8,kyc,http: no such file
107,b9a88819-e4cd-4eb2-8d1a-e2d509fc8a82,2022-01-01T09:38:33.076Z,i-0369b2e17c5932ada,kyc,http: no such file
108,ba7da9b4-c2cf-415b-bd4e-89efd505585e,2022-01-04T12:39:44.995Z,i-06bda28c2d22bebc8,kyc,http: no such file
109,bb604501-9346-4ac3-9f23-377150f6753b,2022-01-04T11:22:10.814Z,i-0369b2e17c5932ada,kyc,http: no such file
110,c047dba3-8cf8-4e79-8e25-ab27666ba4dd,2022-01-04T10:03:00.826Z,i-0369b2e17c5932ada,kyc,http: no such file
111,c3925801-3ff8-454d-9c0c-c4af08984f4a,2022-01-04T11:46:51.100Z,i-0369b2e17c5932ada,kyc,http: no such file
112,c5516c8f-63d5-4fd5-a71f-e58a5e587cfc,2022-01-06T10:17:51.400Z,i-06bda28c2d22bebc8,kyc,http: no such file
113,ccbcea66-f5c0-4ccb-be3c-822269eac7bb,2022-01-02T05:56:08.238Z,i-06bda28c2d22bebc8,kyc,http: no such file
114,ce588367-acb7-4c55-aea7-2fc9c7bee259,2022-01-01T08:51:50.515Z,i-06bda28c2d22bebc8,kyc,http: no such file
115,d21ed3cc-1ef5-47d4-97ff-f5b24ececa36,2022-01-06T10:38:13.508Z,i-06bda28c2d22bebc8,kyc,http: no such file
116,d7497d27-8345-4cb0-b7b3-6762f20cf253,2022-01-04T11:15:00.491Z,i-06bda28c2d22bebc8,kyc,http: no such file
117,d7b25e9b-a043-4a99-abbe-5547f5d67c24,2021-12-31T15:41:47.067Z,i-06bda28c2d22bebc8,kyc,http: no such file
118,d8beb6e3-62a1-49ed-9138-e248cfe12660,2022-01-01T16:11:38.575Z,i-0369b2e17c5932ada,kyc,http: no such file
119,dcd19b61-419f-459f-903b-08406723cc2b,2021-12-31T16:53:03.731Z,i-0369b2e17c5932ada,kyc,http: no such file
120,dd342174-1000-4569-8b31-6685b588b548,2022-01-04T13:55:11.522Z,i-0369b2e17c5932ada,kyc,http: no such file
121,dd8fcef1-39d0-4cd9-824f-2a665e93df59,2022-01-03T14:09:36.300Z,i-06bda28c2d22bebc8,kyc,http: no such file
122,ddc3ca93-2c77-4ddb-b484-a164da8a6d1a,2021-12-31T14:53:18.213Z,i-06bda28c2d22bebc8,kyc,http: no such file
123,de25a488-b193-4c12-b0b4-3f591e94ad62,2022-01-02T08:53:41.845Z,i-06bda28c2d22bebc8,kyc,http: no such file
124,dfc7bc5d-361e-4a3b-8fea-6fba755acfd1,2022-01-03T13:46:08.238Z,i-06bda28c2d22bebc8,kyc,http: no such file
125,e0601cb5-9824-4166-ab39-54751ba97fa1,2022-01-02T12:12:25.604Z,i-0369b2e17c5932ada,kyc,http: no such file
126,e0df791f-1539-4338-bb87-1c327aeca996,2022-01-01T14:41:46.690Z,i-0369b2e17c5932ada,kyc,http: no such file
127,e18328b7-e0d2-4b5b-888f-12a054bffef0,2022-01-03T12:50:09.406Z,i-0369b2e17c5932ada,kyc,http: no such file
128,e1d7a8cd-35f2-4fed-bfff-4c30a5559624,2022-01-03T15:26:36.487Z,i-0369b2e17c5932ada,kyc,http: no such file
129,e2a90059-405f-44bf-85ae-ff648f1bc7cd,2022-01-04T14:13:03.374Z,i-0369b2e17c5932ada,kyc,http: no such file
130,e30a19fd-b738-4279-88fe-61e478358a01,2021-12-31T16:31:25.335Z,i-0369b2e17c5932ada,kyc,http: no such file
131,e96af068-5164-4b24-9cf3-4dc69600e3bf,2022-01-06T05:14:21.826Z,i-0369b2e17c5932ada,kyc,http: no such file
132,ef0b9ff2-6db1-41ff-9339-e0e2c91e86ae,2021-12-31T13:33:51.299Z,i-06bda28c2d22bebc8,kyc,http: no such file
133,ef6b9495-9cb4-49f5-9073-8bd52a161d8e,2022-01-04T12:15:17.178Z,i-06bda28c2d22bebc8,kyc,http: no such file
134,f0c90395-a883-4ea2-9aaa-036f59c9fb3d,2022-01-02T14:08:39.408Z,i-0369b2e17c5932ada,kyc,http: no such file
135,f1374ba6-16c8-42c2-bf5c-20f711205af4,2022-01-01T08:08:50.821Z,i-06bda28c2d22bebc8,kyc,http: no such file
136,f207b134-b174-4b63-895b-2e2b3107b687,2022-01-01T10:50:37.589Z,i-0369b2e17c5932ada,kyc,http: no such file
137,f393161d-d65b-4f07-8909-2b397814e14e,2022-01-02T06:27:45.306Z,i-06bda28c2d22bebc8,kyc,http: no such file
138,f7febc5a-9426-4466-8588-21752b0bcbf4,2022-01-05T13:58:33.257Z,i-06bda28c2d22bebc8,kyc,http: no such file
139,fa7720d0-750a-4ce8-8ada-f3406e8115e3,2022-01-01T14:33:22.764Z,i-06bda28c2d22bebc8,kyc,http: no such file
140,fae30da3-cf0f-4ea4-95a5-85a310a5d1ac,2022-01-03T07:36:41.047Z,i-06bda28c2d22bebc8,kyc,http: no such file
