{
  "type": "service_account",
  "project_id": "data-warehouse-india",
  "private_key_id": "fbd0a05be6cdc174ee1f00339a83e1ec9d4256e6",
  "private_key": "-----BEGIN PRIVATE KEY-----\nMIIEvQIBADANBgkqhkiG9w0BAQEFAASCBKcwggSjAgEAAoIBAQDcTrT3M8+K+zvz\njRTAEL4sZ5r8Fx3AuT7c8oEBQuNl8qurdixa5PbzDkvKs4vM6b4CxWCNOS4NhgnT\nqPnA6eAoa1l21MS8nsybrEf3ngO0EWVn3bfpqCMh0cUWyEdPvxj4CwGFdZA1jma1\nMq7ifLpTcH85a6AFkojhAk73zUb47VXtn0UTjBYS5JTgW0467avNltmDgLxCHFH/\nfDux+upntrzA43HJnF32r7VRdWhwkzevAmbKGQJjtS54XOgqNrHhsjOUAq7uMzyG\ne6TcMXNR0nyHVF9R4DjK/2lbMURonZ1r+CbKB7fSc6z+mkG/Hwt+w4GLkJOMTa+M\nMPJOAEmXAgMBAAECggEAIFBNwYc7RTq90RFmc8LWQhPIQHrw2u3Q8f4tPI7KZTpc\n7RSzmM7GB2Hswq88gt0zXkYDzXMPoDLYNNAvd0Or+gG/k5XNwuTVRMLWTimX3XeX\nv3kJRXUWAhs5+gd8/jjHZB/Tz0wueiHdoBeZCJDG5lTf3v+RmdT5IsKAlrQ+BBDL\nWy0qM5DPdKaOdDkZwYLKT1+9dK83Mq/PiHL9q+bgt1//o2cbNVToRB85lOB5b59X\n6D8p6SHQa3Jg+XjkY+9rx7GjXG26lzilIXDrf5kVBuP17yemCUdpYGT7Fpb9cGVz\n1/sdHf0x8KQ6Mkbj1GI/pJDXmU26A9lK2r7mtnc4UQKBgQD4vGWBBI9HXKtVbBiu\ndHSw2Pf2bzdg3efpFJY8V/zxbalIMeFSYaz02TXPUgmUhwygMmCTNzOMJmOWBFmp\ntg60j5flk3RTwyX5OaYfUYbkq3dT5B9rYKEqiE99IDZ9tDF0dEoFImzcirPlx0pl\nOYQ0EHiBxlutFV6pv7L0Nv2qhQKBgQDivcXhy55Kpst2ByvvQ1MLRHXsY5PN2ziF\n4sDDbLDHJr0tvBWi3YTpt8+AA5eMZSVz1ErX/JzygRDaGFCjivCoJCJtBGpOLqQK\njg/tG1S72mc+yHLm0KDmdd0M5F8tINMX5ySl5S+6i6w+bFC19gX4d748+8QW6OZJ\nWmQ1uys0awKBgQDWJh2d/rb80aQRX4fAazMsLyENYqNjGqpX2gme2oJDug5MweUk\ncEPgakIRxKfK4JrWMYlENfqDZ2nF9ujbXIs8mYRFe7Zjh1hiQmfr/t0MczPBXl5O\nrFsVq1YEfH9tqn4JrTUtRn5DQoewBOzgSaywxp153bWARy3BJ/KCn/W1oQKBgAV+\ne7EA8hD1AbEWc2YUx4paWlEkCIzQZwo3eFxD4fSxZ5wYFp4fp/zRy2FatO1d9g5c\ncoPRRyxJHFNsi2erEjHAzmS92qWSU789uf0Q0HjMzfujd8VIAN4UtQp+7h910Ceg\nHi824nUutTm9/iaqk3J11FI9935mnk3gttTmeCGJAoGAVactFSOg205RIKvuhugy\nEzVK1uuIu4FEIPiI300IN6anuWX3bY0h+hjt2YLCmN+e8htmXAvqbZWRaat8zUMa\nVZArclC4T5AR3/xHtE0r6mkCHC9yHTCUNxsglmzu8AiN/e7PB3hR333iZvi+45fh\n8iXuTPlibRajaYwfxLmsfWA=\n-----END PRIVATE KEY-----\n",
  "client_email": "arunabh@data-warehouse-india.iam.gserviceaccount.com",
  "client_id": "107171068529123820889",
  "auth_uri": "https://accounts.google.com/o/oauth2/auth",
  "token_uri": "https://oauth2.googleapis.com/token",
  "auth_provider_x509_cert_url": "https://www.googleapis.com/oauth2/v1/certs",
  "client_x509_cert_url": "https://www.googleapis.com/robot/v1/metadata/x509/arunabh%40data-warehouse-india.iam.gserviceaccount.com"
}
