{"Loan_Number":"1631592368260634152","Name":"MOHAMMED AZEEZ KHAN ","Employee_code":"2001669585","EMI_YearMonth" : "202112","EMI_duedate":"2021-10-02","EMI_amount":"2000.00","Vendor_ID":"RAIN-INSTANT-PAY","Remarks":"MOHAMMED AZEEZ KHAN  loan"},
{"Loan_Number":"1632120365741859641","Name":"MOHAMMED AZEEZ KHAN ","Employee_code":"2001669585","EMI_YearMonth" : "202112","EMI_duedate":"2021-10-02","EMI_amount":"1100.00","Vendor_ID":"RAIN-INSTANT-PAY","Remarks":"MOHAMMED AZEEZ KHAN  loan"},
{"Loan_Number":"1632678423540065544","Name":"MOHAMMED AZEEZ KHAN ","Employee_code":"2001669585","EMI_YearMonth" : "202112","EMI_duedate":"2021-10-02","EMI_amount":"800.00","Vendor_ID":"RAIN-INSTANT-PAY","Remarks":"MOHAMMED AZEEZ KHAN  loan"},
{"Loan_Number":"1632734415731358569","Name":"MOHAMMED AZEEZ KHAN ","Employee_code":"2001669585","EMI_YearMonth" : "202112","EMI_duedate":"2021-10-02","EMI_amount":"300.00","Vendor_ID":"RAIN-INSTANT-PAY","Remarks":"MOHAMMED AZEEZ KHAN  loan"},
{"Loan_Number":"1632751869497455178","Name":"MOHAMMED AZEEZ KHAN ","Employee_code":"2001669585","EMI_YearMonth" : "202112","EMI_duedate":"2021-10-02","EMI_amount":"115.43","Vendor_ID":"RAIN-INSTANT-PAY","Remarks":"MOHAMMED AZEEZ KHAN  loan"},
{"Loan_Number":"1632834850220493429","Name":"MOHAMMED AZEEZ KHAN ","Employee_code":"2001669585","EMI_YearMonth" : "202112","EMI_duedate":"2021-10-02","EMI_amount":"155.57","Vendor_ID":"RAIN-INSTANT-PAY","Remarks":"MOHAMMED AZEEZ KHAN  loan"},
{"Loan_Number":"1632898463428397298","Name":"MOHAMMED AZEEZ KHAN ","Employee_code":"2001669585","EMI_YearMonth" : "202112","EMI_duedate":"2021-10-02","EMI_amount":"114.99","Vendor_ID":"RAIN-INSTANT-PAY","Remarks":"MOHAMMED AZEEZ KHAN  loan"},
{"Loan_Number":"1633014304704361324","Name":"MOHAMMED AZEEZ KHAN ","Employee_code":"2001669585","EMI_YearMonth" : "202112","EMI_duedate":"2021-10-02","EMI_amount":"223.21","Vendor_ID":"RAIN-INSTANT-PAY","Remarks":"MOHAMMED AZEEZ KHAN  loan"},
{"Loan_Number":"1630530007017024583","Name":"SAJIL K ","Employee_code":"2001614024","EMI_YearMonth" : "202112","EMI_duedate":"2021-10-01","EMI_amount":"639.93","Vendor_ID":"RAIN-INSTANT-PAY","Remarks":"SAJIL K  loan"},
{"Loan_Number":"1631111267036387519","Name":"SAJIL K ","Employee_code":"2001614024","EMI_YearMonth" : "202112","EMI_duedate":"2021-10-01","EMI_amount":"471.06","Vendor_ID":"RAIN-INSTANT-PAY","Remarks":"SAJIL K  loan"},
{"Loan_Number":"1631252894377181804","Name":"SAJIL K ","Employee_code":"2001614024","EMI_YearMonth" : "202112","EMI_duedate":"2021-10-01","EMI_amount":"346.63","Vendor_ID":"RAIN-INSTANT-PAY","Remarks":"SAJIL K  loan"},
{"Loan_Number":"1631343682949319505","Name":"SAJIL K ","Employee_code":"2001614024","EMI_YearMonth" : "202112","EMI_duedate":"2021-10-01","EMI_amount":"231.09","Vendor_ID":"RAIN-INSTANT-PAY","Remarks":"SAJIL K  loan"},
{"Loan_Number":"1631430548664381104","Name":"SAJIL K ","Employee_code":"2001614024","EMI_YearMonth" : "202112","EMI_duedate":"2021-10-01","EMI_amount":"213.31","Vendor_ID":"RAIN-INSTANT-PAY","Remarks":"SAJIL K  loan"},
{"Loan_Number":"1631603973962358767","Name":"SAJIL K ","Employee_code":"2001614024","EMI_YearMonth" : "202112","EMI_duedate":"2021-10-01","EMI_amount":"417.74","Vendor_ID":"RAIN-INSTANT-PAY","Remarks":"SAJIL K  loan"},
{"Loan_Number":"1631781844830669705","Name":"SAJIL K ","Employee_code":"2001614024","EMI_YearMonth" : "202112","EMI_duedate":"2021-10-01","EMI_amount":"444.40","Vendor_ID":"RAIN-INSTANT-PAY","Remarks":"SAJIL K  loan"},
{"Loan_Number":"1631865427070194514","Name":"SAJIL K ","Employee_code":"2001614024","EMI_YearMonth" : "202112","EMI_duedate":"2021-10-01","EMI_amount":"204.42","Vendor_ID":"RAIN-INSTANT-PAY","Remarks":"SAJIL K  loan"},
{"Loan_Number":"1632677342644434882","Name":"SAJIL K ","Employee_code":"2001614024","EMI_YearMonth" : "202112","EMI_duedate":"2021-10-01","EMI_amount":"2000.00","Vendor_ID":"RAIN-INSTANT-PAY","Remarks":"SAJIL K  loan"},
{"Loan_Number":"1632759605010578386","Name":"SAJIL K ","Employee_code":"2001614024","EMI_YearMonth" : "202112","EMI_duedate":"2021-10-01","EMI_amount":"213.12","Vendor_ID":"RAIN-INSTANT-PAY","Remarks":"SAJIL K  loan"},
{"Loan_Number":"1632839162916550001","Name":"SAJIL K ","Employee_code":"2001614024","EMI_YearMonth" : "202112","EMI_duedate":"2021-10-01","EMI_amount":"195.53","Vendor_ID":"RAIN-INSTANT-PAY","Remarks":"SAJIL K  loan"},
{"Loan_Number":"1632922751853161219","Name":"SAJIL K ","Employee_code":"2001614024","EMI_YearMonth" : "202112","EMI_duedate":"2021-10-01","EMI_amount":"204.43","Vendor_ID":"RAIN-INSTANT-PAY","Remarks":"SAJIL K  loan"},
{"Loan_Number":"1633004764209722325","Name":"SAJIL K ","Employee_code":"2001614024","EMI_YearMonth" : "202112","EMI_duedate":"2021-10-01","EMI_amount":"204.42","Vendor_ID":"RAIN-INSTANT-PAY","Remarks":"SAJIL K  loan"},
{"Loan_Number":"1632241803640051496","Name":"NARASIMHA RAAMISETTI ","Employee_code":"2001494589","EMI_YearMonth" : "202112","EMI_duedate":"2021-10-08","EMI_amount":"5374.65","Vendor_ID":"RAIN-INSTANT-PAY","Remarks":"NARASIMHA RAAMISETTI  loan"},
{"Loan_Number":"1632324969290197942","Name":"PIYUSH PAREEKH ","Employee_code":"2000823184","EMI_YearMonth" : "202112","EMI_duedate":"2021-10-09","EMI_amount":"13091.25","Vendor_ID":"RAIN-INSTANT-PAY","Remarks":"PIYUSH PAREEKH  loan"},
{"Loan_Number":"1632715983763488375","Name":"PIYUSH PAREEKH ","Employee_code":"2000823184","EMI_YearMonth" : "202112","EMI_duedate":"2021-10-09","EMI_amount":"1160.31","Vendor_ID":"RAIN-INSTANT-PAY","Remarks":"PIYUSH PAREEKH  loan"},
{"Loan_Number":"1632799025481366159","Name":"PIYUSH PAREEKH ","Employee_code":"2000823184","EMI_YearMonth" : "202112","EMI_duedate":"2021-10-09","EMI_amount":"580.15","Vendor_ID":"RAIN-INSTANT-PAY","Remarks":"PIYUSH PAREEKH  loan"},
{"Loan_Number":"1632835804879103569","Name":"PIYUSH PAREEKH ","Employee_code":"2000823184","EMI_YearMonth" : "202112","EMI_duedate":"2021-10-09","EMI_amount":"252.24","Vendor_ID":"RAIN-INSTANT-PAY","Remarks":"PIYUSH PAREEKH  loan"},
{"Loan_Number":"1632975306974751752","Name":"PIYUSH PAREEKH ","Employee_code":"2000823184","EMI_YearMonth" : "202112","EMI_duedate":"2021-10-09","EMI_amount":"200.00","Vendor_ID":"RAIN-INSTANT-PAY","Remarks":"PIYUSH PAREEKH  loan"},
{"Loan_Number":"1632982570694221733","Name":"Dhanasekaran B","Employee_code":"2001415149","EMI_YearMonth" : "202112","EMI_duedate":"2021-10-02","EMI_amount":"8935.05","Vendor_ID":"RAIN-INSTANT-PAY","Remarks":"Dhanasekaran B loan"},
{"Loan_Number":"1632319878000707784","Name":"BASA SEKHAR","Employee_code":"2001528948","EMI_YearMonth" : "202112","EMI_duedate":"2021-10-06","EMI_amount":"7193.98","Vendor_ID":"RAIN-INSTANT-PAY","Remarks":"BASA SEKHAR loan"},
{"Loan_Number":"1632296954993317571","Name":"N RAGHAVENDRA ","Employee_code":"2001648977","EMI_YearMonth" : "202112","EMI_duedate":"2021-10-09","EMI_amount":"3875.42","Vendor_ID":"RAIN-INSTANT-PAY","Remarks":"N RAGHAVENDRA  loan"},
{"Loan_Number":"1632414547832552578","Name":"N RAGHAVENDRA ","Employee_code":"2001648977","EMI_YearMonth" : "202112","EMI_duedate":"2021-10-09","EMI_amount":"250.27","Vendor_ID":"RAIN-INSTANT-PAY","Remarks":"N RAGHAVENDRA  loan"},
{"Loan_Number":"1632499272262693951","Name":"N RAGHAVENDRA ","Employee_code":"2001648977","EMI_YearMonth" : "202112","EMI_duedate":"2021-10-09","EMI_amount":"182.02","Vendor_ID":"RAIN-INSTANT-PAY","Remarks":"N RAGHAVENDRA  loan"},
{"Loan_Number":"1632667444498223098","Name":"N RAGHAVENDRA ","Employee_code":"2001648977","EMI_YearMonth" : "202112","EMI_duedate":"2021-10-09","EMI_amount":"300.00","Vendor_ID":"RAIN-INSTANT-PAY","Remarks":"N RAGHAVENDRA  loan"},
{"Loan_Number":"1632404044284332974","Name":"Swapnil  pawar","Employee_code":"2001239162","EMI_YearMonth" : "202112","EMI_duedate":"2021-10-09","EMI_amount":"300.00","Vendor_ID":"RAIN-INSTANT-PAY","Remarks":"Swapnil  pawar loan"},
{"Loan_Number":"1632468677108095727","Name":"Swapnil  pawar","Employee_code":"2001239162","EMI_YearMonth" : "202112","EMI_duedate":"2021-10-09","EMI_amount":"500.00","Vendor_ID":"RAIN-INSTANT-PAY","Remarks":"Swapnil  pawar loan"},
{"Loan_Number":"1632648606553062020","Name":"Swapnil  pawar","Employee_code":"2001239162","EMI_YearMonth" : "202112","EMI_duedate":"2021-10-09","EMI_amount":"200.00","Vendor_ID":"RAIN-INSTANT-PAY","Remarks":"Swapnil  pawar loan"},
{"Loan_Number":"1632676983620121437","Name":"Swapnil  pawar","Employee_code":"2001239162","EMI_YearMonth" : "202112","EMI_duedate":"2021-10-09","EMI_amount":"1500.00","Vendor_ID":"RAIN-INSTANT-PAY","Remarks":"Swapnil  pawar loan"},
{"Loan_Number":"1632761469309631038","Name":"Swapnil  pawar","Employee_code":"2001239162","EMI_YearMonth" : "202112","EMI_duedate":"2021-10-09","EMI_amount":"600.00","Vendor_ID":"RAIN-INSTANT-PAY","Remarks":"Swapnil  pawar loan"},
{"Loan_Number":"1632762007569613463","Name":"Swapnil  pawar","Employee_code":"2001239162","EMI_YearMonth" : "202112","EMI_duedate":"2021-10-09","EMI_amount":"300.00","Vendor_ID":"RAIN-INSTANT-PAY","Remarks":"Swapnil  pawar loan"},
{"Loan_Number":"1632834963538202958","Name":"Swapnil  pawar","Employee_code":"2001239162","EMI_YearMonth" : "202112","EMI_duedate":"2021-10-09","EMI_amount":"1364.48","Vendor_ID":"RAIN-INSTANT-PAY","Remarks":"Swapnil  pawar loan"},
{"Loan_Number":"1632916144022542920","Name":"Swapnil  pawar","Employee_code":"2001239162","EMI_YearMonth" : "202112","EMI_duedate":"2021-10-09","EMI_amount":"158.58","Vendor_ID":"RAIN-INSTANT-PAY","Remarks":"Swapnil  pawar loan"},
{"Loan_Number":"1633007886927520567","Name":"MANMOHAN SINGH","Employee_code":"2001183633","EMI_YearMonth" : "202112","EMI_duedate":"2021-10-02","EMI_amount":"9000.00","Vendor_ID":"RAIN-INSTANT-PAY","Remarks":"MANMOHAN SINGH loan"},
{"Loan_Number":"1632550144545808762","Name":"Bhuvesh Babu","Employee_code":"2000911844","EMI_YearMonth" : "202112","EMI_duedate":"2021-10-09","EMI_amount":"9400.00","Vendor_ID":"RAIN-INSTANT-PAY","Remarks":"Bhuvesh Babu loan"},
{"Loan_Number":"1632892743331295013","Name":"Bhuvesh Babu","Employee_code":"2000911844","EMI_YearMonth" : "202112","EMI_duedate":"2021-10-09","EMI_amount":"600.00","Vendor_ID":"RAIN-INSTANT-PAY","Remarks":"Bhuvesh Babu loan"},
{"Loan_Number":"1632249603764176273","Name":"AKARSH N S ","Employee_code":"2001693451","EMI_YearMonth" : "202112","EMI_duedate":"2021-10-09","EMI_amount":"4173.24","Vendor_ID":"RAIN-INSTANT-PAY","Remarks":"AKARSH N S  loan"},
{"Loan_Number":"1632711188985125560","Name":"AKARSH N S ","Employee_code":"2001693451","EMI_YearMonth" : "202112","EMI_duedate":"2021-10-09","EMI_amount":"1000.00","Vendor_ID":"RAIN-INSTANT-PAY","Remarks":"AKARSH N S  loan"},
{"Loan_Number":"1632494346055204003","Name":"SANJOG HADKAR","Employee_code":"2001719502","EMI_YearMonth" : "202112","EMI_duedate":"2021-10-08","EMI_amount":"3600.00","Vendor_ID":"RAIN-INSTANT-PAY","Remarks":"SANJOG HADKAR loan"},
{"Loan_Number":"1631966705144054538","Name":"VIVEK S ","Employee_code":"2001645310","EMI_YearMonth" : "202112","EMI_duedate":"2021-10-01","EMI_amount":"500.00","Vendor_ID":"RAIN-INSTANT-PAY","Remarks":"VIVEK S  loan"},
{"Loan_Number":"1631967427110626335","Name":"VIVEK S ","Employee_code":"2001645310","EMI_YearMonth" : "202112","EMI_duedate":"2021-10-01","EMI_amount":"1100.00","Vendor_ID":"RAIN-INSTANT-PAY","Remarks":"VIVEK S  loan"},
{"Loan_Number":"1632095822807865653","Name":"VIVEK S ","Employee_code":"2001645310","EMI_YearMonth" : "202112","EMI_duedate":"2021-10-01","EMI_amount":"400.00","Vendor_ID":"RAIN-INSTANT-PAY","Remarks":"VIVEK S  loan"},
{"Loan_Number":"1632186483797893821","Name":"VIVEK S ","Employee_code":"2001645310","EMI_YearMonth" : "202112","EMI_duedate":"2021-10-01","EMI_amount":"400.00","Vendor_ID":"RAIN-INSTANT-PAY","Remarks":"VIVEK S  loan"},
{"Loan_Number":"1632207074053170970","Name":"VIVEK S ","Employee_code":"2001645310","EMI_YearMonth" : "202112","EMI_duedate":"2021-10-01","EMI_amount":"500.00","Vendor_ID":"RAIN-INSTANT-PAY","Remarks":"VIVEK S  loan"},
{"Loan_Number":"1632293943064540287","Name":"VIVEK S ","Employee_code":"2001645310","EMI_YearMonth" : "202112","EMI_duedate":"2021-10-01","EMI_amount":"300.00","Vendor_ID":"RAIN-INSTANT-PAY","Remarks":"VIVEK S  loan"},
{"Loan_Number":"1632311646534280633","Name":"VIVEK S ","Employee_code":"2001645310","EMI_YearMonth" : "202112","EMI_duedate":"2021-10-01","EMI_amount":"200.00","Vendor_ID":"RAIN-INSTANT-PAY","Remarks":"VIVEK S  loan"},
{"Loan_Number":"1632375484215131029","Name":"VIVEK S ","Employee_code":"2001645310","EMI_YearMonth" : "202112","EMI_duedate":"2021-10-01","EMI_amount":"600.00","Vendor_ID":"RAIN-INSTANT-PAY","Remarks":"VIVEK S  loan"},
{"Loan_Number":"1632548947846191084","Name":"VIVEK S ","Employee_code":"2001645310","EMI_YearMonth" : "202112","EMI_duedate":"2021-10-01","EMI_amount":"487.64","Vendor_ID":"RAIN-INSTANT-PAY","Remarks":"VIVEK S  loan"},
{"Loan_Number":"1632616803082993411","Name":"VIVEK S ","Employee_code":"2001645310","EMI_YearMonth" : "202112","EMI_duedate":"2021-10-01","EMI_amount":"146.76","Vendor_ID":"RAIN-INSTANT-PAY","Remarks":"VIVEK S  loan"},
{"Loan_Number":"1632807786893231238","Name":"VIVEK S ","Employee_code":"2001645310","EMI_YearMonth" : "202112","EMI_duedate":"2021-10-01","EMI_amount":"409.37","Vendor_ID":"RAIN-INSTANT-PAY","Remarks":"VIVEK S  loan"},
{"Loan_Number":"1632897543975272319","Name":"VIVEK S ","Employee_code":"2001645310","EMI_YearMonth" : "202112","EMI_duedate":"2021-10-01","EMI_amount":"193.10","Vendor_ID":"RAIN-INSTANT-PAY","Remarks":"VIVEK S  loan"},
{"Loan_Number":"1632649685214973008","Name":"MOHAMMAD IMRAN Imran ","Employee_code":"2001578706","EMI_YearMonth" : "202112","EMI_duedate":"2021-10-09","EMI_amount":"7975.46","Vendor_ID":"RAIN-INSTANT-PAY","Remarks":"MOHAMMAD IMRAN Imran  loan"},
{"Loan_Number":"1632734883952926257","Name":"MOHAMMAD IMRAN Imran ","Employee_code":"2001578706","EMI_YearMonth" : "202112","EMI_duedate":"2021-10-09","EMI_amount":"314.30","Vendor_ID":"RAIN-INSTANT-PAY","Remarks":"MOHAMMAD IMRAN Imran  loan"},
{"Loan_Number":"1632813483981359784","Name":"MOHAMMAD IMRAN Imran ","Employee_code":"2001578706","EMI_YearMonth" : "202112","EMI_duedate":"2021-10-09","EMI_amount":"288.12","Vendor_ID":"RAIN-INSTANT-PAY","Remarks":"MOHAMMAD IMRAN Imran  loan"},
{"Loan_Number":"1632999363172364829","Name":"MOHAMMAD IMRAN Imran ","Employee_code":"2001578706","EMI_YearMonth" : "202112","EMI_duedate":"2021-10-09","EMI_amount":"667.89","Vendor_ID":"RAIN-INSTANT-PAY","Remarks":"MOHAMMAD IMRAN Imran  loan"},
{"Loan_Number":"1632573307521407784","Name":"Raghavendra N","Employee_code":"2001666405","EMI_YearMonth" : "202112","EMI_duedate":"2021-10-02","EMI_amount":"4337.08","Vendor_ID":"RAIN-INSTANT-PAY","Remarks":"Raghavendra N loan"},
{"Loan_Number":"1632931745820026592","Name":"Raghavendra N","Employee_code":"2001666405","EMI_YearMonth" : "202112","EMI_duedate":"2021-10-02","EMI_amount":"737.60","Vendor_ID":"RAIN-INSTANT-PAY","Remarks":"Raghavendra N loan"},
{"Loan_Number":"1632503224360751922","Name":"Mujawar Gouse Samdani ","Employee_code":"QS2271003","EMI_YearMonth" : "202112","EMI_duedate":"2021-10-03","EMI_amount":"5659.55","Vendor_ID":"RAIN-INSTANT-PAY","Remarks":"Mujawar Gouse Samdani  loan"},
{"Loan_Number":"1632647344576672387","Name":"Mujawar Gouse Samdani ","Employee_code":"QS2271003","EMI_YearMonth" : "202112","EMI_duedate":"2021-10-03","EMI_amount":"408.52","Vendor_ID":"RAIN-INSTANT-PAY","Remarks":"Mujawar Gouse Samdani  loan"},
{"Loan_Number":"1632725651624785202","Name":"Mujawar Gouse Samdani ","Employee_code":"QS2271003","EMI_YearMonth" : "202112","EMI_duedate":"2021-10-03","EMI_amount":"209.25","Vendor_ID":"RAIN-INSTANT-PAY","Remarks":"Mujawar Gouse Samdani  loan"},
{"Loan_Number":"1632805743405481808","Name":"Mujawar Gouse Samdani ","Employee_code":"QS2271003","EMI_YearMonth" : "202112","EMI_duedate":"2021-10-03","EMI_amount":"229.17","Vendor_ID":"RAIN-INSTANT-PAY","Remarks":"Mujawar Gouse Samdani  loan"},
{"Loan_Number":"1632846328595185859","Name":"Mujawar Gouse Samdani ","Employee_code":"QS2271003","EMI_YearMonth" : "202112","EMI_duedate":"2021-10-03","EMI_amount":"109.60","Vendor_ID":"RAIN-INSTANT-PAY","Remarks":"Mujawar Gouse Samdani  loan"},
{"Loan_Number":"1632891474623575340","Name":"Mujawar Gouse Samdani ","Employee_code":"QS2271003","EMI_YearMonth" : "202112","EMI_duedate":"2021-10-03","EMI_amount":"119.57","Vendor_ID":"RAIN-INSTANT-PAY","Remarks":"Mujawar Gouse Samdani  loan"},
{"Loan_Number":"1632930666477865395","Name":"Mujawar Gouse Samdani ","Employee_code":"QS2271003","EMI_YearMonth" : "202112","EMI_duedate":"2021-10-03","EMI_amount":"109.60","Vendor_ID":"RAIN-INSTANT-PAY","Remarks":"Mujawar Gouse Samdani  loan"},
{"Loan_Number":"1632975966094860127","Name":"Mujawar Gouse Samdani ","Employee_code":"QS2271003","EMI_YearMonth" : "202112","EMI_duedate":"2021-10-03","EMI_amount":"129.54","Vendor_ID":"RAIN-INSTANT-PAY","Remarks":"Mujawar Gouse Samdani  loan"},
{"Loan_Number":"1632814084373059622","Name":"Rakesha  J","Employee_code":"2001724271","EMI_YearMonth" : "202112","EMI_duedate":"2021-10-09","EMI_amount":"5462.70","Vendor_ID":"RAIN-INSTANT-PAY","Remarks":"Rakesha  J loan"},
{"Loan_Number":"1633008006166197046","Name":"Rakesha  J","Employee_code":"2001724271","EMI_YearMonth" : "202112","EMI_duedate":"2021-10-09","EMI_amount":"450.36","Vendor_ID":"RAIN-INSTANT-PAY","Remarks":"Rakesha  J loan"},
{"Loan_Number":"1632219186405895688","Name":"Rakesh Jaiswar","Employee_code":"2001570178","EMI_YearMonth" : "202112","EMI_duedate":"2021-10-01","EMI_amount":"1000.00","Vendor_ID":"RAIN-INSTANT-PAY","Remarks":"Rakesh Jaiswar loan"},
{"Loan_Number":"1632294903626201533","Name":"Rakesh Jaiswar","Employee_code":"2001570178","EMI_YearMonth" : "202112","EMI_duedate":"2021-10-01","EMI_amount":"1000.00","Vendor_ID":"RAIN-INSTANT-PAY","Remarks":"Rakesh Jaiswar loan"},
{"Loan_Number":"1632371524491953908","Name":"Rakesh Jaiswar","Employee_code":"2001570178","EMI_YearMonth" : "202112","EMI_duedate":"2021-10-01","EMI_amount":"3000.00","Vendor_ID":"RAIN-INSTANT-PAY","Remarks":"Rakesh Jaiswar loan"},
{"Loan_Number":"1632457743778100480","Name":"Rakesh Jaiswar","Employee_code":"2001570178","EMI_YearMonth" : "202112","EMI_duedate":"2021-10-01","EMI_amount":"300.00","Vendor_ID":"RAIN-INSTANT-PAY","Remarks":"Rakesh Jaiswar loan"},
{"Loan_Number":"1632460931863555630","Name":"Rakesh Jaiswar","Employee_code":"2001570178","EMI_YearMonth" : "202112","EMI_duedate":"2021-10-01","EMI_amount":"200.00","Vendor_ID":"RAIN-INSTANT-PAY","Remarks":"Rakesh Jaiswar loan"},
{"Loan_Number":"1632487206143181000","Name":"MOHAN R ","Employee_code":"2001765510","EMI_YearMonth" : "202112","EMI_duedate":"2021-10-09","EMI_amount":"4523.28","Vendor_ID":"RAIN-INSTANT-PAY","Remarks":"MOHAN R  loan"},
{"Loan_Number":"1632732123492264248","Name":"MOHAN R ","Employee_code":"2001765510","EMI_YearMonth" : "202112","EMI_duedate":"2021-10-09","EMI_amount":"545.36","Vendor_ID":"RAIN-INSTANT-PAY","Remarks":"MOHAN R  loan"},
{"Loan_Number":"1632838157990689330","Name":"MOHAN R ","Employee_code":"2001765510","EMI_YearMonth" : "202112","EMI_duedate":"2021-10-09","EMI_amount":"240.60","Vendor_ID":"RAIN-INSTANT-PAY","Remarks":"MOHAN R  loan"},
{"Loan_Number":"1632980522912891519","Name":"MOHAN R ","Employee_code":"2001765510","EMI_YearMonth" : "202112","EMI_duedate":"2021-10-09","EMI_amount":"312.78","Vendor_ID":"RAIN-INSTANT-PAY","Remarks":"MOHAN R  loan"},
