{"itemCount":6499,"md5Checksum":"UUhmbEk7kWQEoYwx/ORSjg==","etag":"47f2c8df1a11e20c6e5fc96081ee8b5c-1","dataFileS3Key":"AWSDynamoDB/01639113616500-23f24ef1/data/6hofw2rcoy2bfg62h3sj3l7vfi.json.gz"}
{"itemCount":6666,"md5Checksum":"rxLlXZ/YWeRM4upTuOu1gQ==","etag":"f74b2c8ebff17524b0c04bfd5c1995d9-1","dataFileS3Key":"AWSDynamoDB/01639113616500-23f24ef1/data/wgpg4xbb3i6gjgxcsisas3i5tu.json.gz"}
{"itemCount":6684,"md5Checksum":"p49qnt8hbsUwplO1Sur/9A==","etag":"f901c7e7201191ecec7c2274ad2d8db8-1","dataFileS3Key":"AWSDynamoDB/01639113616500-23f24ef1/data/i6mx7oynwa62hoak7ltncwlydu.json.gz"}
{"itemCount":6622,"md5Checksum":"k+2s/sUBLc7Vd1BGNrG2qQ==","etag":"ea3cd76e4759ffb728e6cd16d15ea7f1-1","dataFileS3Key":"AWSDynamoDB/01639113616500-23f24ef1/data/mn5gg7bz4a22pinho3defjf4le.json.gz"}
