{"itemCount":11020,"md5Checksum":"ut372qzpBiMBm+RGEkbnRA==","etag":"892e68249ccf887436b53fd5d759c076-1","dataFileS3Key":"AWSDynamoDB/01646130846122-7ca93afb/data/6tfzqr5blm2cbcj3vhesbcepiq.json.gz"}
{"itemCount":11292,"md5Checksum":"fJEq99ZhaW5qzUkYALh/UA==","etag":"c296838c30667c12f1abf73037a08447-1","dataFileS3Key":"AWSDynamoDB/01646130846122-7ca93afb/data/abvtcb2i7u5nhaaquwrrimmcb4.json.gz"}
{"itemCount":11292,"md5Checksum":"8EFoMMi00DVfSWp221itog==","etag":"a0bffd22ca75681ecfa41957ac7376a5-1","dataFileS3Key":"AWSDynamoDB/01646130846122-7ca93afb/data/ycapatga7a72hop7xxzdwexicm.json.gz"}
{"itemCount":11211,"md5Checksum":"zM5xkrh4WxsWx1GWb5Yjmw==","etag":"83607bb9731721e0d53a569baadf32d2-1","dataFileS3Key":"AWSDynamoDB/01646130846122-7ca93afb/data/erwqplfmlm2ifl6y5o3tufm45e.json.gz"}
