,user_id,full_name,first_name,last_name,status,email,phone_number,created_at,updated_at,activated_at,source_code,source_id,metadata,username,document_number
95,c5d769aa-0c04-424e-88be-065677b75ec2,BISHAL ROUTH ,BISHAL ROUTH,,ACTIVE,2000687913@gmail.com,8240603616,2021-09-01,2021-09-01 11:08:13.475775+00:00,2021-09-01 11:08:13.475775+00:00,rain,,"{'gender': 'Male', 'birth_date': '2000-01-01'}",+918240603616,BOKPR8228E
124,5a92aee7-ac45-4199-9dc5-454ba3d5c8ec,N RAGHAVENDRA ,N RAGHAVENDRA,,ACTIVE,2001648977@gmail.com,9742270663,2021-09-01,2021-09-01 11:38:48.449292+00:00,2021-09-01 11:38:48.449292+00:00,rain,,"{'gender': 'Male', 'birth_date': '1995-01-29'}",+919742270663,BCCPR7400Q
494,06a03e57-44c2-485b-b569-b63c96aa1dd6,MOSTAFIZUR RAHMAN ,MOSTAFIZUR RAHMAN,,ACTIVE,mr444434@gmail.com,7896722047,2021-09-05,2021-09-05 18:46:25.901571+00:00,2021-09-05 18:46:25.901571+00:00,rain,,"{'gender': 'Male', 'birth_date': '1994-04-12'}",+917896722047,BNTPR8187C
593,c4e9c08e-f866-430a-afed-fd36bba4a935,BASAVARAJU S ,BASAVARAJU S,,ACTIVE,basavaraju.s@bizsupporta.com,9844744055,2021-09-11,2021-09-11 11:02:43.986172+00:00,2021-09-11 11:02:43.986172+00:00,rain,,"{'gender': 'Male', 'birth_date': '1989-07-06'}",+919844744055,CCQPB0418M
612,fad79017-73b7-4ce8-94d1-c7ec76eb6878,SARAVANAN P ,SARAVANAN P,,ACTIVE,saruweb95@gmail.com,9597684218,2021-09-12,2021-09-12 06:35:13.307068+00:00,2021-09-12 06:35:13.307068+00:00,rain,,"{'gender': 'Male', 'birth_date': '1995-12-03'}",+919597684218,HZGPS9345C
779,a254b7e1-00c0-4786-ade2-885fc3c6afa2,Ajaya Krishn Mishra,Ajaya Krishn,Mishra,ACTIVE,Q1122774@gmail.com,8070294142,2021-09-22,2021-09-22 02:15:10.189694+00:00,2021-09-22 02:15:10.189694+00:00,rain,,"{'gender': 'Male', 'birth_date': '1993-03-03'}",+918070294142,EGDPK1516E
1007,11a93c06-9b9b-4cdc-8ef8-f787cf8a5ac8,TUSAR  BICHAVE,TUSAR ,BICHAVE,ACTIVE,9371690008@gmail.com,9371690008,2021-09-18,2021-09-18 11:51:56.592304+00:00,2021-09-18 11:51:56.592304+00:00,rain,,"{'gender': 'Male', 'birth_date': '1981-07-20'}",+919371690008,BBEPB6044H
1190,ad3a3cd4-b65f-4c4f-926b-7d45f3e555b4,NANDEESH  H M,NANDEESH ,H M,ACTIVE,nandeesh.m@bizsupporta.com,7760570046,2021-09-21,2021-09-21 08:19:19.556723+00:00,2021-09-21 08:19:19.556723+00:00,rain,,"{'gender': 'Male', 'birth_date': '1999-05-22'}",+917760570046,BZRPN9899M
