,user_id,employee_id,full_name,birth_date,Gender,employer_id,email,status,phone_number,organization_id,document_number,created_at,monthly_salary,tid,Withdrawn Amount,disbursal(txn) date,processing_fees,GST_fees,Annual_income,Total Amount,overall_limit,next_payment_date,Sanctioned Loan Limit,disbursed amount,Undisbursed amount
1185,ab188f42-30b5-44ba-a597-4f79079afc98,5ae69ccf-c50e-4457-9b5c-f15fbaea6048,Chilaka  Babu,1991-03-18,Male,5b81572b-7422-405e-89a9-4af836bc3895,adhidvy@gmail.com,ELIGIBLE,7036336067,c2a6a007-e625-456f-8c36-92cd2654c971,BQBPC6924M,2021-09-23,15581.0,3ae9bb04-2858-450d-8647-5d8f5c2b4578,553.6,2021-10-10,29.66,5.34,186972.0,588.6,6223.66,2021-10-02,6232.400000000001,1792.0,4440.400000000001
524,0320a920-6008-4935-813f-370d30184741,f1a480d6-6cf1-4b3a-b4de-9120ff3193a5,Bejjanki Rakesh Kumar ,1991-05-20,Male,5b81572b-7422-405e-89a9-4af836bc3895,chari4645@gmail.com,ELIGIBLE,8688926407,c2a6a007-e625-456f-8c36-92cd2654c971,DYWPK1299C,2021-09-09,22770.0,11b592dd-bdf4-45dd-96d0-17436f4a4ae2,2557.26,2021-10-10,169.49,30.50999999999999,273240.0,2757.26,12.65,2021-11-02,9108.0,10604.64,-1496.6399999999994
612,40072ae4-5fca-4e78-a9ac-e7bb9472899d,e7cb71c8-b2e5-4865-afed-32b01cb02d65,ASHRAF HUSSAIN ,1972-08-21,Male,5b81572b-7422-405e-89a9-4af836bc3895,QS2192113@gmail.com,ELIGIBLE,9342228494,c2a6a007-e625-456f-8c36-92cd2654c971,BLRPS6002F,2021-09-09,24830.0,214b3834-bbd7-40ff-b0a8-05ed45429ad6,395.76,2021-10-10,15.25,2.75,297960.0,413.76,7216.44,2021-10-01,9932.0,5450.650000000001,4481.349999999999
17,182283ff-c9a6-47fb-85fa-6959791650e7,dc1d9fd7-9fa3-48ca-85ff-eabbe19cd2ee,IMRAN AHMED M F ,1993-02-23,Male,5b81572b-7422-405e-89a9-4af836bc3895,imran.ahmed4245@gmail.com,ELIGIBLE,8660888748,c2a6a007-e625-456f-8c36-92cd2654c971,ACJPI6637A,2021-09-01,20439.0,3d28ee08-6add-475f-924e-d69b2a02afd4,2374.73,2021-10-10,84.75,15.25,245268.0,2474.73,518.6,2021-10-01,8175.6,9682.21,-1506.6099999999988
1500,2810f50c-1f94-49e8-a9a8-789cedf28cdb,c92cb4a7-f59b-4158-9dba-b21f07c98ce4,Khader  Basha ,1994-05-04,Male,5b81572b-7422-405e-89a9-4af836bc3895,sageersmart143@gmail.com,ELIGIBLE,8667056083,c2a6a007-e625-456f-8c36-92cd2654c971,DSPPK7851B,2021-09-27,22551.0,86ef065a-2786-45fa-b9ec-2eabe7474b7a,2400.0,2021-10-10,84.75,15.25,270612.0,2500.0,143.63,2021-11-02,9020.4,10017.64,-997.2399999999998
