,user_id,employee_id,full_name,birth_date,Gender,employer_id,email,status,phone_number,organization_id,document_number,created_at,monthly_salary,loan_agreement_number,path,accepted,accepted_at,loan_duration,loan_Closure_date,tid,Withdrawn Amount,disbursal(txn) date,processing_fees,GST_fees,Annual_income,Total Amount,overall_limit,next_payment_date,Sanctioned Loan Limit,disbursed amount,Undisbursed amount,new_payment_date,Utlization %
0,0320a920-6008-4935-813f-370d30184741,f1a480d6-6cf1-4b3a-b4de-9120ff3193a5,Bejjanki Rakesh Kumar ,1991-05-20,Male,5b81572b-7422-405e-89a9-4af836bc3895,chari4645@gmail.com,ELIGIBLE,8688926407,c2a6a007-e625-456f-8c36-92cd2654c971,DYWPK1299C,2021-09-09,22770.0,LCT7704819,loan-agreements.in/f1a480d6-6cf1-4b3a-b4de-9120ff3193a5_LCT7704819.pdf,True,2021-09-28,362 days,2022-09-28,2ce58566-bf22-4646-93ef-8e8b16e55c05,8047.38,2021-09-28 16:26:30.343777+05:30,233.05,41.94999999999999,273240.0,8322.38,910.65,2021-11-02,9108.0,8322.38,785.6200000000008,2021-10-02,0.914
1,099cabcc-1e53-4f27-8f46-8624ecfc0c26,c65fd0e5-4bda-4b5c-bd4c-0a1f3c5e8720,MOHAMMED AZEEZ KHAN ,1993-12-10,Male,5b81572b-7422-405e-89a9-4af836bc3895,QS2134537@gmail.com,ELIGIBLE,8310493694,c2a6a007-e625-456f-8c36-92cd2654c971,EDPPM6574M,2021-09-08,12178.0,2I64363098,loan-agreements.in/c65fd0e5-4bda-4b5c-bd4c-0a1f3c5e8720_2I64363098.pdf,True,2021-09-14,348 days,2022-09-14,70744e79-056e-465b-9d0c-a40708977bfe,211.21,2021-09-30 20:34:14.866051+05:30,10.17,1.83,146136.0,223.21,487.0,2021-11-02,4871.2,4809.2,62.0,2021-10-02,0.987
2,0ba9e70e-e708-4c5e-bce9-ecc22e09b9ca,a5a3ff51-f112-41bd-b8ef-2f85a7e960ce,Manneti Gangadhar Reddy ,1995-04-10,Male,5b81572b-7422-405e-89a9-4af836bc3895,gangadharmanneti@gmail.com,ELIGIBLE,9966336704,c2a6a007-e625-456f-8c36-92cd2654c971,EOGPM4285H,2021-09-13,20262.0,MON8842903,loan-agreements.in/a5a3ff51-f112-41bd-b8ef-2f85a7e960ce_MON8842903.pdf,True,2021-09-20,354 days,2022-09-20,58c6e624-75a6-4e56-898a-9898859505cc,831.72,2021-09-30 14:51:35.429211+05:30,29.66,5.34,243144.0,866.72,810.43,2021-11-02,8104.8,7935.4800000000005,169.3199999999997,2021-10-02,0.979
3,11455aa4-3400-49db-a93d-48e496d01d63,0b34815a-d4aa-45e9-be99-221b1bd74222,CHONA CHABA SINGH ,1988-09-09,Male,5b81572b-7422-405e-89a9-4af836bc3895,sannharb@gmail.com,ELIGIBLE,8259855785,c2a6a007-e625-456f-8c36-92cd2654c971,DRHPS4238B,2021-09-02,30110.0,UVX3616283,loan-agreements.in/0b34815a-d4aa-45e9-be99-221b1bd74222_UVX3616283.pdf,True,2021-09-15,349 days,2022-09-15,851c87cc-9cb6-4508-8781-1b9677b70712,88.34,2021-09-30 17:19:49.704453+05:30,10.17,1.83,361320.0,100.34,200.69,2021-10-02,12044.0,11823.86,220.13999999999942,2021-10-02,0.982
4,11a93c06-9b9b-4cdc-8ef8-f787cf8a5ac8,f0030485-0375-459b-a15a-afa645b48416,TUSAR  BICHAVE,1981-07-20,Male,5b81572b-7422-405e-89a9-4af836bc3895,9371690008@gmail.com,ELIGIBLE,9371690008,c2a6a007-e625-456f-8c36-92cd2654c971,BBEPB6044H,2021-09-18,9306.0,6XI0162523,loan-agreements.in/f0030485-0375-459b-a15a-afa645b48416_6XI0162523.pdf,True,2021-09-22,356 days,2022-09-22,45e1c12e-f7bc-4e04-b558-d182b22593c6,2400.0,2021-09-22 12:28:14.513060+05:30,84.75,15.25,111672.0,2500.0,1215.79,2021-10-02,3722.4,2500.0,1222.4,2021-10-02,0.672
5,13a6c54d-9008-4a24-8e90-ccfb54d7fdf0,d5483743-04a2-4bb8-9cd5-9280044b6059,SAJIL K ,1997-12-14,MALE,5b81572b-7422-405e-89a9-4af836bc3895,SAJILK999@GMAIL.COM,ELIGIBLE,7356142757,c2a6a007-e625-456f-8c36-92cd2654c971,HDSPK0094J,2021-09-01,16000.0,GMO1926042,loan-agreements.in/d5483743-04a2-4bb8-9cd5-9280044b6059_GMO1926042.pdf,True,2021-09-01,335 days,2022-09-01,6a03f5bf-adde-40f1-b40c-8784d90cb0dc,192.42,2021-09-30 17:55:18.946279+05:30,10.17,1.83,192000.0,204.42,639.93,2021-11-01,6400.0,5786.08,613.9200000000001,2021-10-01,0.904
6,14886d99-1354-4aa1-82d0-2572c11a3203,75fbc100-830b-48d5-95f0-e13ed85e0045,GOVIND ,1995-08-16,Male,5b81572b-7422-405e-89a9-4af836bc3895,govindbora77@gmail.com,ELIGIBLE,9456131081,c2a6a007-e625-456f-8c36-92cd2654c971,FRXPS5043A,2021-09-08,12999.0,Q830781044,loan-agreements.in/75fbc100-830b-48d5-95f0-e13ed85e0045_Q830781044.pdf,True,2021-09-20,354 days,2022-09-20,a76a70b4-1274-4927-82c4-c657fd29c92b,482.0,2021-09-26 17:55:14.053803+05:30,15.25,2.75,155988.0,500.0,519.84,2021-11-01,5199.6,2000.0,3199.6000000000004,2021-10-01,0.385
7,15fe5a1c-272d-48cc-80c8-980cb1b3feb0,8cd7064b-519b-4d26-ba11-79deffa6382c,A KULANTHAI RAJ ,1996-02-07,Male,5b81572b-7422-405e-89a9-4af836bc3895,9715374763@gmail.com,ELIGIBLE,9715374763,c2a6a007-e625-456f-8c36-92cd2654c971,DINPK9588R,2021-09-02,14023.0,WZ21445794,loan-agreements.in/8cd7064b-519b-4d26-ba11-79deffa6382c_WZ21445794.pdf,True,2021-09-21,355 days,2022-09-21,e7cb7dd7-3c3b-4679-956e-a01a08e83db3,1040.0,2021-09-22 18:34:37.579174+05:30,50.85,9.149999999999999,168276.0,1100.0,560.73,2021-11-02,5609.200000000001,3700.0,1909.2000000000007,2021-10-02,0.66
8,182283ff-c9a6-47fb-85fa-6959791650e7,dc1d9fd7-9fa3-48ca-85ff-eabbe19cd2ee,IMRAN AHMED M F ,1993-02-23,Male,5b81572b-7422-405e-89a9-4af836bc3895,imran.ahmed4245@gmail.com,ELIGIBLE,8660888748,c2a6a007-e625-456f-8c36-92cd2654c971,ACJPI6637A,2021-09-01,20439.0,MQX2539302,loan-agreements.in/dc1d9fd7-9fa3-48ca-85ff-eabbe19cd2ee_MQX2539302.pdf,True,2021-09-06,340 days,2022-09-06,f2b8eace-0ed1-4086-abdb-da3045bd4ec5,482.0,2021-09-30 21:23:56.814049+05:30,15.25,2.75,245268.0,500.0,518.6,2021-10-01,8175.6,7603.48,572.1200000000008,2021-10-01,0.93
9,1e823867-8529-45f5-a3be-6bd984ab8e87,08175b7c-da3d-4f29-af73-2c65772ed234,Venkata Naga Sai Krishna Ajandla,1999-08-02,Male,5b81572b-7422-405e-89a9-4af836bc3895,avnsaikrishna12@gmail.com,ELIGIBLE,7680850949,c2a6a007-e625-456f-8c36-92cd2654c971,BZRPV0035P,2021-09-22,16000.0,SPB6738066,loan-agreements.in/08175b7c-da3d-4f29-af73-2c65772ed234_SPB6738066.pdf,True,2021-09-23,357 days,2022-09-23,a6d23628-b1b4-4559-a7ef-885e2c303a8f,482.0,2021-09-28 10:49:23.020193+05:30,15.25,2.75,192000.0,500.0,682.11,2021-10-04,6400.0,5708.36,691.6400000000003,2021-10-04,0.892
10,1fc9738c-4edc-4bda-99a6-bdc8e5cd56b2,bf9d28c1-c8a1-484c-a5d1-62cf0bd5e8f0,SRINIVASA  PERUMAL S ,1987-04-25,Male,5b81572b-7422-405e-89a9-4af836bc3895,srinivasa.perumal@uhcpindia.com,ELIGIBLE,9940591404,c2a6a007-e625-456f-8c36-92cd2654c971,DLIPS4091F,2021-09-04,37533.0,2ZC1063423,loan-agreements.in/bf9d28c1-c8a1-484c-a5d1-62cf0bd5e8f0_2ZC1063423.pdf,True,2021-09-24,358 days,2022-09-24,5d850b7c-9924-4bc1-b001-0a505f053156,3800.0,2021-09-24 18:14:09.183771+05:30,169.49,30.50999999999999,450396.0,4000.0,1501.05,2021-11-01,15013.2,4000.0,11013.2,2021-10-01,0.266
11,1fcb8727-f512-4e05-912e-9b4cecd13cb0,61d67ac6-04d0-441a-809a-8f3d43b93777,NEERAJ KUMAR ,1991-01-08,Male,5b81572b-7422-405e-89a9-4af836bc3895,neerajcoo1007@live.com,ELIGIBLE,8860088676,c2a6a007-e625-456f-8c36-92cd2654c971,BGAPK1308J,2021-09-13,34624.0,Q1W4676946,loan-agreements.in/61d67ac6-04d0-441a-809a-8f3d43b93777_Q1W4676946.pdf,True,2021-09-21,355 days,2022-09-21,430e724d-e797-416d-b9f3-5718a6483cca,965.0,2021-09-25 15:44:32.241585+05:30,29.66,5.34,415488.0,1000.0,1384.7,2021-11-02,13849.6,3300.0,10549.6,2021-10-02,0.238
12,220f9bd6-1147-4b1d-a20d-bad18bdbce99,32601671-db7d-4200-97a8-1c7d2485b801,Ashok Nill,1986-03-15,Male,5b81572b-7422-405e-89a9-4af836bc3895,ashokchauhan2015@gmail.com,ELIGIBLE,8383957679,c2a6a007-e625-456f-8c36-92cd2654c971,BXRPA3743H,2021-09-25,26475.0,P4N9453094,loan-agreements.in/32601671-db7d-4200-97a8-1c7d2485b801_P4N9453094.pdf,True,2021-09-26,360 days,2022-09-26,b44dbc8e-4580-4e1a-ae7c-cabbca2ec88b,553.32,2021-09-30 12:20:23.244173+05:30,29.66,5.34,317700.0,588.32,250.04,2021-10-02,10590.0,10325.009999999998,264.9900000000016,2021-10-02,0.975
13,2810f50c-1f94-49e8-a9a8-789cedf28cdb,c92cb4a7-f59b-4158-9dba-b21f07c98ce4,Khader  Basha ,1994-05-04,Male,5b81572b-7422-405e-89a9-4af836bc3895,sageersmart143@gmail.com,ELIGIBLE,8667056083,c2a6a007-e625-456f-8c36-92cd2654c971,DSPPK7851B,2021-09-27,22551.0,8T06879774,loan-agreements.in/c92cb4a7-f59b-4158-9dba-b21f07c98ce4_8T06879774.pdf,True,2021-09-27,361 days,2022-09-27,d574e5bf-0d5c-4304-a8fd-f41bbeb5f4c8,7617.64,2021-09-27 12:27:46.817854+05:30,233.05,41.94999999999999,270612.0,7892.64,902.01,2021-11-02,9020.4,7892.64,1127.7599999999993,2021-10-02,0.875
14,2c51f255-749a-40cf-bbac-4d044cede4d1,813de78d-77c3-4a02-ae64-c3962296e7d7,Dipak  Deore,1987-06-02,Male,5b81572b-7422-405e-89a9-4af836bc3895,dipakdeore51@gmail.com,ELIGIBLE,8421304658,c2a6a007-e625-456f-8c36-92cd2654c971,AVUPD2478E,2021-09-18,17793.0,S5L4818742,loan-agreements.in/813de78d-77c3-4a02-ae64-c3962296e7d7_S5L4818742.pdf,True,2021-09-27,361 days,2022-09-27,8a905c94-d6a8-43e9-9023-e9f9fb19f8d4,5971.68,2021-09-27 14:05:21.099643+05:30,233.05,41.94999999999999,213516.0,6246.68,859.91,2021-10-02,7117.200000000001,6246.68,870.5200000000004,2021-10-02,0.878
15,35747d7e-521a-4538-9a44-e8d76b22d2c9,b346d512-4d72-4177-815a-ddb5581b48ec,NAVEEN K ,1997-08-12,Male,5b81572b-7422-405e-89a9-4af836bc3895,naveen.k5@bizsupporta.com,ELIGIBLE,9964421118,c2a6a007-e625-456f-8c36-92cd2654c971,BQIPN3016N,2021-09-05,15778.0,BUD3786468,loan-agreements.in/b346d512-4d72-4177-815a-ddb5581b48ec_BUD3786468.pdf,True,2021-09-21,355 days,2022-09-21,65bb5f80-baef-4506-8c48-1bab6b56e39f,1854.37,2021-09-30 22:29:37.509849+05:30,84.75,15.25,189336.0,1954.37,61.35,2021-10-01,6311.200000000001,6239.96,71.24000000000069,2021-10-01,0.989
16,36180007-6e04-40ef-aa5e-2c9eb064dca9,6c03f075-3642-4352-b510-952ceccf075a,AKASH  BANGWAL,1995-11-26,Male,5b81572b-7422-405e-89a9-4af836bc3895,akash.bangwal@bizsupporta.com,ELIGIBLE,8368274769,c2a6a007-e625-456f-8c36-92cd2654c971,ERLPB2458D,2021-09-17,39726.0,7873037932,loan-agreements.in/6c03f075-3642-4352-b510-952ceccf075a_7873037932.pdf,True,2021-09-27,361 days,2022-09-27,47aa44a6-0bd3-4e3c-aedf-bf824e2708be,13269.04,2021-09-27 15:09:30.910592+05:30,593.22,106.77999999999997,476712.0,13969.04,1588.89,2021-11-01,15890.400000000001,13969.04,1921.3600000000006,2021-10-01,0.879
17,3638fd1e-21eb-4578-be01-1e916ee4701f,473dc627-c4c2-4e3e-a5c5-960841c68202,SARATHKUMAR A,1995-08-24,Male,5b81572b-7422-405e-89a9-4af836bc3895,sarathkumar55555@gmail.com,ELIGIBLE,7871065356,c2a6a007-e625-456f-8c36-92cd2654c971,BWGPA7643L,2021-09-20,15299.0,WLK1140084,loan-agreements.in/473dc627-c4c2-4e3e-a5c5-960841c68202_WLK1140084.pdf,True,2021-09-24,358 days,2022-09-24,eba91ba4-5dac-4063-b248-14684aa6202e,88.0,2021-09-30 22:55:19.728851+05:30,10.17,1.83,183588.0,100.0,908.38,2021-10-02,6119.6,5200.24,919.3600000000006,2021-10-02,0.85
18,384676db-7999-425b-ba8c-749f45b4869e,765910ed-959f-4411-be1e-d7d79f35b470,AMBRISH  N P,1992-04-25,Male,5b81572b-7422-405e-89a9-4af836bc3895,ambrishnp13@gmail.com,ELIGIBLE,9590804017,c2a6a007-e625-456f-8c36-92cd2654c971,CKRPA9737P,2021-09-26,13283.0,IJX4492963,loan-agreements.in/765910ed-959f-4411-be1e-d7d79f35b470_IJX4492963.pdf,True,2021-09-26,360 days,2022-09-26,83ca58da-c1c1-4256-8cb6-d76b8291cf2e,965.0,2021-09-27 00:12:00.946952+05:30,29.66,5.34,159396.0,1000.0,4303.34,2021-10-02,5313.200000000001,1000.0,4313.200000000001,2021-10-02,0.188
19,3a22c53f-ec91-417f-a9f2-234065f590fd,aea5c463-bbfa-4c5b-ba4b-cf50b2a02de3,SOURAV BISWAS ,1993-09-03,Male,5b81572b-7422-405e-89a9-4af836bc3895,sourav.biswas@bizsupporta.com,ELIGIBLE,9126373434,c2a6a007-e625-456f-8c36-92cd2654c971,AZWPB1561G,2021-09-01,17271.0,0L78716046,loan-agreements.in/aea5c463-bbfa-4c5b-ba4b-cf50b2a02de3_0L78716046.pdf,True,2021-09-21,355 days,2022-09-21,c1e9e8e1-8c8f-4c03-a2b9-b1cbdbbc8f35,188.0,2021-09-24 17:52:21.852293+05:30,10.17,1.83,207252.0,200.0,690.62,2021-11-01,6908.400000000001,300.0,6608.400000000001,2021-10-01,0.043
20,3efa638d-06b8-4d7a-8c3f-8893517f3505,5036f3d0-9e2d-430c-8dcc-38fc1d5f19e8,Supriyo BISWAS,1996-07-28,Male,5b81572b-7422-405e-89a9-4af836bc3895,supriyo.biswas@bizsupporta.com,ELIGIBLE,9775447774,c2a6a007-e625-456f-8c36-92cd2654c971,DBKPB9202B,2021-09-24,15186.0,V1S6781054,loan-agreements.in/5036f3d0-9e2d-430c-8dcc-38fc1d5f19e8_V1S6781054.pdf,True,2021-09-24,358 days,2022-09-24,8df2cf40-345f-44bd-bc3b-ff13c2224e45,1227.09,2021-09-29 20:15:14.457982+05:30,50.85,9.149999999999999,182232.0,1287.09,607.39,2021-11-03,6074.400000000001,5787.09,287.3100000000004,2021-10-03,0.953
21,40072ae4-5fca-4e78-a9ac-e7bb9472899d,e7cb71c8-b2e5-4865-afed-32b01cb02d65,ASHRAF HUSSAIN ,1972-08-21,Male,5b81572b-7422-405e-89a9-4af836bc3895,QS2192113@gmail.com,ELIGIBLE,9342228494,c2a6a007-e625-456f-8c36-92cd2654c971,BLRPS6002F,2021-09-09,24830.0,YHS3387873,loan-agreements.in/e7cb71c8-b2e5-4865-afed-32b01cb02d65_YHS3387873.pdf,True,2021-09-27,361 days,2022-09-27,1733308e-d45a-4d0b-ac9e-31940d967f72,482.0,2021-09-30 07:07:31.853688+05:30,15.25,2.75,297960.0,500.0,993.02,2021-11-01,9932.0,2700.0,7232.0,2021-10-01,0.272
22,406ec944-cafe-492f-ba84-5ce7b0f38080,be992edd-65d8-4c5c-abe5-b9824896a3ff,KIRANKUMAR N BORAWAT ,1993-04-02,Male,5b81572b-7422-405e-89a9-4af836bc3895,borawat1993@gmail.com,ELIGIBLE,7899456038,c2a6a007-e625-456f-8c36-92cd2654c971,CALPB3821R,2021-09-13,30576.0,WBL6216420,loan-agreements.in/be992edd-65d8-4c5c-abe5-b9824896a3ff_WBL6216420.pdf,True,2021-09-21,355 days,2022-09-21,b5e79ad6-1cfa-48fd-b81f-0e5e80d02703,7996.2,2021-09-21 13:00:53.580789+05:30,233.05,41.94999999999999,366912.0,8271.199999999999,1222.84,2021-11-04,12230.400000000001,8271.199999999999,3959.2000000000025,2021-10-04,0.676
23,4232ad76-a323-4ea3-b5dc-5d2de551c72d,80683cab-89fc-43c5-9c3e-a5df4bcd68f7,Hareshbhai Shankarbhai Rohit ,1984-09-09,Male,5b81572b-7422-405e-89a9-4af836bc3895,HARISH143.HR59@GMAIL.COM,ELIGIBLE,9714441747,c2a6a007-e625-456f-8c36-92cd2654c971,ALLPR6707M,2021-09-02,12385.0,SB27645492,loan-agreements.in/80683cab-89fc-43c5-9c3e-a5df4bcd68f7_SB27645492.pdf,True,2021-09-15,349 days,2022-09-15,b1d6ecd6-1699-43bb-ac13-3be7fb41aaa8,477.36,2021-10-01 08:52:05.350572+05:30,15.25,2.75,148620.0,495.36,0.0,2021-11-02,4954.0,4712.8,241.19999999999982,2021-10-02,0.951
24,499e53d3-d18c-4df0-bf2f-8f2af208a4ac,4de46127-2506-455f-b812-41f13ac62dcb,BABY  C S ,1985-06-15,Female,5b81572b-7422-405e-89a9-4af836bc3895,baby.baby@bizsupporta.com,ELIGIBLE,7411197570,c2a6a007-e625-456f-8c36-92cd2654c971,ICQPS0901C,2021-09-13,18584.0,FKO3350842,loan-agreements.in/4de46127-2506-455f-b812-41f13ac62dcb_FKO3350842.pdf,True,2021-09-18,352 days,2022-09-18,564e9f9d-ae06-4407-a85d-cc450f241868,965.0,2021-09-18 08:50:58.403613+05:30,29.66,5.34,223008.0,1000.0,6422.95,2021-10-01,7433.6,1000.0,6433.6,2021-10-01,0.135
25,548e9c71-9a76-431e-b415-255c0d60635e,b36c822c-cb00-442c-b3c7-c66b9203eeda,GAGAN S ,1998-04-21,Male,5b81572b-7422-405e-89a9-4af836bc3895,gagan.sirakaje@gmail.com,ELIGIBLE,9901235042,c2a6a007-e625-456f-8c36-92cd2654c971,BXNPG5795D,2021-09-09,21841.0,Q477514759,loan-agreements.in/b36c822c-cb00-442c-b3c7-c66b9203eeda_Q477514759.pdf,True,2021-09-15,349 days,2022-09-15,adc33ef9-f4c3-4ff6-84c0-aec6e6f69ad6,965.0,2021-09-28 18:03:00.966905+05:30,29.66,5.34,262092.0,1000.0,873.5,2021-11-04,8736.4,6600.0,2136.3999999999996,2021-10-04,0.755
26,556b2098-c9a0-4ca9-976f-d9f0336d64bc,7d929f92-7d68-4f1f-bf6a-1ca9502e1b55,Rahul GAIKWAD,1992-11-17,Male,5b81572b-7422-405e-89a9-4af836bc3895,rgaikwad191@gmail.com,ELIGIBLE,9967180150,c2a6a007-e625-456f-8c36-92cd2654c971,BAMPG1141H,2021-09-23,27958.0,WGE6043222,loan-agreements.in/7d929f92-7d68-4f1f-bf6a-1ca9502e1b55_WGE6043222.pdf,True,2021-09-24,358 days,2022-09-24,5a9d3710-1349-4bce-af18-3fb6d7aa27ec,2414.3,2021-09-27 00:40:32.882692+05:30,84.75,15.25,335496.0,2514.3,1118.3,2021-11-04,11183.2,9514.3,1668.9000000000015,2021-10-04,0.851
27,55760325-4e0f-4187-b46a-5b596fe109c3,1abae707-2484-4f65-bed2-1445f428afa8,SATISH SHUKLA ,1970-01-01,Male,5b81572b-7422-405e-89a9-4af836bc3895,satishshukla485@gmail.com,ELIGIBLE,9625993309,c2a6a007-e625-456f-8c36-92cd2654c971,EMVPS3421J,2021-09-13,11711.0,XE40019664,loan-agreements.in/1abae707-2484-4f65-bed2-1445f428afa8_XE40019664.pdf,True,2021-09-21,355 days,2022-09-21,a4021e9f-941c-42ae-9701-23d0a710a9c5,745.48,2021-09-26 13:45:13.214969+05:30,29.66,5.34,140532.0,780.48,721.94,2021-10-02,4684.400000000001,3954.43,729.9700000000007,2021-10-02,0.844
28,5ca9b329-33da-4571-b384-f9a71de0a641,89a1075f-847f-456b-b7e3-04505160c361,ALOK RAJ ,1998-12-18,Male,5b81572b-7422-405e-89a9-4af836bc3895,alokraj8945@gmail.com,ELIGIBLE,6203263061,c2a6a007-e625-456f-8c36-92cd2654c971,DTJPR0977L,2021-09-13,11006.0,R9V5228297,loan-agreements.in/89a1075f-847f-456b-b7e3-04505160c361_R9V5228297.pdf,True,2021-09-17,351 days,2022-09-17,127720c5-93ca-4f21-8f6a-bd9550ba1289,1446.33,2021-09-27 20:24:04.994376+05:30,50.85,9.149999999999999,132072.0,1506.33,440.06,2021-11-01,4402.400000000001,3859.45,542.9500000000007,2021-10-01,0.877
29,5feaca15-f45f-4ede-814c-e5499699f52e,4ea4723a-6eaa-49d8-a9a1-403c4a6baf14,MANMOHAN SINGH,1985-07-11,male,5b81572b-7422-405e-89a9-4af836bc3895,Myaim2013@gmail.com,ELIGIBLE,9785005828,c2a6a007-e625-456f-8c36-92cd2654c971,BLIPS9313N,2021-09-28,26831.0,Z7H3923541,loan-agreements.in/4ea4723a-6eaa-49d8-a9a1-403c4a6baf14_Z7H3923541.pdf,True,2021-09-30,364 days,2022-09-30,a46f1245-e4cc-4c06-9e0e-7ffbd2278927,8725.0,2021-09-30 18:47:48.113380+05:30,233.05,41.94999999999999,321972.0,9000.0,1073.08,2021-11-02,10732.400000000001,9000.0,1732.4000000000015,2021-10-02,0.839
30,61afd93c-d3e1-49dd-8098-9613f8311579,04f0a15a-ce51-4be9-8e10-2ebab703f2f0,Gopal Behera,1986-07-05,Male,5b81572b-7422-405e-89a9-4af836bc3895,QS1963114@gmail.com,ELIGIBLE,7735762261,c2a6a007-e625-456f-8c36-92cd2654c971,BXZPB4142B,2021-09-29,4819.0,44U2888995,loan-agreements.in/04f0a15a-ce51-4be9-8e10-2ebab703f2f0_44U2888995.pdf,True,2021-09-29,363 days,2022-09-29,9dc0e62f-8ce7-4e92-aef0-f3cc1a05aabc,965.0,2021-09-29 11:08:44.029097+05:30,29.66,5.34,57828.0,1000.0,924.04,2021-10-02,1927.6000000000001,1000.0,927.6000000000001,2021-10-02,0.519
31,61d3dc55-3321-4a65-b6b4-b415d0202030,4c25453b-0b63-43b4-8019-e284f2f18d79,Taufeeq Pasha ,2002-09-27,Male,5b81572b-7422-405e-89a9-4af836bc3895,taufeeqpasha77@gmail.com,ELIGIBLE,7795343472,c2a6a007-e625-456f-8c36-92cd2654c971,FXKPP8928J,2021-09-01,17500.0,GKT1569154,loan-agreements.in/4c25453b-0b63-43b4-8019-e284f2f18d79_GKT1569154.pdf,True,2021-09-01,335 days,2022-09-01,18f06518-307a-46a7-a56f-a3dc20d6dfac,865.0,2021-09-29 13:45:16.860218+05:30,29.66,5.34,210000.0,900.0,688.16,2021-10-01,7000.0,6300.52,699.4799999999996,2021-10-01,0.9
32,62698cf1-745e-4088-84d9-483ff97397cc,d17e1e22-72f9-4dc9-82ce-1be7090fa34d,Santhosh Kumar M M,1984-03-12,Male,5b81572b-7422-405e-89a9-4af836bc3895,santho888@gmail.com,ELIGIBLE,8105939032,c2a6a007-e625-456f-8c36-92cd2654c971,CLRPS0341C,2021-09-21,24539.0,EM21769509,loan-agreements.in/d17e1e22-72f9-4dc9-82ce-1be7090fa34d_EM21769509.pdf,True,2021-09-23,357 days,2022-09-23,24a14254-fc53-4eab-90be-884102d89a4b,188.0,2021-09-30 19:25:19.603226+05:30,10.17,1.83,294468.0,200.0,401.4,2021-10-02,9815.6,9400.0,415.60000000000036,2021-10-02,0.958
33,63539fcb-5f2b-4df2-a587-588e124b1a71,7bdccde7-ee27-478c-984e-9f1454f1c4d5,Vishal Verma,1996-03-02,Male,5b81572b-7422-405e-89a9-4af836bc3895,vishal.verma4@bizsupporta.com,ELIGIBLE,7979882056,c2a6a007-e625-456f-8c36-92cd2654c971,AWIPV3150E,2021-09-21,15477.0,L2B7588077,loan-agreements.in/7bdccde7-ee27-478c-984e-9f1454f1c4d5_L2B7588077.pdf,True,2021-09-21,355 days,2022-09-21,2c7105c6-da7b-49b1-ae35-f26b711a8062,437.59,2021-09-29 17:30:45.341699+05:30,15.25,2.75,185724.0,455.59,300.86,2021-10-01,6190.8,5879.66,311.1400000000003,2021-10-01,0.95
34,6c8dfbbd-4d96-4b5e-90e5-8cf7c92bd603,3d6ab349-abad-4b78-a21c-aa6b9e708682,Syed Ateeq  Pasha,1996-06-11,Male,5b81572b-7422-405e-89a9-4af836bc3895,syedlg863@gmail.com,ELIGIBLE,9008771620,c2a6a007-e625-456f-8c36-92cd2654c971,HADPS7198D,2021-09-18,24966.0,QCR7690970,loan-agreements.in/3d6ab349-abad-4b78-a21c-aa6b9e708682_QCR7690970.pdf,True,2021-09-26,360 days,2022-09-26,911d263d-3ddc-4a59-a312-056a792c9715,1700.0,2021-09-29 11:28:05.428798+05:30,84.75,15.25,299592.0,1800.0,998.49,2021-11-02,9986.400000000001,3560.0,6426.4000000000015,2021-10-02,0.356
35,77b512c9-04f0-4a6d-848e-ec8064f62f92,e20c6cd1-bcf2-4533-a905-72f9d4610c25,RAJESH  R,1980-07-05,Male,5b81572b-7422-405e-89a9-4af836bc3895,QS2203581@gmail.com,ELIGIBLE,9567783381,c2a6a007-e625-456f-8c36-92cd2654c971,CHQPR8667B,2021-09-26,24972.0,IVS3553385,loan-agreements.in/e20c6cd1-bcf2-4533-a905-72f9d4610c25_IVS3553385.pdf,True,2021-09-26,360 days,2022-09-26,cd6b18d2-dd73-47c3-9f1f-cc41aa0dd7e5,328.8,2021-09-30 12:17:35.122803+05:30,15.25,2.75,299664.0,346.8,235.82,2021-10-01,9988.800000000001,9663.14,325.6600000000017,2021-10-01,0.967
36,7ad04836-6186-4e6a-bb9e-96e48c76c898,6df97eb1-a9a3-4a4f-9776-bca5dc3a23c1,Ashish Gunjal,1992-03-24,Male,5b81572b-7422-405e-89a9-4af836bc3895,QS2179030@gmail.com,ELIGIBLE,9511959511,c2a6a007-e625-456f-8c36-92cd2654c971,AUQPG1942D,2021-09-22,12000.0,E9X2733684,loan-agreements.in/6df97eb1-a9a3-4a4f-9776-bca5dc3a23c1_E9X2733684.pdf,True,2021-09-23,357 days,2022-09-23,c6ed7e95-48e0-4a6c-a4fa-f16c713e301d,904.63,2021-09-29 07:11:56.959598+05:30,29.66,5.34,144000.0,939.63,146.6,2021-09-30,4800.0,4964.68,-164.6800000000003,2021-09-30,1.034
37,7bb49fc9-8d2f-4252-9e04-b6bd6d476171,ebed57ca-068a-4064-9da2-a838bda3aeed,Kavadi Pruthvi Raj,1987-02-16,male,5b81572b-7422-405e-89a9-4af836bc3895,pruthve.shetty@gmail.com,ELIGIBLE,9632204198,c2a6a007-e625-456f-8c36-92cd2654c971,BBFPK7168C,2021-09-25,69770.0,FA71131601,loan-agreements.in/ebed57ca-068a-4064-9da2-a838bda3aeed_FA71131601.pdf,True,2021-09-26,360 days,2022-09-26,a4e076cc-f0fb-4021-9017-8d3f858c1ddd,20700.0,2021-09-26 13:30:01.669661+05:30,593.22,106.77999999999997,837240.0,21400.0,6468.44,2021-10-01,27908.0,21400.0,6508.0,2021-10-01,0.767
38,7d9181b2-c8b3-4474-a1fe-8ef22af6062c,a7ef96f5-f8ec-4ac8-bb58-53da5409d27b,SUMIT GOGATE ,1992-05-25,Male,5b81572b-7422-405e-89a9-4af836bc3895,sumit.gogate@bizsupporta.com,ELIGIBLE,7900142970,c2a6a007-e625-456f-8c36-92cd2654c971,CFUPG9484F,2021-09-09,15080.0,SX59511294,loan-agreements.in/a7ef96f5-f8ec-4ac8-bb58-53da5409d27b_SX59511294.pdf,True,2021-09-24,358 days,2022-09-24,6e7f788f-f6e8-45c8-9596-daf4102b5144,4490.56,2021-09-24 14:16:53.906656+05:30,169.49,30.50999999999999,180960.0,4690.56,603.07,2021-11-02,6032.0,4690.56,1341.4399999999996,2021-10-02,0.778
39,7e464c6e-ca90-4c29-b53d-10070c227e49,438669ca-9474-480e-9f16-2a89d918bf35,Sourabh Verma,1990-07-15,Male,5b81572b-7422-405e-89a9-4af836bc3895,Sourabh.Verma1@vodafoneidea.com,ELIGIBLE,9911004841,c2a6a007-e625-456f-8c36-92cd2654c971,DKGPS3495Q,2021-09-22,19954.0,M881753286,loan-agreements.in/438669ca-9474-480e-9f16-2a89d918bf35_M881753286.pdf,True,2021-09-25,359 days,2022-09-25,0080a485-3a3b-4313-b7d5-c77c6f1d1f3e,88.0,2021-09-25 11:38:26.198648+05:30,10.17,1.83,239448.0,100.0,7869.39,2021-10-02,7981.6,100.0,7881.6,2021-10-02,0.013
40,83699db9-9467-436c-b0b6-a19620d3bf24,5d5b80ce-8b58-438d-b6aa-772f6b05d659,Dharmendra Kachhi ,1988-12-20,Male,5b81572b-7422-405e-89a9-4af836bc3895,dharmendra090@gmail.com,ELIGIBLE,9131467769,c2a6a007-e625-456f-8c36-92cd2654c971,CVAPK3863Q,2021-09-08,39542.0,5YG4066443,loan-agreements.in/5d5b80ce-8b58-438d-b6aa-772f6b05d659_5YG4066443.pdf,True,2021-09-28,362 days,2022-09-28,f048a288-7cde-4046-b147-01a6633ebd2b,13620.52,2021-09-28 10:21:53.853669+05:30,593.22,106.77999999999997,474504.0,14320.52,1581.4,2021-11-01,15816.800000000001,14320.52,1496.2800000000007,2021-10-01,0.905
41,89c107a7-0050-4ddf-9390-7512defded3a,0bb85e4b-cf36-40c1-ae86-1334c5e743e0,DEEPAK  Yh,1990-01-01,Male,5b81572b-7422-405e-89a9-4af836bc3895,2001505452@gmail.com,ELIGIBLE,9019252271,c2a6a007-e625-456f-8c36-92cd2654c971,AOAPH2074M,2021-09-27,19767.0,L2K2988143,loan-agreements.in/0bb85e4b-cf36-40c1-ae86-1334c5e743e0_L2K2988143.pdf,True,2021-09-28,362 days,2022-09-28,87dc8c0d-3e36-4501-9217-5656ccf044ff,965.0,2021-09-28 10:37:12.665946+05:30,29.66,5.34,237204.0,1000.0,7421.66,2021-09-30,7906.8,1000.0,6906.8,2021-09-30,0.126
42,8f45febd-3eb9-4640-a2ff-4e7d10104a48,a163fd61-e5cd-4e38-b529-c68e5b46d791,Ruthipakam Prashanth ,1990-01-01,Male,5b81572b-7422-405e-89a9-4af836bc3895,QS1593229@gmail.com,ELIGIBLE,6281853527,c2a6a007-e625-456f-8c36-92cd2654c971,DVGPR5250F,2021-09-13,18140.0,AA57410031,loan-agreements.in/a163fd61-e5cd-4e38-b529-c68e5b46d791_AA57410031.pdf,True,2021-09-21,355 days,2022-09-21,f22d3b33-1149-4a46-a107-3285715399cc,690.47,2021-10-01 14:51:09.049409+05:30,29.66,5.34,217680.0,725.47,0.0,2021-11-01,7256.0,7801.969999999999,-545.9699999999993,2021-10-01,1.075
43,91a90e52-8f69-43fd-a2c5-62ee6db6d036,16b34904-8d1b-4181-9a07-5f3d346dd43c,Pooja Kalpeshbhai Kahar,1990-01-01,Female,5b81572b-7422-405e-89a9-4af836bc3895,QS1699229@gmail.com,ELIGIBLE,9574572345,c2a6a007-e625-456f-8c36-92cd2654c971,GQEPK6535A,2021-09-21,12130.0,UD73777409,loan-agreements.in/16b34904-8d1b-4181-9a07-5f3d346dd43c_UD73777409.pdf,True,2021-09-21,355 days,2022-09-21,8e9ac612-b297-4c81-8489-4de26c5c69bd,176.61,2021-09-30 21:45:19.243892+05:30,10.17,1.83,145560.0,188.61,484.99,2021-11-02,4852.0,4784.03,67.97000000000025,2021-10-02,0.986
44,96668b23-52d2-4727-9d72-fb3948b09bff,6d2ec04b-8758-48db-a28a-9163fa50932f,SAJJAD KHAN,1995-01-29,Male,5b81572b-7422-405e-89a9-4af836bc3895,khansajjad555@gmail.com,ELIGIBLE,9986281688,c2a6a007-e625-456f-8c36-92cd2654c971,JNSPK2737Q,2021-09-25,20000.0,59I0692901,loan-agreements.in/6d2ec04b-8758-48db-a28a-9163fa50932f_59I0692901.pdf,True,2021-09-30,364 days,2022-09-30,acf678bb-9766-4495-87ce-4db3651b8d8f,764.77,2021-10-01 10:18:29.837602+05:30,29.66,5.34,240000.0,799.77,0.0,2021-11-01,8000.0,6499.77,1500.2299999999996,2021-10-01,0.812
45,99466234-78a4-4c1c-8e72-3350616ce138,0800091c-b118-43b9-8d22-974dd21ead26,SHAIKH SARWAR SHAIKH MABUD,1995-08-27,Male,5b81572b-7422-405e-89a9-4af836bc3895,shaikh.mabud@bizsupporta.com,ELIGIBLE,9588430726,c2a6a007-e625-456f-8c36-92cd2654c971,IANPS3011J,2021-09-22,14947.0,F3C0172652,loan-agreements.in/0800091c-b118-43b9-8d22-974dd21ead26_F3C0172652.pdf,True,2021-09-30,364 days,2022-09-30,edfd16ca-2daf-48da-9326-9a171a1b33ea,5576.5,2021-09-30 15:03:52.480558+05:30,233.05,41.94999999999999,179364.0,5851.5,116.2,2021-10-01,5978.8,5851.5,127.30000000000018,2021-10-01,0.979
46,99b01870-741e-42e6-a3d5-e4995d503aeb,8ecc9ed1-7181-41ac-abf1-330adb204f32,MANOJ PRIYADHARSAN PAULRAJ ,1990-01-01,Male,5b81572b-7422-405e-89a9-4af836bc3895,QS2025447@gmail.com,ELIGIBLE,6383378966,c2a6a007-e625-456f-8c36-92cd2654c971,ENLPM4365Q,2021-09-12,24743.0,YEY7526509,loan-agreements.in/8ecc9ed1-7181-41ac-abf1-330adb204f32_YEY7526509.pdf,True,2021-09-21,355 days,2022-09-21,ad1e5196-3344-4608-8088-88eecbef7b6b,1440.0,2021-09-29 20:06:11.741080+05:30,50.85,9.149999999999999,296916.0,1500.0,616.57,2021-10-03,9897.2,9265.36,631.8400000000001,2021-10-03,0.936
47,9b2bd2d6-8c05-460c-9a0c-d0c99c50e923,81fb7eba-dffc-4f91-b59d-c19fb9cdc59a,ANANTHA KRISHNAN R ,1981-06-04,Male,5b81572b-7422-405e-89a9-4af836bc3895,a-anantha.krishnan1@industowers.com,ELIGIBLE,8508822000,c2a6a007-e625-456f-8c36-92cd2654c971,ARSPA5076D,2021-09-08,40306.0,B0T9382621,loan-agreements.in/81fb7eba-dffc-4f91-b59d-c19fb9cdc59a_B0T9382621.pdf,True,2021-09-08,342 days,2022-09-08,b2f5bfee-7b8a-4197-b11d-123fafc93404,2800.0,2021-09-08 17:11:09.708396+05:30,169.49,30.50999999999999,483672.0,3000.0,14174.66,2021-09-29,16122.400000000001,3000.0,13122.400000000001,2021-09-29,0.186
48,9b4145c8-f16d-4b18-a0f2-32b065129370,0be0255e-a81b-4c49-8139-2bfef7717c15,GANESH R ,1984-03-20,Male,5b81572b-7422-405e-89a9-4af836bc3895,ganesh.r2@vodafoneidea.com,ELIGIBLE,9884400448,c2a6a007-e625-456f-8c36-92cd2654c971,BKZPG4064Q,2021-09-01,33066.0,SM79682327,loan-agreements.in/0be0255e-a81b-4c49-8139-2bfef7717c15_SM79682327.pdf,True,2021-09-21,355 days,2022-09-21,251834ca-c963-4231-af7d-ad8bbbda7121,1900.0,2021-09-28 19:10:34.527259+05:30,84.75,15.25,396792.0,2000.0,4206.59,2021-10-03,13226.400000000001,9000.0,4226.4000000000015,2021-10-03,0.68
49,9b83ea46-923d-486d-aaf4-c85e7addc306,697d8a20-7dff-4761-a4e2-c1b93e86b8db,GANESH ANANT  THUKRUL ,1984-02-29,Male,5b81572b-7422-405e-89a9-4af836bc3895,ganesh.thukrul@uhcpindia.com,ELIGIBLE,9819939438,c2a6a007-e625-456f-8c36-92cd2654c971,AICPT5184G,2021-09-06,29605.0,M9K2959808,loan-agreements.in/697d8a20-7dff-4761-a4e2-c1b93e86b8db_M9K2959808.pdf,True,2021-09-16,342 days,2022-09-08,06115823-fae9-4d4e-94a0-ec330d4f5d8f,565.0,2021-09-20 10:07:07.199246+05:30,29.66,5.34,355260.0,600.0,1183.96,2021-11-01,11842.0,2300.0,9542.0,2021-10-01,0.194
50,9d8c3008-a89d-4c89-a1df-e9da1302d1f3,647651cf-be9b-4df7-95ac-09887002f5e0,Suresh Gandla,1997-04-06,Male,5b81572b-7422-405e-89a9-4af836bc3895,sureshclu556@gmail.com,ELIGIBLE,8790621556,c2a6a007-e625-456f-8c36-92cd2654c971,BRLPG6366E,2021-09-28,9574.0,3FY8373054,loan-agreements.in/647651cf-be9b-4df7-95ac-09887002f5e0_3FY8373054.pdf,True,2021-09-29,363 days,2022-09-29,b4946e78-4dbc-4227-8796-32d99f8a7e2c,364.75,2021-10-01 12:08:11.761739+05:30,15.25,2.75,114888.0,382.75,74.42,2021-10-02,3829.6000000000004,4130.53,-300.9299999999994,2021-10-02,1.079
51,9ddc97bb-8e65-4ae2-ba80-90a7a2d30897,1377cb05-d34e-4e12-b57b-1a207ca1685e,DEEPAK GOSAIN,1989-12-04,male,5b81572b-7422-405e-89a9-4af836bc3895,deepg20@gmail.com,ELIGIBLE,9999165854,c2a6a007-e625-456f-8c36-92cd2654c971,BCCPG5520L,2021-09-27,33688.0,HZV0210473,loan-agreements.in/1377cb05-d34e-4e12-b57b-1a207ca1685e_HZV0210473.pdf,True,2021-09-27,361 days,2022-09-27,1a470cb1-68e5-4b0e-a883-70fda3d28be5,11219.54,2021-09-27 19:04:59.866447+05:30,593.22,106.77999999999997,404256.0,11919.54,1347.26,2021-11-01,13475.2,11919.54,1555.6599999999999,2021-10-01,0.885
52,a904cb17-55fd-4235-8d24-758c800daf6c,4edb37e4-555e-4a7d-b37e-1286f276f90f,Devang  Parekh,1990-01-01, MALE ,5b81572b-7422-405e-89a9-4af836bc3895,2001167989@gmail.com,ELIGIBLE,9737112023,c2a6a007-e625-456f-8c36-92cd2654c971,DNZPP5597Q,2021-09-22,72691.0,ULN0349214,loan-agreements.in/4edb37e4-555e-4a7d-b37e-1286f276f90f_ULN0349214.pdf,True,2021-09-22,356 days,2022-09-22,d9fd91d9-24b8-4f2d-9c81-45235b3f2671,2200.0,2021-09-29 19:40:47.823298+05:30,84.75,15.25,872292.0,2300.0,6733.22,2021-10-01,29076.4,22300.0,6776.4000000000015,2021-10-01,0.767
53,ad3a3cd4-b65f-4c4f-926b-7d45f3e555b4,eb7ca3dc-4d13-4651-a8e5-be7547242e72,NANDEESH  H M,1999-05-22,Male,5b81572b-7422-405e-89a9-4af836bc3895,nandeesh.m@bizsupporta.com,ELIGIBLE,7760570046,c2a6a007-e625-456f-8c36-92cd2654c971,BZRPN9899M,2021-09-21,23062.0,UQN5277878,loan-agreements.in/eb7ca3dc-4d13-4651-a8e5-be7547242e72_UQN5277878.pdf,True,2021-09-22,356 days,2022-09-22,651e5cf4-545d-41e7-943e-037ab13f8aab,6233.49,2021-09-22 09:52:15.277233+05:30,233.05,41.94999999999999,276744.0,6508.49,2703.33,2021-10-01,9224.800000000001,6508.49,2716.3100000000013,2021-10-01,0.706
54,ae42d5f9-35de-4c66-8a12-edcb7e7af5fd,848b36b0-ada4-4b52-bcd1-53424cca2bc8,Enayathulla Khan ,1976-06-30,Male,5b81572b-7422-405e-89a9-4af836bc3895,enayathullakhan14@gmail.com,ELIGIBLE,9986290333,c2a6a007-e625-456f-8c36-92cd2654c971,AASPE0168K,2021-09-01,30000.0,7WO1420795,loan-agreements.in/848b36b0-ada4-4b52-bcd1-53424cca2bc8_7WO1420795.pdf,True,2021-09-15,349 days,2022-09-15,d340178b-dd87-4932-9d8a-96379af31bc8,3000.0,2021-09-30 18:36:06.022434+05:30,169.49,30.50999999999999,360000.0,3200.0,2681.41,2021-10-01,12000.0,9300.0,2700.0,2021-10-01,0.775
55,b14016e6-6f44-4570-91d9-19db84800f6c,872b5b0f-cfdf-4965-a09c-47953ce60c47,Raghavendra N,1989-10-26,Male,5b81572b-7422-405e-89a9-4af836bc3895,QS2122766@gmail.com,ELIGIBLE,8792289754,c2a6a007-e625-456f-8c36-92cd2654c971,BIEPN6250N,2021-09-25,13283.0,G3R0446153,loan-agreements.in/872b5b0f-cfdf-4965-a09c-47953ce60c47_G3R0446153.pdf,True,2021-09-25,359 days,2022-09-25,9f8266ef-7804-4d7d-aeea-bf28764d7ef2,702.6,2021-09-29 21:38:44.567254+05:30,29.66,5.34,159396.0,737.6,531.07,2021-11-02,5313.200000000001,5074.68,238.52000000000044,2021-10-02,0.955
56,b16b45b2-26ee-4a91-a233-50262bcda1a6,3fafdf50-2e6d-40ba-bd02-c3ebe958fefd,CHRISTY DAVID ,1997-03-28,Male,5b81572b-7422-405e-89a9-4af836bc3895,christiedavid420@gmail.com,ELIGIBLE,8301836741,c2a6a007-e625-456f-8c36-92cd2654c971,FPKPD0803N,2021-09-08,16500.0,ZDG1525943,loan-agreements.in/3fafdf50-2e6d-40ba-bd02-c3ebe958fefd_ZDG1525943.pdf,True,2021-09-25,359 days,2022-09-25,4d74d4b7-6fdb-48cb-964b-864232ee6d36,482.0,2021-09-30 12:09:21.007579+05:30,15.25,2.75,198000.0,500.0,659.8,2021-11-01,6600.0,2000.0,4600.0,2021-10-01,0.303
57,b96445e5-5ce3-4281-a355-71c77f0c24e1,6d99944f-ef98-45b1-a975-540e165badfb,DEEPAK KUMAR ,1994-04-11,Male,5b81572b-7422-405e-89a9-4af836bc3895,deepak.kumar1@bizsupporta.com,ELIGIBLE,7503456707,c2a6a007-e625-456f-8c36-92cd2654c971,CPDPK7247B,2021-09-08,22886.0,VIE6550667,loan-agreements.in/6d99944f-ef98-45b1-a975-540e165badfb_VIE6550667.pdf,True,2021-09-20,354 days,2022-09-20,c482884b-0081-487f-8c58-55754d251550,4800.0,2021-09-20 22:53:40.552332+05:30,169.49,30.50999999999999,274632.0,5000.0,4139.92,2021-10-01,9154.4,5000.0,4154.4,2021-10-01,0.546
58,ba1f1026-e586-414a-a3e8-dd8ad58c46b0,7a319ee3-3b3c-463d-a67a-7828d75aaba0,POTURAJU CHINNA ,1993-06-18,Male,5b81572b-7422-405e-89a9-4af836bc3895,CHINNA.P286@GMAIL.COM,ELIGIBLE,8179700301,c2a6a007-e625-456f-8c36-92cd2654c971,BAWPC8953M,2021-09-02,22003.0,KFQ2623633,loan-agreements.in/7a319ee3-3b3c-463d-a67a-7828d75aaba0_KFQ2623633.pdf,True,2021-09-26,347 days,2022-09-13,3fdc1cbd-5d63-444e-8eb3-549542302d5c,7093.66,2021-09-26 08:34:27.925843+05:30,233.05,41.94999999999999,264036.0,7368.66,879.84,2021-11-02,8801.2,7368.66,1432.5400000000009,2021-10-02,0.837
59,bfa88dad-56cd-4c0e-84c9-b70eb6077210,7759e8c2-1a5d-45f9-ba48-25c57744cbff,TAPASYABATA BIKASH PADHAN,1996-05-11,Male,5b81572b-7422-405e-89a9-4af836bc3895,QS1943489@gmail.com,ELIGIBLE,7681000232,c2a6a007-e625-456f-8c36-92cd2654c971,DECPP1969E,2021-09-26,12832.0,K6Q7316645,loan-agreements.in/7759e8c2-1a5d-45f9-ba48-25c57744cbff_K6Q7316645.pdf,True,2021-09-26,360 days,2022-09-26,386f627d-0a19-4599-8fea-ded4ab1f6ced,506.73,2021-09-29 21:19:55.899434+05:30,29.66,5.34,153984.0,541.73,228.1,2021-10-02,5132.8,4896.93,235.8699999999999,2021-10-02,0.954
60,c147c69b-4190-45bf-9338-b10064d60c76,16ee7d32-f8eb-4228-b9cb-f4a1de6eff37,AMAN SRIVASTAVA ,1997-06-21,Male,5b81572b-7422-405e-89a9-4af836bc3895,amansinha99@gmail.com,ELIGIBLE,9304536807,c2a6a007-e625-456f-8c36-92cd2654c971,HCEPS4377H,2021-09-09,9692.0,OZG8977373,loan-agreements.in/16ee7d32-f8eb-4228-b9cb-f4a1de6eff37_OZG8977373.pdf,True,2021-09-14,348 days,2022-09-14,69653005-0b44-4649-bc65-5f6b94c6df86,382.0,2021-09-27 20:41:19.955509+05:30,15.25,2.75,116304.0,400.0,445.29,2021-10-02,3876.8,3425.8,451.0,2021-10-02,0.884
61,c4e9c08e-f866-430a-afed-fd36bba4a935,fa89c1c0-7502-4112-92f2-de62345cb8dc,BASAVARAJU S ,1989-07-06,Male,5b81572b-7422-405e-89a9-4af836bc3895,basavaraju.s@bizsupporta.com,ELIGIBLE,9844744055,c2a6a007-e625-456f-8c36-92cd2654c971,CCQPB0418M,2021-09-11,16563.0,QJO2595805,loan-agreements.in/fa89c1c0-7502-4112-92f2-de62345cb8dc_QJO2595805.pdf,True,2021-09-22,356 days,2022-09-22,96668c18-a4b4-4a51-9f94-017efed84cf1,288.0,2021-09-30 09:35:38.553161+05:30,10.17,1.83,198756.0,300.0,662.4,2021-11-01,6625.200000000001,6362.8,262.40000000000055,2021-10-01,0.96
62,d409ff3a-e0b2-4c66-84c0-ebfd0fa0b8f6,e9720552-2bb9-4b23-9de8-c5b47f54788a,VIKAS  GUPTA,1996-01-31,Male,5b81572b-7422-405e-89a9-4af836bc3895,vikas.gupta2@bizsupporta.com,ELIGIBLE,8076197976,c2a6a007-e625-456f-8c36-92cd2654c971,BYIPG6378L,2021-09-24,34207.0,Y764830914,loan-agreements.in/e9720552-2bb9-4b23-9de8-c5b47f54788a_Y764830914.pdf,True,2021-09-27,361 days,2022-09-27,24658b2b-c22a-4743-9ebb-33dc350bcd85,10000.0,2021-09-30 12:34:57.044640+05:30,233.05,41.94999999999999,410484.0,10275.0,961.0,2021-10-01,13682.800000000001,12275.0,1407.800000000001,2021-10-01,0.897
63,d4e98fdd-5b28-4d68-b8d9-53d19e12db7e,284866d1-d401-4526-8f61-efc9a65c4f64,DEVENDRA SWAMI,1993-11-06,MALE,5b81572b-7422-405e-89a9-4af836bc3895,2001535454@gmail.com,ELIGIBLE,8239205517,c2a6a007-e625-456f-8c36-92cd2654c971,FUHPS1045B,2021-09-25,17040.0,ZH96044944,loan-agreements.in/284866d1-d401-4526-8f61-efc9a65c4f64_ZH96044944.pdf,True,2021-09-26,360 days,2022-09-26,1ff67fbc-a971-4d30-9adc-3e3f18a5d7c9,5516.96,2021-09-26 18:10:15.713669+05:30,233.05,41.94999999999999,204480.0,5791.96,1012.65,2021-10-01,6816.0,5791.96,1024.04,2021-10-01,0.85
64,d5cc0925-dee2-47ab-829e-e1b32bbaf5f7,c2c2dc01-996a-4b40-bc4e-f66d5e3ca292,RAMALINGAIAH M  S,1995-07-10,Male,5b81572b-7422-405e-89a9-4af836bc3895,ramalingaiah95@gmail.com,ELIGIBLE,9901798798,c2a6a007-e625-456f-8c36-92cd2654c971,BUFPR0331F,2021-09-26,15578.0,4XG6128712,loan-agreements.in/c2c2dc01-996a-4b40-bc4e-f66d5e3ca292_4XG6128712.pdf,True,2021-09-26,360 days,2022-09-26,49b5d888-6097-4070-9b45-1e9bd19d4181,4800.0,2021-09-26 23:45:30.523386+05:30,169.49,30.50999999999999,186936.0,5000.0,622.94,2021-11-01,6231.200000000001,5000.0,1231.2000000000007,2021-10-01,0.802
65,dc641d42-458e-4046-8336-57a23603ed66,4d0f06b2-d71e-4a5f-8e9e-b708e7949d68,Nithin H U ,1997-03-20,Male,5b81572b-7422-405e-89a9-4af836bc3895,nithinnirmala1997@gmail.com,ELIGIBLE,8722713378,c2a6a007-e625-456f-8c36-92cd2654c971,AZLPN0640D,2021-09-02,20726.0,6Z25613742,loan-agreements.in/4d0f06b2-d71e-4a5f-8e9e-b708e7949d68_6Z25613742.pdf,True,2021-09-23,357 days,2022-09-23,2c481400-5d8b-4629-920c-7db61485d412,1040.0,2021-09-30 17:47:01.257847+05:30,50.85,9.149999999999999,248712.0,1100.0,828.86,2021-11-02,8290.4,5100.0,3190.3999999999996,2021-10-02,0.615
66,e6a34412-9b41-4c0c-a7e5-d16cab45301b,92364901-fc26-42aa-bcc2-fb05712bfe6c,PRITAM LAHANUJI BHENDARE Bhendare,1984-11-07,male,5b81572b-7422-405e-89a9-4af836bc3895,2000565363@dummy.com,ELIGIBLE,9421877842,c2a6a007-e625-456f-8c36-92cd2654c971,AVFPB3583P,2021-09-26,20942.0,XZK1185454,loan-agreements.in/92364901-fc26-42aa-bcc2-fb05712bfe6c_XZK1185454.pdf,True,2021-09-26,360 days,2022-09-26,ebdcd58b-385e-49b7-832a-8505fa553525,1117.29,2021-09-30 12:55:23.829914+05:30,50.85,9.149999999999999,251304.0,1177.29,186.11,2021-10-02,8376.800000000001,8177.29,199.51000000000113,2021-10-02,0.976
67,ea13afce-dd88-456b-8fab-d7262c8c61bf,9c0901c6-bd5e-4db1-8009-586a236f0009,Rohit  Kumar ,1994-09-29,Male,5b81572b-7422-405e-89a9-4af836bc3895,rohitmoral007@gmail.com,ELIGIBLE,9910158389,c2a6a007-e625-456f-8c36-92cd2654c971,FGVPK2690J,2021-09-24,15708.0,JLN0023969,loan-agreements.in/9c0901c6-bd5e-4db1-8009-586a236f0009_JLN0023969.pdf,True,2021-09-29,363 days,2022-09-29,360535bf-c436-4434-9645-e49490969cda,4800.0,2021-09-29 19:58:23.445772+05:30,169.49,30.50999999999999,188496.0,5000.0,1272.55,2021-10-02,6283.200000000001,5000.0,1283.2000000000007,2021-10-02,0.796
68,ed9539b2-078b-434c-95a5-77278798526e,6d378097-62fb-4cb2-b5c8-629b857935fb,Vishnu Babu,1993-04-15,male,5b81572b-7422-405e-89a9-4af836bc3895,QS1965522@gmail.com,ELIGIBLE,8943120486,c2a6a007-e625-456f-8c36-92cd2654c971,CYMPB4312E,2021-09-27,23131.0,R1P0217914,loan-agreements.in/6d378097-62fb-4cb2-b5c8-629b857935fb_R1P0217914.pdf,True,2021-09-27,361 days,2022-09-27,208adbe4-a84e-4b28-a290-4a3d11fff9f7,7725.0,2021-09-27 18:13:19.202152+05:30,233.05,41.94999999999999,277572.0,8000.0,1237.71,2021-10-01,9252.4,8000.0,1252.3999999999996,2021-10-01,0.865
69,ee7e6460-31ed-4bff-a4e3-a0342d52217c,49b92ad7-1d31-4841-98d8-2851367fe854,Sachin Bhandari ,1979-11-15,Male,5b81572b-7422-405e-89a9-4af836bc3895,bhandari.sachin07@gmail.com,ELIGIBLE,7017221941,c2a6a007-e625-456f-8c36-92cd2654c971,AMTPB7256Q,2021-09-14,60269.0,K7I4471125,loan-agreements.in/49b92ad7-1d31-4841-98d8-2851367fe854_K7I4471125.pdf,True,2021-09-17,351 days,2022-09-17,eb1729ad-23c1-4412-8149-c119a0097635,4800.0,2021-09-17 18:12:46.821355+05:30,169.49,30.50999999999999,723228.0,5000.0,19072.12,2021-10-01,24107.600000000002,5000.0,19107.600000000002,2021-10-01,0.207
70,efc9bfc4-0ab6-422f-863f-10e17567c4b5,3db39ada-8dd1-4682-96c2-c9598d0f197c,Parth KARMAKAR,1985-03-25,Male,5b81572b-7422-405e-89a9-4af836bc3895,parth.karmakar@bizsupporta.com,ELIGIBLE,9475193306,c2a6a007-e625-456f-8c36-92cd2654c971,BHAPK0681D,2021-09-24,15771.0,BJ42434720,loan-agreements.in/3db39ada-8dd1-4682-96c2-c9598d0f197c_BJ42434720.pdf,True,2021-09-24,358 days,2022-09-24,53a99921-08de-4877-b6ca-3192c548f3e0,4000.0,2021-09-24 13:37:28.965415+05:30,169.49,30.50999999999999,189252.0,4200.0,2098.44,2021-10-01,6308.400000000001,4200.0,2108.4000000000005,2021-10-01,0.666
71,f0fb1dba-dccc-47e4-85d8-2bbf2c55688d,f16efa3f-9ff4-45cd-a533-e5879c501427,bharatha Hs,1991-08-22,Male,5b81572b-7422-405e-89a9-4af836bc3895,bharatha.s@bizsupporta.com,ELIGIBLE,9900868755,c2a6a007-e625-456f-8c36-92cd2654c971,DFZPB3435P,2021-09-25,15778.0,G063284854,loan-agreements.in/f16efa3f-9ff4-45cd-a533-e5879c501427_G063284854.pdf,True,2021-09-26,360 days,2022-09-26,b0149ae9-db8e-4136-af7e-c8bfd8c6513a,565.0,2021-09-29 18:44:00.881632+05:30,29.66,5.34,189336.0,600.0,631.0,2021-11-01,6311.200000000001,2600.0,3711.2000000000007,2021-10-01,0.412
72,f121277c-3c59-43d1-82ea-fb4d9790524b,ccc43e69-14f8-4e96-8704-e115fec1d75a,GAURAV ,1999-12-02,Male,5b81572b-7422-405e-89a9-4af836bc3895,gaurav.gaurav6@bizsupporta.com,ELIGIBLE,8307322072,c2a6a007-e625-456f-8c36-92cd2654c971,CLRPG1073R,2021-09-08,42774.0,73E1392710,loan-agreements.in/ccc43e69-14f8-4e96-8704-e115fec1d75a_73E1392710.pdf,True,2021-09-13,347 days,2022-09-13,a7debcd5-f1d5-4ef4-9254-2f44edca5151,1340.0,2021-09-28 17:09:58.166513+05:30,50.85,9.149999999999999,513288.0,1400.0,1710.72,2021-11-01,17109.600000000002,14618.279999999999,2491.3200000000033,2021-10-01,0.854
73,fad79017-73b7-4ce8-94d1-c7ec76eb6878,42c2aa72-fe74-48cf-bdf9-a68acbe9da30,SARAVANAN P ,1995-12-03,Male,5b81572b-7422-405e-89a9-4af836bc3895,saruweb95@gmail.com,ELIGIBLE,9597684218,c2a6a007-e625-456f-8c36-92cd2654c971,HZGPS9345C,2021-09-12,9636.0,2OF7735989,loan-agreements.in/42c2aa72-fe74-48cf-bdf9-a68acbe9da30_2OF7735989.pdf,True,2021-09-22,356 days,2022-09-22,a3100039-9217-47f5-b312-1db01d4404d9,212.78,2021-09-29 10:52:43.948420+05:30,10.17,1.83,115632.0,224.78,224.78,2021-10-01,3854.4,3623.2999999999997,231.10000000000036,2021-10-01,0.94
74,fb67cfff-17bf-4e23-9040-7f608b252c49,8312e0f6-2b82-4506-860c-b3966b57114e,Suraj Bhosale,1970-01-01,male,5b81572b-7422-405e-89a9-4af836bc3895,2000591075@gmail.com,ELIGIBLE,9172626200,c2a6a007-e625-456f-8c36-92cd2654c971,AVLPB1134G,2021-09-26,30000.0,01F6068309,loan-agreements.in/8312e0f6-2b82-4506-860c-b3966b57114e_01F6068309.pdf,True,2021-09-27,361 days,2022-09-27,134425ff-519c-4bd9-9054-92cc40be0dec,288.0,2021-09-28 22:29:16.431601+05:30,10.17,1.83,360000.0,300.0,1199.8,2021-11-01,12000.0,10931.61,1068.3899999999994,2021-10-01,0.911
75,fe6e1b7f-f8bc-4b3f-9540-c5ba6159ea51,20050c30-babb-4c35-99a1-80c07e087163,Rahul Rana,1992-01-26,male,5b81572b-7422-405e-89a9-4af836bc3895,QS2188942@gmail.com,ELIGIBLE,9671591093,c2a6a007-e625-456f-8c36-92cd2654c971,BGJPR5516E,2021-09-28,17055.0,3NC0816141,loan-agreements.in/20050c30-babb-4c35-99a1-80c07e087163_3NC0816141.pdf,True,2021-09-30,364 days,2022-09-30,f24a2cda-da8a-483b-9f92-a8036afef60f,482.0,2021-09-30 08:45:02.257378+05:30,15.25,2.75,204660.0,500.0,6310.36,2021-10-02,6822.0,500.0,6322.0,2021-10-02,0.073
76,fe8af375-f5b5-4285-ae88-c2c4c8ce896a,0e054b77-9683-4483-93c0-86d0deb94f54,Kashish Kumar,1996-12-31,Male,5b81572b-7422-405e-89a9-4af836bc3895,kashishkumar632@gmail.com,ELIGIBLE,8264238389,c2a6a007-e625-456f-8c36-92cd2654c971,FBAPK1225B,2021-09-26,7019.0,DC65276265,loan-agreements.in/0e054b77-9683-4483-93c0-86d0deb94f54_DC65276265.pdf,True,2021-09-26,360 days,2022-09-26,912a7ad7-bc6a-4956-9e6f-086789836454,268.51,2021-10-01 14:17:23.607849+05:30,10.17,1.83,84228.0,280.51,42.86,2021-10-01,2807.6000000000004,3038.87,-231.26999999999953,2021-10-01,1.082
77,fffb8c92-c4d5-404e-a50c-40fc2052264f,62467ed1-2fe2-4f3f-8ba1-72f2880ad4fa,AAVISHKAR V KOTIAN ,1991-06-12,MALE,5b81572b-7422-405e-89a9-4af836bc3895,Q1050440@gmail.com,ELIGIBLE,9686144794,c2a6a007-e625-456f-8c36-92cd2654c971,BMGPK2514L,2021-09-02,12055.0,3VC9052787,loan-agreements.in/62467ed1-2fe2-4f3f-8ba1-72f2880ad4fa_3VC9052787.pdf,True,2021-09-16,350 days,2022-09-16,b1f047e3-e123-4137-8bbe-289400b26e44,288.0,2021-09-30 14:56:06.359314+05:30,10.17,1.83,144660.0,300.0,214.42,2021-10-07,4822.0,4600.0,222.0,2021-10-07,0.954
