{"itemCount":7354,"md5Checksum":"4Pa/AYrcGMvJkAla5FHcag==","etag":"4637db2b7482953f4a3e8c0073c989d1-1","dataFileS3Key":"AWSDynamoDB/01640315377487-aef44434/data/xypslgqho4y2nltr73b4kdd6gy.json.gz"}
{"itemCount":7499,"md5Checksum":"dpsK+IgrvgrwswKhuzR6VQ==","etag":"70f1ff5511290e6b3f892336dd84d87f-1","dataFileS3Key":"AWSDynamoDB/01640315377487-aef44434/data/v7rqbh7vzq6cnbhsocd4b3jliq.json.gz"}
{"itemCount":7554,"md5Checksum":"frpFml5+oaslMqJwFoweHQ==","etag":"fc04e01cda94d74e29de1075ec29d3ad-1","dataFileS3Key":"AWSDynamoDB/01640315377487-aef44434/data/6bulszs7wm5s5hfocs4k7k6gpi.json.gz"}
{"itemCount":7505,"md5Checksum":"uk8TDs9ZlRSBpb228Qg/zA==","etag":"f4962e1a20e42683872bcb77f4710d97-1","dataFileS3Key":"AWSDynamoDB/01640315377487-aef44434/data/mwnvfrtx6y5lxkqahryoy2r4vi.json.gz"}
