{"itemCount":6498,"md5Checksum":"n6Dyw5wR2LrYKNE6DeNJpg==","etag":"9b123cd7a7baee49617bf00b257a1343-1","dataFileS3Key":"AWSDynamoDB/01639108588083-ad5ad66b/data/itzgt5z6ryzvzi3kav7tb53muu.json.gz"}
{"itemCount":6663,"md5Checksum":"Efx8GGVCW7R+HDuv1UdAPw==","etag":"03e767a3dc0bca38c55674583b3a947a-1","dataFileS3Key":"AWSDynamoDB/01639108588083-ad5ad66b/data/6jreuoogke4inncpriuyejuz24.json.gz"}
{"itemCount":6682,"md5Checksum":"V3BWmeSPQLdTlKXgrD3N3w==","etag":"9a8b05b720f72835ae2da7114c8e3a59-1","dataFileS3Key":"AWSDynamoDB/01639108588083-ad5ad66b/data/f5nbob3vwy6ynjy73c3zccbmsi.json.gz"}
{"itemCount":6621,"md5Checksum":"RICI/u3Pq4u37oSGnpZUwA==","etag":"e62c6904e2d03b6f135dc0b848f782f9-1","dataFileS3Key":"AWSDynamoDB/01639108588083-ad5ad66b/data/yovp73ods43qxbkdl57fm6kili.json.gz"}
