,user_id,employment,Approved,zip_code,created_at,updated_at,underwriting,fraud,kyc,data,Aws Approved
18,f121277c-3c59-43d1-82ea-fb4d9790524b,,True,True,2021-09-08,2021-09-08 05:01:36.983777+00:00,,,,Last name is Missing,False
32,92c731a3-de6f-4810-bd4b-1aa02e842aaf,,True,True,2021-09-08,2021-09-08 11:07:50.223269+00:00,,,,Yes,True
39,fffb8c92-c4d5-404e-a50c-40fc2052264f,,True,True,2021-09-01,2021-09-01 11:22:08.451287+00:00,,,,Yes,True
47,b643676a-a556-4d89-a0b5-c6468757cbff,,True,True,2021-09-08,2021-09-08 11:09:49.336053+00:00,,,,Yes,True
74,3e375b0d-328b-47d9-bce1-37acd182d0cc,,True,True,2021-09-01,2021-09-01 11:36:23.715383+00:00,,,,Yes,True
81,b335ea74-cf4d-4a87-b15e-4d753f5d9950,,True,True,2021-09-01,2021-09-01 11:36:50.513821+00:00,,,,Yes,True
84,4557f44a-ed13-4ac0-8fa2-8488dfcbbc5b,,True,True,2021-09-01,2021-09-01 11:36:57.953380+00:00,,,,Yes,True
95,5a92aee7-ac45-4199-9dc5-454ba3d5c8ec,,True,True,2021-09-01,2021-09-01 11:38:23.734295+00:00,,,,Yes,True
139,ca337c4e-a400-4d1f-92b6-79a054293b3b,,True,True,2021-09-09,2021-09-09 13:28:10.720535+00:00,,,,SYS100007(Invalid State)/ SYS100005 (Additional Address Mandatory field missing),False
146,5170ffe0-f903-4501-8713-4fe65690aadb,,True,True,2021-09-08,2021-09-08 15:24:56.312087+00:00,,,,Yes,True
165,967b5dd1-6ce0-487f-87fd-33a79983c1f3,,True,True,2021-09-09,2021-09-09 13:24:46.966234+00:00,,,,SYS100007(Invalid State)/ SYS100005 (Additional Address Mandatory field missing),False
168,701c1a8e-a22d-495f-a21d-938fe963d9a0,,True,True,2021-09-08,2021-09-08 08:15:13.565542+00:00,,,,Wrong State Code ,False
241,21913164-4f96-418b-8b6e-eba7086e58a9,,True,True,2021-09-09,2021-09-09 13:19:56.076656+00:00,,,,Wrong State Code ,False
250,c147c69b-4190-45bf-9338-b10064d60c76,,True,True,2021-09-09,2021-09-09 13:19:51.975285+00:00,,,,Yes,True
256,d346a8d6-4411-474e-84c9-6d9dbf525d8b,,True,True,2021-09-08,2021-09-08 11:35:32.636874+00:00,,,,Yes,True
281,cb6c400b-b624-4394-831f-8fff27d53c0c,,True,True,2021-09-08,2021-09-08 11:13:31.405114+00:00,,,,SYS100007(Invalid State)/ SYS100005 (Additional Address Mandatory field missing),False
310,13a6c54d-9008-4a24-8e90-ccfb54d7fdf0,,True,True,2021-09-01,2021-09-01 12:03:45.919746+00:00,,,,Yes,True
341,1e463051-8b82-45d4-ae7d-db41367100f4,,True,True,2021-09-09,2021-09-09 13:48:51.312259+00:00,,,,SYS100007(Invalid State)/ SYS100005 (Additional Address Mandatory field missing),False
419,be2a354e-5b7e-4f18-8be5-ae48f422b8de,,True,True,2021-09-10,2021-09-10 10:29:02.927824+00:00,,,,Last name is Missing,False
429,8c0c52ee-881b-43e2-8e7a-7f01c97a3e79,,True,True,2021-09-08,2021-09-08 11:06:35.206098+00:00,,,,Wrong State Code ,False
431,099cabcc-1e53-4f27-8f46-8624ecfc0c26,,True,True,2021-09-08,2021-09-08 11:06:46.159042+00:00,,,,Yes,True
446,9bc16ba1-7ede-44dd-a847-2e377689816f,,True,True,2021-09-08,2021-09-08 12:39:01.177190+00:00,,,,SYS100007(Invalid State)/ SYS100005 (Additional Address Mandatory field missing),False
469,2a88a4c5-c8b1-41c3-ade2-26e0b20e4239,,True,True,2021-09-01,2021-09-01 13:33:51.067952+00:00,,,,Yes,True
485,8200c29e-737c-4504-b63d-3cde41fbfce1,,True,True,2021-09-08,2021-09-08 11:40:25.779468+00:00,,,,Yes,True
499,35747d7e-521a-4538-9a44-e8d76b22d2c9,,True,True,2021-09-05,2021-09-05 10:54:29.704626+00:00,,,,Yes,True
502,06a03e57-44c2-485b-b569-b63c96aa1dd6,,True,True,2021-09-05,2021-09-05 18:46:31.820065+00:00,,,,Yes,True
561,8b93e904-ea1e-45f1-8604-b7dd07d55c2f,,True,True,2021-10-18,2021-10-18 08:38:35.757386+00:00,,,,"<RULE 1> <N>,<RULE 2> <Y>,<RULE 3> <Y>,<RULE 4> <Y>,<RULE 5> <Y>,<RULE 6> <Y>,<RULE 7> <Y>,<RULE 8> <N>,<RULE 9> <N>,<RULE 10> <N>",False
564,81607208-d813-4e94-b5e8-e3c5cc9f51f5,,True,True,2021-10-18,2021-10-18 08:47:05.736042+00:00,,,,SYS100007(Invalid State)/ SYS100005 (Additional Address Mandatory field missing),False
566,31cf8a8e-1303-4016-9306-601f368bf0ed,,True,True,2021-10-18,2021-10-18 08:52:38.237568+00:00,,,,"<RULE 1> <Y>,<RULE 2> <N>,<RULE 3> <N>,<RULE 4> <N>,<RULE 5> <N>,<RULE 6> <Y>,<RULE 7> <N>,<RULE 8> <N>,<RULE 9> <N>,<RULE 10> <N>",False
626,58c33317-a049-4fa7-9a32-b8bb06dd2687,,True,True,2021-10-27,2021-10-27 13:10:11.516593+00:00,,,,SYS100007(Invalid State)/ SYS100005 (Additional Address Mandatory field missing),False
629,d1445d9f-495f-4947-9783-8aebffef08f3,,True,True,2021-10-27,2021-10-27 13:12:47.665648+00:00,,,,SYS100007(Invalid State)/ SYS100005 (Additional Address Mandatory field missing),False
656,778e747b-8397-453d-967d-0385a9c68167,,True,True,2021-09-13,2021-09-13 04:21:13.313382+00:00,,,,Last name is Missing,False
705,0ba9e70e-e708-4c5e-bce9-ecc22e09b9ca,,True,True,2021-09-13,2021-09-13 12:00:10.165458+00:00,,,,,False
740,c0b6bccb-6f8c-4418-854f-8482d168040b,,True,True,2021-09-17,2021-09-17 13:06:39.235900+00:00,,,,SYS100007(Invalid State)/ SYS100005 (Additional Address Mandatory field missing),False
741,29d6dab3-870c-4cf8-884e-dbbedf96bbea,,True,True,2021-09-14,2021-09-14 07:59:27.191958+00:00,,,,Yes,True
756,99b323c7-3a9c-4342-bd0a-31eda223e538,False,True,True,2021-10-18,2021-11-03 05:46:45.122490+00:00,False,False,,"<RULE 1> <Y>,<RULE 2> <N>,<RULE 3> <N>,<RULE 4> <N>,<RULE 5> <N>,<RULE 6> <N>,<RULE 7> <N>,<RULE 8> <N>,<RULE 9> <N>,<RULE 10> <N>",False
787,467979fa-45bf-4678-af2c-0dcd010e9d9a,,True,True,2021-10-19,2021-10-19 07:06:42.419285+00:00,,,,"<RULE 1> <Y>,<RULE 2> <N>,<RULE 3> <N>,<RULE 4> <N>,<RULE 5> <N>,<RULE 6> <N>,<RULE 7> <N>,<RULE 8> <N>,<RULE 9> <Y>,<RULE 10> <N>",False
798,55194f03-6c93-4e47-9f28-f7ec41109e52,,True,True,2021-10-19,2021-10-19 13:50:37.017661+00:00,,,,SYS100007(Invalid State)/ SYS100005 (Additional Address Mandatory field missing),False
801,1dfb1fc1-242f-4d1c-bcd2-e4fb96aa1b8e,,True,True,2021-10-19,2021-10-19 14:43:43.169225+00:00,,,,"<RULE 1> <N>,<RULE 2> <Y>,<RULE 3> <Y>,<RULE 4> <Y>,<RULE 5> <Y>,<RULE 6> <Y>,<RULE 7> <Y>,<RULE 8> <N>,<RULE 9> <N>,<RULE 10> <N>",False
840,3080a3e9-237c-4a6b-85d0-05cac86b0a9a,,True,True,2021-10-25,2021-10-25 14:32:01.687160+00:00,,,,SYS100007(Invalid State)/ SYS100005 (Additional Address Mandatory field missing),False
841,ee9c1f18-4781-4da5-b9cc-f53af8fd4590,,True,True,2021-10-25,2021-10-25 14:32:14.018656+00:00,,,,SYS100007(Invalid State)/ SYS100005 (Additional Address Mandatory field missing),False
842,6ef6e154-2991-4229-9f7f-ea5c2fb382bf,,True,True,2021-10-25,2021-10-25 14:32:53.368500+00:00,,,,SYS100007(Invalid State)/ SYS100005 (Additional Address Mandatory field missing),False
857,112fe9f3-ce93-4e09-881c-55f13ce125bd,,True,True,2021-10-25,2021-10-25 14:43:02.239398+00:00,,,,"<RULE 1> <N>,<RULE 2> <Y>,<RULE 3> <Y>,<RULE 4> <Y>,<RULE 5> <Y>,<RULE 6> <Y>,<RULE 7> <Y>,<RULE 8> <N>,<RULE 9> <N>,<RULE 10> <N>",False
947,ba45cba4-81b9-435b-9da3-abb48e1a4538,,True,True,2021-09-18,2021-09-18 10:14:37.230606+00:00,,,,Yes,True
954,a64a5b40-add5-408b-a36f-f96d05bfe679,,True,True,2021-09-18,2021-09-18 10:16:15.966912+00:00,,,,Yes,True
999,2cce03d0-0ad9-4fd9-9e76-c1f7dc16d3d1,,True,True,2021-10-15,2021-10-15 15:56:31.453244+00:00,,,,"<RULE 1> <Y>,<RULE 2> <N>,<RULE 3> <N>,<RULE 4> <N>,<RULE 5> <N>,<RULE 6> <N>,<RULE 7> <N>,<RULE 8> <N>,<RULE 9> <N>,<RULE 10> <N>",False
1024,4b7cad86-2711-4822-a990-f2a88dceb80f,,True,True,2021-10-19,2021-10-19 13:40:51.628221+00:00,,,,SYS100007(Invalid State)/ SYS100005 (Additional Address Mandatory field missing),False
1025,b0b754ac-5332-4243-99db-a8bafe9792f2,,True,True,2021-10-19,2021-10-19 13:42:45.701479+00:00,,,,"<RULE 1> <Y>,<RULE 2> <N>,<RULE 3> <N>,<RULE 4> <N>,<RULE 5> <N>,<RULE 6> <N>,<RULE 7> <N>,<RULE 8> <N>,<RULE 9> <N>,<RULE 10> <N>",False
1028,41ab5d9b-575b-4892-b9d3-2d049b423683,,True,True,2021-10-19,2021-10-19 13:57:53.027418+00:00,,,,"<RULE 1> <N>,<RULE 2> <Y>,<RULE 3> <Y>,<RULE 4> <Y>,<RULE 5> <Y>,<RULE 6> <Y>,<RULE 7> <Y>,<RULE 8> <N>,<RULE 9> <N>,<RULE 10> <N>",False
1058,b62f41ee-43bc-4543-a677-26f0d9bf93f8,,True,True,2021-10-25,2021-10-25 14:39:37.837003+00:00,,,,SYS100007(Invalid State)/ SYS100005 (Additional Address Mandatory field missing),False
1092,16623508-f28e-4047-b257-b4879ec8038d,,True,True,2021-10-03,2021-10-03 12:01:47.729424+00:00,,,,Yes,True
1111,b42dd254-014f-49bc-9d1a-f7c5eb3c2153,,True,True,2021-10-16,2021-10-16 15:48:09.776557+00:00,,,,SYS100007(Invalid State)/ SYS100005 (Additional Address Mandatory field missing),False
1174,8ffdb92b-0241-4d7d-bae9-3319f87fc6e5,,True,True,2021-10-25,2021-10-25 14:52:22.387179+00:00,,,,SYS100007(Invalid State)/ SYS100005 (Additional Address Mandatory field missing),False
1176,322fe4c3-6e50-4cd0-b149-4a5b3b66b7c4,,True,True,2021-10-25,2021-10-25 14:56:38.068617+00:00,,,,SYS100007(Invalid State)/ SYS100005 (Additional Address Mandatory field missing),False
1186,642f90c0-5322-4fb7-a9cb-8d3052d59924,,True,True,2021-10-26,2021-10-26 09:00:27.557339+00:00,,,,SYS100007(Invalid State)/ SYS100005 (Additional Address Mandatory field missing),False
1193,711b0d5f-8b82-4068-be9d-2a5c4d9588db,,True,True,2021-10-26,2021-10-26 09:11:59.048301+00:00,,,,SYS100007(Invalid State)/ SYS100005 (Additional Address Mandatory field missing),False
1293,104e7029-91fe-4c34-9f18-1b4f95107c3f,,True,True,2021-09-20,2021-09-20 16:03:03.356814+00:00,,,,Yes,True
1305,613845a0-3ac8-44b9-a5d6-280fc3b4a105,,True,True,2021-09-20,2021-09-20 16:15:32.764156+00:00,,,,Yes,True
1328,2b2e6054-331c-440f-95eb-cb1c84af8bbd,,True,True,2021-10-03,2021-10-03 15:18:20.634253+00:00,,,,Wrong State Code ,False
1365,ce523c9a-56dc-4e8a-82a9-12facef35f9f,,True,True,2021-10-25,2021-10-25 14:58:15.174030+00:00,,,,"<RULE 1> <Y>,<RULE 2> <N>,<RULE 3> <N>,<RULE 4> <N>,<RULE 5> <N>,<RULE 6> <N>,<RULE 7> <N>,<RULE 8> <N>,<RULE 9> <N>,<RULE 10> <N>",False
1443,32b07a09-37c4-4531-9f68-f43de880342e,,True,True,2021-10-03,2021-10-03 16:10:11.508450+00:00,,,,Yes,True
1459,2a7d181f-a4e3-48f4-87f0-e8eede195b8c,,True,True,2021-10-17,2021-10-17 02:56:35.571927+00:00,,,,SYS100007(Invalid State)/ SYS100005 (Additional Address Mandatory field missing),False
1470,7243ab81-7a49-48b5-902f-e4701d145dc7,,True,True,2021-10-19,2021-10-19 14:40:14.420329+00:00,,,,"<RULE 1> <N>,<RULE 2> <Y>,<RULE 3> <Y>,<RULE 4> <Y>,<RULE 5> <Y>,<RULE 6> <Y>,<RULE 7> <Y>,<RULE 8> <N>,<RULE 9> <N>,<RULE 10> <N>",False
1473,088e868c-1c26-4b8d-b983-5a82732cfeac,,True,True,2021-10-20,2021-10-20 10:48:10.436319+00:00,,,,SYS100007(Invalid State)/ SYS100005 (Additional Address Mandatory field missing),False
1493,fb72d057-54f2-4ab6-9a97-b24d79ccc56f,,True,True,2021-10-24,2021-10-24 11:31:49.269080+00:00,,,,Json Failure - Issue at our AWS end,False
1507,5b242394-42fd-43cf-a7df-2df63cd66209,,True,True,2021-10-25,2021-10-25 14:35:15.380844+00:00,,,,SYS100007(Invalid State)/ SYS100005 (Additional Address Mandatory field missing),False
1511,29fcf53f-7866-4ed4-a0a0-d2ca8f320013,,True,True,2021-10-25,2021-10-25 14:51:44.877619+00:00,,,,"<RULE 1> <N>,<RULE 2> <N>,<RULE 3> <Y>,<RULE 4> <Y>,<RULE 5> <Y>,<RULE 6> <Y>,<RULE 7> <Y>,<RULE 8> <N>,<RULE 9> <N>,<RULE 10> <N>",False
1543,52f94658-faa4-4405-bb07-0a6332dd534d,,True,True,2021-09-21,2021-09-21 06:57:06.955280+00:00,,,,Yes,True
1557,b9278e8e-0fe5-4aa4-97da-bc3890e333a3,,True,True,2021-09-21,2021-09-21 08:34:37.018257+00:00,,,,Yes,True
1566,5b5371d3-bdf7-4de4-960f-f472867bf82f,,True,True,2021-09-21,2021-09-21 08:37:27.610637+00:00,,,,Yes,True
1587,fab635e7-b030-473b-b2f3-05711292688a,,True,True,2021-09-21,2021-09-21 08:43:43.397523+00:00,,,,Yes,True
1618,c36b6ce6-adc0-4201-8b9b-bc63dc2532af,,True,True,2021-09-21,2021-09-21 09:41:35.390693+00:00,,,,No,False
1674,ebf5d9a6-6df3-4a8c-91f2-9a0b1e785761,,True,True,2021-10-16,2021-10-16 12:01:05.733559+00:00,,,,SYS100007(Invalid State)/ SYS100005 (Additional Address Mandatory field missing),False
1693,f76b342b-b0d7-45fd-b7de-37e72c2cb304,,True,True,2021-10-18,2021-10-18 09:30:49.865877+00:00,,,,SYS100007(Invalid State)/ SYS100005 (Additional Address Mandatory field missing),False
1698,ab54852b-9179-445a-895e-2c6abb947f51,,True,True,2021-10-18,2021-10-18 11:15:36.177390+00:00,,,,SYS100007(Invalid State)/ SYS100005 (Additional Address Mandatory field missing),False
1704,d17cd86a-d83a-439d-a291-7c387fcf7212,True,True,True,2021-10-18,2021-11-03 05:37:23.539571+00:00,False,True,,"<RULE 1> <N>,<RULE 2> <N>,<RULE 3> <N>,<RULE 4> <N>,<RULE 5> <N>,<RULE 6> <Y>,<RULE 7> <Y>,<RULE 8> <N>,<RULE 9> <N>,<RULE 10> <N>",False
1707,cba74fb8-dd80-4de7-a727-a288f1704e3e,,True,True,2021-10-18,2021-10-18 14:29:49.477599+00:00,,,,"<RULE 1> <Y>,<RULE 2> <N>,<RULE 3> <N>,<RULE 4> <N>,<RULE 5> <N>,<RULE 6> <N>,<RULE 7> <N>,<RULE 8> <N>,<RULE 9> <N>,<RULE 10> <N>",False
1820,0b478db2-8984-4bf3-812b-8d81de1da5e4,,True,True,2021-10-24,2021-10-24 13:48:58.999296+00:00,,,,"<RULE 1> <Y>,<RULE 2> <N>,<RULE 3> <N>,<RULE 4> <N>,<RULE 5> <N>,<RULE 6> <Y>,<RULE 7> <N>,<RULE 8> <N>,<RULE 9> <N>,<RULE 10> <N>",False
1821,a90b66c5-2c6d-4a90-bab9-1fedaf044329,,True,True,2021-10-25,2021-10-25 14:32:26.844962+00:00,,,,SYS100007(Invalid State)/ SYS100005 (Additional Address Mandatory field missing),False
1843,bfb8d8a0-1642-4b7a-bdf6-a981ef77386d,,True,True,2021-10-27,2021-10-27 08:48:16.866648+00:00,,,,SYS100007(Invalid State)/ SYS100005 (Additional Address Mandatory field missing),False
1864,3a465210-a236-49d8-953a-c370c17695dd,,True,True,2021-09-22,2021-09-22 13:34:41.187203+00:00,,,,Wrong State Code ,False
1867,c15b0d47-43a5-435f-b66e-e5e6d6a46fbd,,True,True,2021-09-22,2021-09-22 13:35:09.435279+00:00,,,,SYS100007(Invalid State)/ SYS100005 (Additional Address Mandatory field missing),False
1913,09946440-81c1-485a-b1eb-fa75b4e7e659,,True,True,2021-10-17,2021-10-17 13:15:42.269584+00:00,,,,Json Failure - Issue at our AWS end,False
1925,b720db76-9873-411e-a104-9971e0f5e52d,,True,True,2021-10-18,2021-10-18 09:59:45.415972+00:00,,,,"<RULE 1> <N>,<RULE 2> <Y>,<RULE 3> <Y>,<RULE 4> <Y>,<RULE 5> <Y>,<RULE 6> <Y>,<RULE 7> <Y>,<RULE 8> <N>,<RULE 9> <N>,<RULE 10> <N>",False
1934,3ef923de-0302-4d67-af8b-c28335274d4a,,True,True,2021-10-18,2021-10-18 13:52:14.419380+00:00,,,,SYS100007(Invalid State)/ SYS100005 (Additional Address Mandatory field missing),False
1950,af8912dd-f29d-47f2-b19b-7f29bb1663a7,,True,True,2021-10-24,2021-10-24 14:01:37.898485+00:00,,,,"<RULE 1> <Y>,<RULE 2> <N>,<RULE 3> <N>,<RULE 4> <N>,<RULE 5> <N>,<RULE 6> <N>,<RULE 7> <N>,<RULE 8> <N>,<RULE 9> <Y>,<RULE 10> <N>",False
1958,4b9734f5-b6fd-40b8-8f02-3b2d71e26129,,True,True,2021-10-25,2021-10-25 15:10:42.127669+00:00,,,,SYS100007(Invalid State)/ SYS100005 (Additional Address Mandatory field missing),False
1960,d0ef9da8-631d-48a9-b8a3-909be9359b63,,True,True,2021-10-26,2021-10-26 09:01:48.507045+00:00,,,,SYS100007(Invalid State)/ SYS100005 (Additional Address Mandatory field missing),False
1977,7e464c6e-ca90-4c29-b53d-10070c227e49,,True,True,2021-09-22,2021-09-22 13:35:03.005268+00:00,,,,SYS100007(Invalid State)/ SYS100005 (Additional Address Mandatory field missing),False
1994,2df2ceb7-e1d8-47de-bd24-70c0858eccc8,,True,True,2021-09-22,2021-09-22 13:36:46.990909+00:00,,,,No,False
2081,93124243-64b6-4980-b649-5105211e694e,,True,True,2021-09-22,2021-09-22 14:05:30.411799+00:00,,,,No,False
2091,466ed250-b2e1-43c4-bc01-a9ca0ff8c3ad,,True,True,2021-10-04,2021-10-04 09:27:03.230934+00:00,,,,SYS100007(Invalid State)/ SYS100005 (Additional Address Mandatory field missing),False
2125,97adfa75-2225-4e1b-bed6-64fc5415c37b,,True,True,2021-10-17,2021-10-17 13:16:09.787791+00:00,,,,"<RULE 1> <N>,<RULE 2> <N>,<RULE 3> <Y>,<RULE 4> <Y>,<RULE 5> <Y>,<RULE 6> <Y>,<RULE 7> <Y>,<RULE 8> <N>,<RULE 9> <N>,<RULE 10> <N>",False
2136,f91a76d4-0e7e-4626-b914-fce3529f1e21,,True,True,2021-10-19,2021-10-19 14:44:24.105895+00:00,,,,SYS100007(Invalid State)/ SYS100005 (Additional Address Mandatory field missing),False
2137,eb948456-01a6-4124-b659-8fe68f5ae465,,True,True,2021-10-20,2021-10-20 14:38:45.067623+00:00,,,,SYS100007(Invalid State)/ SYS100005 (Additional Address Mandatory field missing),False
2156,12309ffd-0602-4924-bfb7-d1bcdc57e0ac,,True,True,2021-10-27,2021-10-27 04:46:17.442680+00:00,,,,SYS100007(Invalid State)/ SYS100005 (Additional Address Mandatory field missing),False
2166,9f340f2c-b55d-4b08-b656-516626c1f4f6,,True,True,2021-10-27,2021-10-27 12:38:15.039768+00:00,,,,"<RULE 1> <Y>,<RULE 2> <N>,<RULE 3> <N>,<RULE 4> <N>,<RULE 5> <N>,<RULE 6> <N>,<RULE 7> <N>,<RULE 8> <N>,<RULE 9> <N>,<RULE 10> <N>",False
2193,a3ed4fc2-b69b-4b8e-912e-a16c8f7520ec,,True,True,2021-10-03,2021-10-03 18:50:51.632345+00:00,,,,SYS100007(Invalid State)/ SYS100005 (Additional Address Mandatory field missing),False
2208,0bafd061-7b3e-456f-ae55-51adbc63fd19,,True,True,2021-10-10,2021-10-10 16:41:36.577861+00:00,,,,SYS100007(Invalid State)/ SYS100005 (Additional Address Mandatory field missing),False
2229,15981260-ac3a-4cd9-8b41-cf4079089074,,True,True,2021-10-17,2021-10-17 13:15:28.888708+00:00,,,,Json Failure - Issue at our AWS end,False
2240,9e6127d8-62b9-41c3-8c04-4fcc82c7d66e,,True,True,2021-10-18,2021-10-18 10:02:49.773033+00:00,,,,SYS100007(Invalid State)/ SYS100005 (Additional Address Mandatory field missing),False
2288,d1f87af2-ac69-40bd-ab8b-903b2d40fbd5,,True,True,2021-10-27,2021-10-27 13:06:17.372571+00:00,,,,SYS100007(Invalid State)/ SYS100005 (Additional Address Mandatory field missing),False
2304,39795873-4d4c-4a3c-99b9-91d086bd118d,,True,True,2021-10-03,2021-10-03 18:57:05.686723+00:00,,,,SYS100007(Invalid State)/ SYS100005 (Additional Address Mandatory field missing),False
2334,9a97a6cd-228d-4bbc-817c-21e0313bc639,True,True,True,2021-10-20,2021-11-03 07:14:36.963548+00:00,False,False,,SYS100007(Invalid State)/ SYS100005 (Additional Address Mandatory field missing),False
2346,f6ca971e-649e-4d23-a0d9-a04673e9ff1d,,True,True,2021-10-17,2021-10-17 13:15:47.207167+00:00,,,,Json Failure - Issue at our AWS end,False
2363,e6b5b407-26e4-44ce-af03-85f5fa7aa52b,True,True,True,2021-10-19,2021-11-02 22:06:19.626737+00:00,True,False,,Json Failure - Issue at our AWS end,False
2379,9e56a9c2-2e2a-485b-945a-b38c2d0ec2b5,,True,True,2021-10-20,2021-10-20 08:27:25.609919+00:00,,,,SYS100007(Invalid State)/ SYS100005 (Additional Address Mandatory field missing),False
2386,b8d896c8-5eee-4a03-b189-77510307c99e,False,True,True,2021-10-21,2021-11-02 18:59:31.889723+00:00,False,False,,SYS100007(Invalid State)/ SYS100005 (Additional Address Mandatory field missing),False
2396,bd012cab-1677-4d88-a5f3-c6a13d62951a,,True,True,2021-10-21,2021-10-21 13:51:27.998571+00:00,,,,"<RULE 1> <Y>,<RULE 2> <N>,<RULE 3> <N>,<RULE 4> <N>,<RULE 5> <N>,<RULE 6> <N>,<RULE 7> <N>,<RULE 8> <N>,<RULE 9> <N>,<RULE 10> <N>",False
2404,34e887da-638d-4cb1-8e48-f282066c7a40,,True,True,2021-10-24,2021-10-24 14:01:01.215594+00:00,,,,SYS100007(Invalid State)/ SYS100005 (Additional Address Mandatory field missing),False
2408,6e9abea6-1c58-4021-b92a-6bed935cba18,,True,True,2021-10-25,2021-10-25 15:13:09.019217+00:00,,,,"<RULE 1> <Y>,<RULE 2> <N>,<RULE 3> <N>,<RULE 4> <N>,<RULE 5> <N>,<RULE 6> <Y>,<RULE 7> <N>,<RULE 8> <N>,<RULE 9> <N>,<RULE 10> <N>",False
2464,ab188f42-30b5-44ba-a597-4f79079afc98,,True,True,2021-09-23,2021-09-23 11:52:45.042431+00:00,,,,No,False
2470,7a3788e1-95cd-432e-8f44-3eb7da2b2284,,True,True,2021-09-23,2021-09-23 12:46:02.724323+00:00,,,,No,False
2492,fe1b594c-eb31-4c31-915e-388b41761073,,True,True,2021-09-23,2021-09-23 17:57:50.951691+00:00,,,,SYS100007(Invalid State)/ SYS100005 (Additional Address Mandatory field missing),False
2493,b97764ba-a7d6-4e81-818a-a95ae4650a15,,True,True,2021-09-23,2021-09-23 18:23:08.617698+00:00,,,,SYS100007(Invalid State)/ SYS100005 (Additional Address Mandatory field missing),False
2577,4d718bdc-4709-44c1-9b67-0fcc24ae8cf9,,True,True,2021-09-24,2021-09-24 14:10:27.467356+00:00,,,,SYS100007(Invalid State)/ SYS100005 (Additional Address Mandatory field missing),False
2583,9aed8717-6e25-42e9-9ef3-a5039bb6163b,,True,True,2021-09-24,2021-09-24 14:21:52.027310+00:00,,,,SYS100007(Invalid State)/ SYS100005 (Additional Address Mandatory field missing),False
2601,a226c32e-dd2d-4616-bc17-5fe357d73bf6,,True,True,2021-09-24,2021-09-24 16:37:36.581293+00:00,,,,Yes,True
2607,820d0513-d746-49bb-b13f-038c8430ec21,True,True,True,2021-09-24,2021-11-03 04:43:07.974963+00:00,False,False,,SYS100007(Invalid State)/ SYS100005 (Additional Address Mandatory field missing),False
2612,b14016e6-6f44-4570-91d9-19db84800f6c,,True,True,2021-09-25,2021-09-25 03:48:06.667943+00:00,,,,No,False
2623,96668b23-52d2-4727-9d72-fb3948b09bff,,True,True,2021-09-25,2021-09-25 07:33:30.997626+00:00,,,,No,False
2679,85e77f70-bf3e-4f34-bd69-7f7dc5c357df,,True,True,2021-10-19,2021-10-19 17:22:45.163656+00:00,,,,SYS100007(Invalid State)/ SYS100005 (Additional Address Mandatory field missing),False
2688,8130768b-2876-40ac-bfb4-335d86ad2734,,True,True,2021-10-20,2021-10-20 05:30:28.354260+00:00,,,,Json Failure - Issue at our AWS end,False
2689,865bc319-66ae-4136-a185-1fd1ce1660d8,,True,True,2021-10-20,2021-10-20 06:17:25.807256+00:00,,,,Wrong State Code ,False
2728,b68db855-b5c3-4f00-bb34-99221b4dacd1,,True,True,2021-10-27,2021-10-27 12:54:39.704362+00:00,,,,"<RULE 1> <N>,<RULE 2> <N>,<RULE 3> <Y>,<RULE 4> <Y>,<RULE 5> <Y>,<RULE 6> <Y>,<RULE 7> <Y>,<RULE 8> <N>,<RULE 9> <N>,<RULE 10> <N>",False
2790,579ce2ff-532e-4da4-a1bc-310757d460b9,,True,True,2021-10-17,2021-10-17 13:15:23.742550+00:00,,,,Json Failure - Issue at our AWS end,False
2793,10f73d84-8c2f-44d1-828f-17656cbcda94,,True,True,2021-10-17,2021-10-17 13:15:41.282321+00:00,,,,Json Failure - Issue at our AWS end,False
2820,6fd6a3c6-0197-4dbf-92ec-7a4153c37ba3,,True,True,2021-10-21,2021-10-21 14:54:11.336605+00:00,,,,"<RULE 1> <Y>,<RULE 2> <N>,<RULE 3> <N>,<RULE 4> <N>,<RULE 5> <N>,<RULE 6> <N>,<RULE 7> <N>,<RULE 8> <N>,<RULE 9> <N>,<RULE 10> <N>",False
2822,165db6ab-3b5c-4c1c-b378-5b5c1f34e12a,,True,True,2021-10-21,2021-10-21 15:32:29.425028+00:00,,,,SYS100007(Invalid State)/ SYS100005 (Additional Address Mandatory field missing),False
2838,c4fd6647-0af8-47fb-bcab-ff3e71358458,,True,True,2021-10-27,2021-10-27 12:59:03.328853+00:00,,,,SYS100007(Invalid State)/ SYS100005 (Additional Address Mandatory field missing),False
2847,7ec92a64-3bc2-4856-994b-b1a9c91841b9,,True,True,2021-10-27,2021-10-27 13:18:25.794788+00:00,,,,SYS100007(Invalid State)/ SYS100005 (Additional Address Mandatory field missing),False
2852,670c10e7-d2f0-4dd9-9983-b554f18667a9,,True,True,2021-09-25,2021-09-25 15:19:59.285094+00:00,,,,SYS100007(Invalid State)/ SYS100005 (Additional Address Mandatory field missing),False
2864,bfa88dad-56cd-4c0e-84c9-b70eb6077210,,True,True,2021-09-26,2021-09-26 04:57:32.594765+00:00,,,,SYS100007(Invalid State)/ SYS100005 (Additional Address Mandatory field missing),False
2873,d81836de-ca39-4fcb-bf22-baa443fe402b,,True,True,2021-09-26,2021-09-26 07:33:13.720453+00:00,,,,SYS100007(Invalid State)/ SYS100005 (Additional Address Mandatory field missing),False
2876,41bac14a-6ef1-429a-a7f2-a2990626c8cb,,True,True,2021-09-26,2021-09-26 08:02:04.432755+00:00,,,,SYS100007(Invalid State)/ SYS100005 (Additional Address Mandatory field missing),False
2877,fc07dc5a-dd33-4619-978a-bb6bef8436b1,,True,True,2021-09-26,2021-09-26 08:07:01.943954+00:00,,,,SYS100007(Invalid State)/ SYS100005 (Additional Address Mandatory field missing),False
2887,c151d3df-b141-402d-9e0c-53b607b80cc1,,True,True,2021-09-26,2021-09-26 09:05:16.224358+00:00,,,,Wrong State Code ,False
2898,4f86308b-e53c-41ad-9c84-f8bc74e0007a,,True,True,2021-09-26,2021-09-26 09:12:00.520517+00:00,,,,SYS100007(Invalid State)/ SYS100005 (Additional Address Mandatory field missing),False
2901,b9f22da5-936a-4a36-9486-b4d10557fd0c,,True,True,2021-09-26,2021-09-26 09:12:41.571815+00:00,,,,No,False
2903,d19cc52c-5e17-4f80-8944-6d5c7061ee04,,True,True,2021-09-26,2021-09-26 09:13:36.378996+00:00,,,,No,False
2911,46c52049-7cbd-4fc0-be0a-d5211bad87eb,,True,True,2021-09-26,2021-09-26 09:19:51.617751+00:00,,,,SYS100007(Invalid State)/ SYS100005 (Additional Address Mandatory field missing),False
2918,aa5d440d-ed6c-4742-86f8-e2185b5f46ff,,True,True,2021-09-26,2021-09-26 09:28:32.148375+00:00,,,,No,False
2921,7ba9a616-02ac-4e28-8e62-e7f7e4ee792f,,True,True,2021-09-26,2021-09-26 09:29:17.463705+00:00,,,,SYS100007(Invalid State)/ SYS100005 (Additional Address Mandatory field missing),False
2967,7a090393-dc77-4fa9-9d8e-708ca0ff2701,,True,True,2021-09-27,2021-09-27 05:20:20.922241+00:00,,,,SYS100007(Invalid State)/ SYS100005 (Additional Address Mandatory field missing),False
2989,ef497ffe-0815-4f58-9c42-3fa9644ff57d,,True,True,2021-10-11,2021-10-11 14:51:27.243200+00:00,,,,"<RULE 1> <N>,<RULE 2> <Y>,<RULE 3> <Y>,<RULE 4> <Y>,<RULE 5> <Y>,<RULE 6> <Y>,<RULE 7> <Y>,<RULE 8> <N>,<RULE 9> <N>,<RULE 10> <N>",False
2997,36605d37-eca4-4b94-935a-bc7d6f97edf6,,True,True,2021-10-17,2021-10-17 13:14:55.966519+00:00,,,,SYS100007(Invalid State)/ SYS100005 (Additional Address Mandatory field missing),False
3000,9a33bbe5-5bf6-461c-8988-b969ea1a88d6,,True,True,2021-10-17,2021-10-17 13:15:21.455667+00:00,,,,"<RULE 1> <Y>,<RULE 2> <N>,<RULE 3> <N>,<RULE 4> <N>,<RULE 5> <N>,<RULE 6> <Y>,<RULE 7> <N>,<RULE 8> <N>,<RULE 9> <N>,<RULE 10> <N>",False
3009,83ffe057-ca1b-4e71-9111-0276afdc4c4e,,True,True,2021-10-17,2021-10-17 13:15:42.165898+00:00,,,,Json Failure - Issue at our AWS end,False
3010,b63b6d09-56db-4df1-b846-5cbb3d051f3d,,True,True,2021-10-17,2021-10-17 13:15:42.375176+00:00,,,,Json Failure - Issue at our AWS end,False
3017,b37ceb23-2507-498f-9495-8663231b921b,,True,True,2021-10-18,2021-10-18 16:20:42.653920+00:00,,,,SYS100007(Invalid State)/ SYS100005 (Additional Address Mandatory field missing),False
3045,87119fc4-fc2c-4408-baec-df40f4c86423,,True,True,2021-10-21,2021-10-21 15:28:27.364814+00:00,,,,SYS100007(Invalid State)/ SYS100005 (Additional Address Mandatory field missing),False
3046,bb6f4ce7-b85f-4ca1-88b5-f79f3186fb73,,True,True,2021-10-21,2021-10-21 15:56:29.265872+00:00,,,,SYS100007(Invalid State)/ SYS100005 (Additional Address Mandatory field missing),False
3062,2c25402b-a559-4ad8-8843-2f034bde7fba,,True,True,2021-10-26,2021-10-26 09:11:21.148104+00:00,,,,"<RULE 1> <Y>,<RULE 2> <N>,<RULE 3> <N>,<RULE 4> <N>,<RULE 5> <N>,<RULE 6> <N>,<RULE 7> <N>,<RULE 8> <N>,<RULE 9> <Y>,<RULE 10> <N>",False
3069,2da2cf7d-3f1a-4b80-bd31-b124eef37c27,,True,True,2021-10-27,2021-10-27 12:36:14.911053+00:00,,,,"<RULE 1> <Y>,<RULE 2> <N>,<RULE 3> <N>,<RULE 4> <N>,<RULE 5> <N>,<RULE 6> <N>,<RULE 7> <N>,<RULE 8> <N>,<RULE 9> <N>,<RULE 10> <N>",False
3076,59a11f57-b6f9-43c1-a1a8-9ccb165d3195,,True,True,2021-09-27,2021-09-27 01:32:45.571335+00:00,,,,Yes,True
3113,2f43fdb5-40e9-49f2-ad10-bb15dbafaea4,,True,True,2021-10-18,2021-10-18 11:10:04.320404+00:00,,,,"<RULE 1> <Y>,<RULE 2> <N>,<RULE 3> <N>,<RULE 4> <N>,<RULE 5> <N>,<RULE 6> <N>,<RULE 7> <N>,<RULE 8> <N>,<RULE 9> <N>,<RULE 10> <N>",False
3128,524ada04-28e6-4d3a-a7cc-7a42fc741fd5,,True,True,2021-10-21,2021-10-21 19:22:08.011681+00:00,,,,SYS100007(Invalid State)/ SYS100005 (Additional Address Mandatory field missing),False
3140,0355cb2f-9c46-4327-95f7-5218bab9ce3b,,True,True,2021-10-22,2021-10-22 13:02:33.661215+00:00,,,,SYS100007(Invalid State)/ SYS100005 (Additional Address Mandatory field missing),False
3144,8f1df4cd-2bb6-4db5-b6ba-49fc21214dcc,,True,True,2021-10-22,2021-10-22 13:03:48.088556+00:00,,,,"<RULE 1> <Y>,<RULE 2> <N>,<RULE 3> <N>,<RULE 4> <N>,<RULE 5> <N>,<RULE 6> <N>,<RULE 7> <N>,<RULE 8> <N>,<RULE 9> <Y>,<RULE 10> <N>",False
3164,029f5e0b-0411-4917-be05-24d8c2a303ab,,True,True,2021-10-26,2021-10-26 03:43:26.237903+00:00,,,,SYS100007(Invalid State)/ SYS100005 (Additional Address Mandatory field missing),False
3191,865dcb4e-15d2-41f8-b326-7e557725fdfe,,True,True,2021-10-13,2021-10-13 14:27:23.776340+00:00,,,,SYS100007(Invalid State)/ SYS100005 (Additional Address Mandatory field missing),False
3194,08e500f6-13af-42dd-88ee-335ec7f7649c,,True,True,2021-10-13,2021-10-13 15:06:13.477073+00:00,,,,"<RULE 1> <N>,<RULE 2> <N>,<RULE 3> <Y>,<RULE 4> <Y>,<RULE 5> <Y>,<RULE 6> <Y>,<RULE 7> <Y>,<RULE 8> <N>,<RULE 9> <N>,<RULE 10> <N>",False
3197,3e342a65-4741-4283-b9f5-03822816e27f,,True,True,2021-10-13,2021-10-13 15:14:51.803265+00:00,,,,Json Failure - Issue at our AWS end,False
3199,bfa08c13-4b43-4f0c-bcb9-dbac3c848b6e,,True,True,2021-10-13,2021-10-13 15:44:31.855704+00:00,,,,SYS100007(Invalid State)/ SYS100005 (Additional Address Mandatory field missing),False
3206,2ef616e3-a858-4bc0-9bd6-fcf95f5683f5,True,True,True,2021-10-14,2021-11-02 18:49:33.549003+00:00,False,False,,SYS100007(Invalid State)/ SYS100005 (Additional Address Mandatory field missing),False
3214,ac9ca9e3-081d-4622-8c04-763f3eb80c1e,,True,True,2021-10-14,2021-10-14 08:30:27.109251+00:00,,,,Wrong State Code ,False
3247,152c1af1-3052-4ebf-835d-bdf8d4a96646,,True,True,2021-10-21,2021-10-21 17:02:21.978051+00:00,,,,SYS100007(Invalid State)/ SYS100005 (Additional Address Mandatory field missing),False
3248,eb06133b-1a02-4255-9a69-f50352cc21bc,,True,True,2021-10-21,2021-10-21 17:14:03.375462+00:00,,,,SYS100004  (No record found),False
3249,aba45634-a010-4d30-bb0c-1de097eceeae,,True,True,2021-10-21,2021-10-21 17:27:07.897309+00:00,,,,"<RULE 1> <Y>,<RULE 2> <N>,<RULE 3> <N>,<RULE 4> <N>,<RULE 5> <N>,<RULE 6> <Y>,<RULE 7> <N>,<RULE 8> <N>,<RULE 9> <N>,<RULE 10> <N>",False
3254,654a5f04-0727-4c4b-a7d0-33fc07cca951,,True,True,2021-10-22,2021-10-22 04:24:22.036547+00:00,,,,SYS100007(Invalid State)/ SYS100005 (Additional Address Mandatory field missing),False
3281,8d39f724-1756-473f-8519-f0960ebb4c1d,,True,True,2021-10-25,2021-10-25 09:52:49.847313+00:00,,,,SYS100007(Invalid State)/ SYS100005 (Additional Address Mandatory field missing),False
3340,ca543857-2eb3-471f-b3f2-d862ed38dc2f,,True,True,2021-09-28,2021-09-28 04:06:32.339795+00:00,,,,Yes,True
3342,cef5a776-0847-4c4b-856e-0275e0b7f269,,True,True,2021-09-28,2021-09-28 04:09:44.653050+00:00,,,,SYS100007(Invalid State)/ SYS100005 (Additional Address Mandatory field missing),False
3344,86b1b6bb-c6ed-4472-aa59-2de6fd969fbb,,True,True,2021-09-28,2021-09-28 04:14:58.882905+00:00,,,,SYS100007(Invalid State)/ SYS100005 (Additional Address Mandatory field missing),False
3347,5feaca15-f45f-4ede-814c-e5499699f52e,,True,True,2021-09-28,2021-09-28 04:34:58.692587+00:00,,,,SYS100007(Invalid State)/ SYS100005 (Additional Address Mandatory field missing),False
3369,84f65bee-0339-4f74-a903-d7913136902d,,True,True,2021-09-28,2021-09-28 06:53:40.578915+00:00,,,,Json Failure - Issue at our AWS end,False
3377,611ec1f9-7268-4026-891f-f9176b00ce67,,True,True,2021-09-28,2021-09-28 07:45:09.648573+00:00,,,,SYS100007(Invalid PIN Code/Invalid Additional Address PIN),False
3385,f711d2f0-0358-48bf-be56-cf0aadf5112d,,True,True,2021-09-28,2021-09-28 08:48:32.331952+00:00,,,,Yes,True
3387,1bcc33a3-dd9f-4749-b8a8-8ae8095cc257,,True,True,2021-09-28,2021-09-28 08:54:24.572735+00:00,,,,SYS100007(Invalid State)/ SYS100005 (Additional Address Mandatory field missing),False
3398,25d98700-7d48-49e6-8311-7bfa6e1a7e53,,True,True,2021-09-28,2021-09-28 10:01:23.209989+00:00,,,,SYS100007(Invalid State)/ SYS100005 (Additional Address Mandatory field missing),False
3417,35b1e95f-f48f-42dc-b5b8-c6801cae8bad,,True,True,2021-10-14,2021-10-14 08:29:18.602307+00:00,,,,"<RULE 1> <Y>,<RULE 2> <N>,<RULE 3> <N>,<RULE 4> <N>,<RULE 5> <N>,<RULE 6> <N>,<RULE 7> <N>,<RULE 8> <N>,<RULE 9> <N>,<RULE 10> <N>",False
3452,90502d92-2048-46c4-abdc-e0a6597adf33,,True,True,2021-10-22,2021-10-22 13:02:29.909839+00:00,,,,"<RULE 1> <N>,<RULE 2> <N>,<RULE 3> <Y>,<RULE 4> <Y>,<RULE 5> <Y>,<RULE 6> <Y>,<RULE 7> <Y>,<RULE 8> <N>,<RULE 9> <N>,<RULE 10> <N>",False
3455,d87aed22-c2eb-458d-88c4-7d8c75c8f000,,True,True,2021-10-22,2021-10-22 13:03:25.296195+00:00,,,,"<RULE 1> <N>,<RULE 2> <Y>,<RULE 3> <Y>,<RULE 4> <Y>,<RULE 5> <Y>,<RULE 6> <Y>,<RULE 7> <Y>,<RULE 8> <N>,<RULE 9> <N>,<RULE 10> <N>",False
3456,5abf1892-bdc4-49a2-b69f-ed63c8015f96,,True,True,2021-10-22,2021-10-22 13:03:36.068912+00:00,,,,"<RULE 1> <N>,<RULE 2> <N>,<RULE 3> <Y>,<RULE 4> <Y>,<RULE 5> <Y>,<RULE 6> <Y>,<RULE 7> <Y>,<RULE 8> <N>,<RULE 9> <N>,<RULE 10> <N>",False
3559,c224988f-ea05-440c-8174-a4bc4f95daf1,,True,True,2021-10-22,2021-10-22 13:04:10.176432+00:00,,,,"<RULE 1> <Y>,<RULE 2> <N>,<RULE 3> <N>,<RULE 4> <N>,<RULE 5> <N>,<RULE 6> <N>,<RULE 7> <N>,<RULE 8> <N>,<RULE 9> <N>,<RULE 10> <N>",False
3594,8d115af6-dd97-4b2b-8ffa-9ed54bc49c5b,,True,True,2021-10-25,2021-10-25 14:28:22.985870+00:00,,,,"<RULE 1> <N>,<RULE 2> <Y>,<RULE 3> <Y>,<RULE 4> <Y>,<RULE 5> <Y>,<RULE 6> <Y>,<RULE 7> <Y>,<RULE 8> <N>,<RULE 9> <N>,<RULE 10> <N>",False
3596,3f5c8fef-00c1-4aca-af23-e1193a335b49,,True,True,2021-10-25,2021-10-25 14:30:13.584579+00:00,,,,SYS100007(Invalid State)/ SYS100005 (Additional Address Mandatory field missing),False
3632,21e18303-b469-4b52-a1a8-acd54d9bd4e2,,True,True,2021-09-28,2021-09-28 13:39:55.720519+00:00,,,,Wrong State Code ,False
3650,1e817167-e023-4fca-b2c5-a4f4c8e2ded6,True,True,True,2021-10-19,2021-11-03 05:16:23.616798+00:00,False,True,,"<RULE 1> <Y>,<RULE 2> <N>,<RULE 3> <N>,<RULE 4> <N>,<RULE 5> <N>,<RULE 6> <N>,<RULE 7> <N>,<RULE 8> <N>,<RULE 9> <N>,<RULE 10> <N>",False
3656,0c788a1f-dc5c-448c-ad54-6e121d6a8191,,True,True,2021-10-20,2021-10-20 07:12:00.136651+00:00,,,,"<RULE 1> <N>,<RULE 2> <Y>,<RULE 3> <Y>,<RULE 4> <Y>,<RULE 5> <Y>,<RULE 6> <Y>,<RULE 7> <Y>,<RULE 8> <N>,<RULE 9> <N>,<RULE 10> <N>",False
3657,b1cd3db5-c380-4b4a-9ae3-04b84734057d,True,True,True,2021-10-20,2021-11-03 07:57:59.946415+00:00,False,False,,SYS100007(Invalid State)/ SYS100005 (Additional Address Mandatory field missing),False
3665,7a5c57b2-bcfc-47de-87c9-12e95f386d69,,True,True,2021-10-22,2021-10-22 13:10:11.871541+00:00,,,,SYS100007(Invalid State)/ SYS100005 (Additional Address Mandatory field missing),False
3693,9664882b-5834-47e2-a3f6-1eaeb5311a83,,True,True,2021-10-25,2021-10-25 14:25:34.974297+00:00,,,,Wrong State Code ,False
3736,081002b7-e58e-4acb-be5c-2c6219a1d5b8,,True,True,2021-10-27,2021-10-27 10:38:15.936791+00:00,,,,SYS100007(Invalid State)/ SYS100005 (Additional Address Mandatory field missing),False
3741,6710c5ce-0ccd-44b8-a5df-894c4fa4c54b,,True,True,2021-09-28,2021-09-28 13:22:36.671502+00:00,,,,No,False
3756,0b1a6ce6-bd6d-4b0f-b597-9e1b24d69d12,,True,True,2021-09-28,2021-09-28 16:53:43.294449+00:00,,,,Yes,True
3780,b19ae4ae-d4d6-45e2-801b-05ee0cbfaf28,,True,True,2021-09-29,2021-09-29 06:00:52.457419+00:00,,,,SYS100007(Invalid State)/ SYS100005 (Additional Address Mandatory field missing),False
3829,f54fba16-8431-4a57-854e-e986df482b84,,True,True,2021-09-30,2021-09-30 01:30:28.155015+00:00,,,,SYS100007(Invalid State)/ SYS100005 (Additional Address Mandatory field missing),False
3911,498dbb44-52aa-4def-9479-3569b6997227,,True,True,2021-10-25,2021-10-25 16:15:35.748728+00:00,,,,SYS100007(Invalid State)/ SYS100005 (Additional Address Mandatory field missing),False
3941,ba09ca5b-625d-4f0f-8431-35c149537a15,,True,True,2021-10-27,2021-10-27 13:44:45.407403+00:00,,,,"<RULE 1> <N>,<RULE 2> <Y>,<RULE 3> <Y>,<RULE 4> <Y>,<RULE 5> <Y>,<RULE 6> <Y>,<RULE 7> <Y>,<RULE 8> <N>,<RULE 9> <N>,<RULE 10> <N>",False
3967,401819d2-40c3-43f3-9a6f-e10ce674a0b5,,True,True,2021-10-14,2021-10-14 02:07:15.043990+00:00,,,,SYS100007(Invalid State)/ SYS100005 (Additional Address Mandatory field missing),False
3968,2095830e-e824-4efd-817c-7f88ef5f6dc7,True,True,True,2021-10-14,2021-11-03 03:29:34.124895+00:00,False,False,,SYS100007(Invalid State)/ SYS100005 (Additional Address Mandatory field missing),False
3980,dc74e433-c6f1-4407-8fca-4f3862c8792a,,True,True,2021-10-20,2021-10-20 08:29:27.247551+00:00,,,,"<RULE 1> <N>,<RULE 2> <N>,<RULE 3> <Y>,<RULE 4> <Y>,<RULE 5> <Y>,<RULE 6> <Y>,<RULE 7> <Y>,<RULE 8> <N>,<RULE 9> <N>,<RULE 10> <N>",False
3991,ae739c4f-f0e0-41e9-8dee-4f91a15ce8d5,,True,True,2021-10-20,2021-10-20 08:48:20.536485+00:00,,,,"<RULE 1> <N>,<RULE 2> <Y>,<RULE 3> <Y>,<RULE 4> <Y>,<RULE 5> <Y>,<RULE 6> <Y>,<RULE 7> <Y>,<RULE 8> <N>,<RULE 9> <N>,<RULE 10> <N>",False
3996,758ef89f-c673-4a3e-bbdc-ab03aa96c1c4,,True,True,2021-10-20,2021-10-20 09:02:37.676530+00:00,,,,SYS100007(Invalid State)/ SYS100005 (Additional Address Mandatory field missing),False
3997,1e3db712-144b-44fc-8a62-a5c27b0fe2c2,,True,True,2021-10-20,2021-10-20 09:09:08.761718+00:00,,,,"<RULE 1> <N>,<RULE 2> <N>,<RULE 3> <Y>,<RULE 4> <Y>,<RULE 5> <Y>,<RULE 6> <Y>,<RULE 7> <Y>,<RULE 8> <N>,<RULE 9> <N>,<RULE 10> <N>",False
4007,ab8e19d8-9f5b-4cf5-b9fb-751d322f9ea2,,True,True,2021-10-22,2021-10-22 13:08:11.805422+00:00,,,,Wrong State Code ,False
4038,9a20e0a4-4613-4a5e-9989-4030d33a1d4a,,True,True,2021-10-26,2021-10-26 03:38:45.210045+00:00,,,,SYS100007(Invalid State)/ SYS100005 (Additional Address Mandatory field missing),False
4039,3581dcb4-5ce7-452e-a87e-46b8ea0c2c1b,,True,True,2021-10-26,2021-10-26 05:03:31.803292+00:00,,,,SYS100007(Invalid State)/ SYS100005 (Additional Address Mandatory field missing),False
4057,65733bd7-b150-48bb-9519-0447d4d1a801,True,True,True,2021-10-26,2021-11-03 03:36:34.855008+00:00,True,False,,"<RULE 1> <Y>,<RULE 2> <N>,<RULE 3> <N>,<RULE 4> <N>,<RULE 5> <N>,<RULE 6> <N>,<RULE 7> <N>,<RULE 8> <N>,<RULE 9> <N>,<RULE 10> <N>",False
4063,90e39201-10de-481d-915a-3449e2e1e561,,True,True,2021-10-26,2021-10-26 09:57:54.289258+00:00,,,,"<RULE 1> <Y>,<RULE 2> <N>,<RULE 3> <N>,<RULE 4> <N>,<RULE 5> <N>,<RULE 6> <N>,<RULE 7> <N>,<RULE 8> <N>,<RULE 9> <Y>,<RULE 10> <N>",False
4112,7be6b100-6c0f-4597-8560-5b741a34db0d,,True,True,2021-10-22,2021-10-22 16:23:52.385990+00:00,,,,SYS100007(Invalid State)/ SYS100005 (Additional Address Mandatory field missing),False
4113,08c7e667-a590-43a9-a763-fcc41b4cd7ea,,True,True,2021-10-22,2021-10-22 16:39:16.854297+00:00,,,,SYS100007(Invalid State)/ SYS100005 (Additional Address Mandatory field missing),False
4117,b531422b-8027-4625-b117-230a2c055311,,True,True,2021-10-25,2021-10-25 14:24:30.671209+00:00,,,,"<RULE 1> <N>,<RULE 2> <Y>,<RULE 3> <Y>,<RULE 4> <Y>,<RULE 5> <Y>,<RULE 6> <Y>,<RULE 7> <Y>,<RULE 8> <N>,<RULE 9> <N>,<RULE 10> <N>",False
4139,278ea0fb-dacb-4c9c-a01d-626a33fc22c8,,True,True,2021-10-27,2021-10-27 12:58:53.063675+00:00,,,,"<RULE 1> <N>,<RULE 2> <Y>,<RULE 3> <Y>,<RULE 4> <Y>,<RULE 5> <Y>,<RULE 6> <Y>,<RULE 7> <Y>,<RULE 8> <N>,<RULE 9> <N>,<RULE 10> <N>",False
4168,0f6da080-551e-4bcf-954c-9d489121d483,,True,True,2021-10-28,2021-10-28 13:04:08.038415+00:00,,,,"<RULE 1> <Y>,<RULE 2> <N>,<RULE 3> <N>,<RULE 4> <N>,<RULE 5> <N>,<RULE 6> <Y>,<RULE 7> <N>,<RULE 8> <N>,<RULE 9> <N>,<RULE 10> <N>",False
4208,d9d6c498-83f5-4aae-9b2a-910dc6a802a3,,True,True,2021-10-01,2021-10-01 10:09:00.639191+00:00,,,,Yes,True
4221,e7fdd3c3-0582-476e-84ac-0cc31c036006,,True,True,2021-10-01,2021-10-01 12:46:57.045857+00:00,,,,SYS100007(Invalid State)/ SYS100005 (Additional Address Mandatory field missing),False
4241,28fc6a53-4dd4-465e-97e7-2503f9577b1e,,True,True,2021-10-01,2021-10-01 15:32:15.088132+00:00,,,,SYS100007(Invalid State)/ SYS100005 (Additional Address Mandatory field missing),False
4244,62f0080c-d060-4ec5-a1c8-b8f73e628421,,True,True,2021-10-01,2021-10-01 16:40:42.128478+00:00,,,,SYS100007(Invalid State)/ SYS100005 (Additional Address Mandatory field missing),False
4258,0e1e990d-1a2e-4582-a971-bad52b0cbc6d,,True,True,2021-10-01,2021-10-01 19:45:00.283151+00:00,,,,SYS100007(Invalid State)/ SYS100005 (Additional Address Mandatory field missing),False
4270,2c8ca8ae-a40d-4700-8996-4b0ab64039e4,,True,True,2021-10-02,2021-10-02 04:08:43.758408+00:00,,,,Yes,True
4303,c556eaa1-3e56-4dca-8ba8-85292b56c4a1,,True,True,2021-10-14,2021-10-14 09:33:21.865539+00:00,,,,SYS100007(Invalid State)/ SYS100005 (Additional Address Mandatory field missing),False
4305,5e1fa3c0-05c1-40fc-a31f-8248c7991f13,,True,True,2021-10-14,2021-10-14 09:42:03.430388+00:00,,,,"<RULE 1> <Y>,<RULE 2> <N>,<RULE 3> <N>,<RULE 4> <N>,<RULE 5> <N>,<RULE 6> <N>,<RULE 7> <N>,<RULE 8> <N>,<RULE 9> <N>,<RULE 10> <N>",False
4306,89aac425-03be-4288-bf17-7310e49dbdd3,,True,True,2021-10-14,2021-10-14 10:16:28.257037+00:00,,,,Wrong State Code ,False
4318,f7b7fab5-0ae3-4e01-b75c-a60b4269675f,False,True,True,2021-10-15,2021-11-03 03:52:52.561432+00:00,False,False,,"<RULE 1> <Y>,<RULE 2> <N>,<RULE 3> <N>,<RULE 4> <N>,<RULE 5> <N>,<RULE 6> <Y>,<RULE 7> <N>,<RULE 8> <N>,<RULE 9> <N>,<RULE 10> <N>",False
4334,c0985679-0c9a-409b-ad36-6823dddb02f8,,True,True,2021-10-20,2021-10-20 08:28:28.743140+00:00,,,,SYS100007(Invalid State)/ SYS100005 (Additional Address Mandatory field missing),False
4356,c9e8ae45-4398-436c-a15e-1dd6252dbd24,,True,True,2021-10-20,2021-10-20 09:12:31.977678+00:00,,,,SYS100007(Invalid State)/ SYS100005 (Additional Address Mandatory field missing),False
4368,c8cedce3-28c7-48c6-b892-47c4d46f6969,,True,True,2021-10-23,2021-10-23 08:41:57.610738+00:00,,,,"<RULE 1> <Y>,<RULE 2> <N>,<RULE 3> <N>,<RULE 4> <N>,<RULE 5> <N>,<RULE 6> <N>,<RULE 7> <N>,<RULE 8> <N>,<RULE 9> <N>,<RULE 10> <N>",False
4404,f1f83f8a-9c18-4ebd-b14d-8c64e2001cad,,True,True,2021-10-14,2021-10-14 10:19:01.191850+00:00,,,,SYS100007(Invalid State)/ SYS100005 (Additional Address Mandatory field missing),False
4408,510b88c2-78d0-41c7-9fa5-2c1016f80f7e,True,True,True,2021-10-15,2021-11-03 05:41:39.455633+00:00,False,True,,SYS100007(Invalid State)/ SYS100005 (Additional Address Mandatory field missing),False
4416,03c696bf-1034-4c1d-8b5b-d639c645f188,,True,True,2021-10-18,2021-10-18 08:39:51.968563+00:00,,,,SYS100007(Invalid State)/ SYS100005 (Additional Address Mandatory field missing),False
4418,bc9b286c-964a-4c62-8142-b16dc7fa07ae,,True,True,2021-10-18,2021-10-18 08:40:23.824938+00:00,,,,SYS100007(Invalid State)/ SYS100005 (Additional Address Mandatory field missing),False
4422,995f8ff4-a312-4dd6-bfc3-54d8fb395e6b,,True,True,2021-10-18,2021-10-18 08:45:30.736399+00:00,,,,SYS100004  (No record found),False
4424,83c2a31a-9b81-4792-897d-ebde14b7b54b,,True,True,2021-10-18,2021-10-18 08:48:11.698408+00:00,,,,SYS100007(Invalid State)/ SYS100005 (Additional Address Mandatory field missing),False
4427,9edaa0ff-710b-4cc0-a9ad-5bb297381d08,,True,True,2021-10-18,2021-10-18 08:51:57.535045+00:00,,,,SYS100007(Invalid State)/ SYS100005 (Additional Address Mandatory field missing),False
4428,326c52d2-20f6-424d-b1a1-e3eb419373f9,,True,True,2021-10-18,2021-10-18 08:53:26.061843+00:00,,,,Wrong State Code ,False
4452,79a3a0e3-47a8-4768-af54-358143c257bf,,True,True,2021-10-23,2021-10-23 09:44:28.477565+00:00,,,,SYS100007(Invalid State)/ SYS100005 (Additional Address Mandatory field missing),False
4457,532f3e9e-f2d3-40a5-8308-cb18376be363,,True,True,2021-10-23,2021-10-23 12:59:57.381584+00:00,,,,SYS100007(Invalid State)/ SYS100005 (Additional Address Mandatory field missing),False
4501,31478961-7061-48c7-a561-4f4998030503,,True,True,2021-10-14,2021-10-14 09:49:08.723629+00:00,,,,"<RULE 1> <Y>,<RULE 2> <N>,<RULE 3> <N>,<RULE 4> <N>,<RULE 5> <N>,<RULE 6> <Y>,<RULE 7> <N>,<RULE 8> <N>,<RULE 9> <N>,<RULE 10> <N>",False
4505,71b83e9c-ab9a-4c0c-bee1-c566396fedce,,True,True,2021-10-15,2021-10-15 05:10:36.542178+00:00,,,,SYS100007(Invalid State)/ SYS100005 (Additional Address Mandatory field missing),False
4531,b7b765a5-4afe-47f0-8be0-238b3fec0a59,,True,True,2021-10-23,2021-10-23 07:53:51.607547+00:00,,,,"<RULE 1> <N>,<RULE 2> <Y>,<RULE 3> <Y>,<RULE 4> <Y>,<RULE 5> <Y>,<RULE 6> <Y>,<RULE 7> <Y>,<RULE 8> <N>,<RULE 9> <N>,<RULE 10> <N>",False
4538,f0e694e1-9ab1-4957-aeec-7097a754da60,,True,True,2021-10-23,2021-10-23 10:12:58.873101+00:00,,,,"<RULE 1> <Y>,<RULE 2> <N>,<RULE 3> <N>,<RULE 4> <N>,<RULE 5> <N>,<RULE 6> <Y>,<RULE 7> <N>,<RULE 8> <N>,<RULE 9> <N>,<RULE 10> <N>",False
4553,4cf25b8b-f5fc-4587-9252-9153940f38b3,,True,True,2021-10-25,2021-10-25 06:24:27.929701+00:00,,,,"<RULE 1> <Y>,<RULE 2> <N>,<RULE 3> <N>,<RULE 4> <N>,<RULE 5> <N>,<RULE 6> <N>,<RULE 7> <N>,<RULE 8> <N>,<RULE 9> <N>,<RULE 10> <N>",False
4555,711f13dc-6c58-4302-84ab-52470cb63115,,True,True,2021-10-25,2021-10-25 11:13:29.651456+00:00,,,,SYS100007(Invalid State)/ SYS100005 (Additional Address Mandatory field missing),False
4558,07b74f57-07b3-4926-8ef4-4a0810040d12,,True,True,2021-10-25,2021-10-25 14:24:57.021015+00:00,,,,"<RULE 1> <N>,<RULE 2> <Y>,<RULE 3> <Y>,<RULE 4> <Y>,<RULE 5> <Y>,<RULE 6> <Y>,<RULE 7> <Y>,<RULE 8> <N>,<RULE 9> <N>,<RULE 10> <N>",False
4568,917d675e-3130-4012-bac2-b43b60387723,True,True,True,2021-10-26,2021-11-03 06:56:55.593058+00:00,False,False,,"<RULE 1> <N>,<RULE 2> <N>,<RULE 3> <Y>,<RULE 4> <Y>,<RULE 5> <Y>,<RULE 6> <Y>,<RULE 7> <Y>,<RULE 8> <N>,<RULE 9> <N>,<RULE 10> <N>",False
4578,b4e4a540-d328-4d1f-a739-7b3a64466028,,True,True,2021-10-27,2021-10-27 12:54:47.282468+00:00,,,,"<RULE 1> <Y>,<RULE 2> <N>,<RULE 3> <N>,<RULE 4> <N>,<RULE 5> <N>,<RULE 6> <Y>,<RULE 7> <N>,<RULE 8> <N>,<RULE 9> <N>,<RULE 10> <N>",False
4588,881ef6bb-69b7-4e27-b8e8-655d6c98336f,,True,True,2021-10-27,2021-10-27 13:00:16.783178+00:00,,,,SYS100007(Invalid State)/ SYS100005 (Additional Address Mandatory field missing),False
4605,8fc9d2b0-5b12-4fb1-8338-00124ace5cbe,,True,True,2021-10-02,2021-10-02 07:29:06.264007+00:00,,,,SYS100007(Invalid State)/ SYS100005 (Additional Address Mandatory field missing),False
4615,350e7c4f-d857-4354-8a55-5f0e5341dfc5,,True,True,2021-10-02,2021-10-02 09:37:57.869445+00:00,,,,No,False
4627,a0b5280f-1d83-458e-b98d-3273b7a2aef5,,True,True,2021-10-02,2021-10-02 10:10:19.066190+00:00,,,,SYS100007(Invalid State)/ SYS100005 (Additional Address Mandatory field missing),False
4638,73631963-af36-4cee-b831-1661a191376f,,True,True,2021-10-02,2021-10-02 11:59:31.369620+00:00,,,,Wrong State Code ,False
4640,ab209953-7565-4bca-8716-7be334d80575,,True,True,2021-10-02,2021-10-02 12:07:09.646073+00:00,,,,SYS100007(Invalid State)/ SYS100005 (Additional Address Mandatory field missing),False
4660,e3912ede-df3e-40d4-8a90-666fda4b9cbf,,True,True,2021-10-02,2021-10-02 13:13:51.410510+00:00,,,,Yes,True
4672,d9330690-26a2-4d50-9a41-d9fe7f4be297,,True,True,2021-10-02,2021-10-02 14:17:28.520304+00:00,,,,SYS100007(Invalid PIN Code/Invalid Additional Address PIN),False
4680,79f9544f-94f6-4e6e-ac72-61b5769a6643,,True,True,2021-10-02,2021-10-02 15:00:08.808693+00:00,,,,SYS100007(Invalid State)/ SYS100005 (Additional Address Mandatory field missing),False
4681,90c22bd3-20c5-42ea-a2a8-3b512017548a,,True,True,2021-10-02,2021-10-02 15:02:35.427322+00:00,,,,No,False
4683,1a28d972-54f3-4301-b20a-7754d9c76be2,,True,True,2021-10-02,2021-10-02 15:03:12.057903+00:00,,,,SYS100007(Invalid State)/ SYS100005 (Additional Address Mandatory field missing),False
4723,17e067d8-6c31-42fb-b87b-51684bcce676,,True,True,2021-10-03,2021-10-03 02:53:05.544804+00:00,,,,SYS100007(Invalid State)/ SYS100005 (Additional Address Mandatory field missing),False
4738,4e163ed4-e7fc-480b-b274-c527a312cf38,,True,True,2021-10-15,2021-10-15 04:14:11.596927+00:00,,,,SYS100007(Invalid State)/ SYS100005 (Additional Address Mandatory field missing),False
4741,757fb3ea-d246-4ae4-bdca-a555462f0996,,True,True,2021-10-15,2021-10-15 08:57:25.408764+00:00,,,,Wrong State Code ,False
4742,d9680c5f-9f84-4757-b36b-320fcb4df9e5,,True,True,2021-10-15,2021-10-15 09:14:16.045149+00:00,,,,SYS100007(Invalid State)/ SYS100005 (Additional Address Mandatory field missing),False
4749,84457fbd-2067-408c-a836-df46c79e5c97,,True,True,2021-10-18,2021-10-18 08:38:36.318648+00:00,,,,Wrong State Code ,False
4753,ef037dc2-300b-400c-ba36-87a271694c1c,,True,True,2021-10-18,2021-10-18 08:40:17.468010+00:00,,,,"<RULE 1> <N>,<RULE 2> <N>,<RULE 3> <N>,<RULE 4> <N>,<RULE 5> <N>,<RULE 6> <Y>,<RULE 7> <Y>,<RULE 8> <N>,<RULE 9> <N>,<RULE 10> <N>",False
4755,7f26cdb9-e894-4970-9c8c-14aea3dc4f63,,True,True,2021-10-18,2021-10-18 08:41:39.267480+00:00,,,,SYS100007(Invalid State)/ SYS100005 (Additional Address Mandatory field missing),False
4771,c923c4ee-bc53-4ab7-a725-ec9c32bdf76f,,True,True,2021-10-20,2021-10-20 08:28:56.495911+00:00,,,,SYS100007(Invalid State)/ SYS100005 (Additional Address Mandatory field missing),False
4777,c786b980-7dd5-4093-9d5b-6d24e47a241c,,True,True,2021-10-22,2021-10-22 19:57:11.890752+00:00,,,,"<RULE 1> <Y>,<RULE 2> <N>,<RULE 3> <N>,<RULE 4> <N>,<RULE 5> <N>,<RULE 6> <N>,<RULE 7> <N>,<RULE 8> <N>,<RULE 9> <N>,<RULE 10> <N>",False
4779,761f5c5d-a603-4197-8b49-2492a98404c6,,True,True,2021-10-23,2021-10-23 05:21:22.429412+00:00,,,,"<RULE 1> <Y>,<RULE 2> <N>,<RULE 3> <N>,<RULE 4> <N>,<RULE 5> <N>,<RULE 6> <N>,<RULE 7> <N>,<RULE 8> <N>,<RULE 9> <Y>,<RULE 10> <N>",False
4784,3a9f29cf-5e8a-4008-b004-925f98aa0ca3,,True,True,2021-10-23,2021-10-23 07:58:00.384267+00:00,,,,"<RULE 1> <Y>,<RULE 2> <N>,<RULE 3> <N>,<RULE 4> <N>,<RULE 5> <N>,<RULE 6> <N>,<RULE 7> <N>,<RULE 8> <N>,<RULE 9> <N>,<RULE 10> <N>",False
4795,6c7bd814-655b-4bb9-a017-ad00a65563fc,,True,True,2021-10-23,2021-10-23 12:03:21.635759+00:00,,,,"<RULE 1> <Y>,<RULE 2> <N>,<RULE 3> <N>,<RULE 4> <N>,<RULE 5> <N>,<RULE 6> <Y>,<RULE 7> <N>,<RULE 8> <N>,<RULE 9> <N>,<RULE 10> <N>",False
4802,87932fe8-8f6e-4566-8f81-c27e4e5c3e1c,,True,True,2021-10-23,2021-10-23 17:15:17.888988+00:00,,,,SYS100007(Invalid State)/ SYS100005 (Additional Address Mandatory field missing),False
4803,238b7d64-1a67-43c7-94d8-29a96acce954,,True,True,2021-10-23,2021-10-23 17:45:14.452757+00:00,,,,"<RULE 1> <Y>,<RULE 2> <N>,<RULE 3> <N>,<RULE 4> <N>,<RULE 5> <N>,<RULE 6> <N>,<RULE 7> <N>,<RULE 8> <N>,<RULE 9> <N>,<RULE 10> <N>",False
4848,26d21f0c-0cf3-410d-9dd1-b9e8bfd8c350,,True,True,2021-10-15,2021-10-15 10:18:51.817717+00:00,,,,SYS100007(Invalid State)/ SYS100005 (Additional Address Mandatory field missing),False
4851,fc9d74b8-a3ed-4765-a123-fa1b86bcc045,,True,True,2021-10-15,2021-10-15 11:03:40.874599+00:00,,,,SYS100007(Invalid State)/ SYS100005 (Additional Address Mandatory field missing),False
4859,5baecfd8-a930-4863-aab9-bbc84d4ebbf1,,True,True,2021-10-18,2021-10-18 08:47:54.282445+00:00,,,,"<RULE 1> <N>,<RULE 2> <Y>,<RULE 3> <Y>,<RULE 4> <Y>,<RULE 5> <Y>,<RULE 6> <Y>,<RULE 7> <Y>,<RULE 8> <N>,<RULE 9> <N>,<RULE 10> <N>",False
4889,786af035-76ba-4ec2-8680-9966f5adff09,,True,True,2021-10-25,2021-10-25 14:25:07.125290+00:00,,,,SYS100004  (No record found),False
4891,5a9f6003-1e2e-429c-843a-661603121869,,True,True,2021-10-26,2021-10-26 08:43:17.178281+00:00,,,,"<RULE 1> <N>,<RULE 2> <Y>,<RULE 3> <Y>,<RULE 4> <Y>,<RULE 5> <Y>,<RULE 6> <Y>,<RULE 7> <Y>,<RULE 8> <N>,<RULE 9> <N>,<RULE 10> <N>",False
4913,4edd0649-9ebe-4453-ad90-84f762ffb81b,,True,True,2021-10-27,2021-10-27 16:00:01.707471+00:00,,,,SYS100007(Invalid State)/ SYS100005 (Additional Address Mandatory field missing),False
4917,5f9777f0-3b98-428e-a9a6-dda809e8d25b,,True,True,2021-10-28,2021-10-28 11:09:49.453105+00:00,,,,Json Failure - Issue at our AWS end,False
4932,06581ef0-cb36-4d17-9b41-3282f3d9dbc3,,True,True,2021-10-28,2021-10-28 13:09:59.276892+00:00,,,,Wrong State Code ,False
4954,f49c048d-2b7e-4192-bf5c-bd580ab8eef4,,True,True,2021-10-20,2021-10-20 08:52:27.634839+00:00,,,,"<RULE 1> <Y>,<RULE 2> <N>,<RULE 3> <N>,<RULE 4> <N>,<RULE 5> <N>,<RULE 6> <N>,<RULE 7> <N>,<RULE 8> <N>,<RULE 9> <N>,<RULE 10> <N>",False
4999,71e4ef6a-e8ae-4346-aab8-4a56542b3b5c,,True,True,2021-10-27,2021-10-27 13:00:56.525850+00:00,,,,SYS100004  (No record found),False
5011,fe0778a6-7117-43ee-9b7c-f0056a5dc18e,,True,True,2021-10-27,2021-10-27 14:47:41.348153+00:00,,,,SYS100007(Invalid State)/ SYS100005 (Additional Address Mandatory field missing),False
5021,a193d6ad-c341-478f-a20e-6846988057ef,,True,True,2021-10-28,2021-10-28 13:03:24.416634+00:00,,,,SYS100007(Invalid State)/ SYS100005 (Additional Address Mandatory field missing),False
5040,1b2a9318-0756-415d-a836-810bb3a4a9ee,,True,True,2021-10-28,2021-10-28 13:10:58.787575+00:00,,,,"<RULE 1> <Y>,<RULE 2> <N>,<RULE 3> <N>,<RULE 4> <N>,<RULE 5> <N>,<RULE 6> <N>,<RULE 7> <N>,<RULE 8> <N>,<RULE 9> <N>,<RULE 10> <N>",False
5042,00fa4319-a0d2-4f2d-b8c5-fb19cc6e7afd,,True,True,2021-10-28,2021-10-28 13:11:05.597920+00:00,,,,"<RULE 1> <N>,<RULE 2> <Y>,<RULE 3> <Y>,<RULE 4> <Y>,<RULE 5> <Y>,<RULE 6> <Y>,<RULE 7> <Y>,<RULE 8> <N>,<RULE 9> <N>,<RULE 10> <N>",False
5043,9a814ec4-c527-477e-b3d6-dfb3fd5c6fbc,,True,True,2021-10-28,2021-10-28 13:11:07.280045+00:00,,,,"<RULE 1> <Y>,<RULE 2> <N>,<RULE 3> <N>,<RULE 4> <N>,<RULE 5> <N>,<RULE 6> <N>,<RULE 7> <N>,<RULE 8> <N>,<RULE 9> <N>,<RULE 10> <N>",False
5071,e1dda424-9296-4d42-99ef-c14354723b73,True,True,True,2021-10-03,2021-11-03 07:08:17.495764+00:00,False,True,,Wrong State Code ,False
5072,404ae42e-8596-425f-94e3-b687cfbb0b29,True,True,True,2021-10-03,2021-11-03 02:12:04.970332+00:00,False,True,,Yes,True
5078,0ceef494-4795-4a86-8579-806546441877,,True,True,2021-10-14,2021-10-14 16:47:58.097718+00:00,,,,SYS100007(Invalid State)/ SYS100005 (Additional Address Mandatory field missing),False
5111,d6bdb4d9-7b99-45eb-91a6-66112d5860e7,,True,True,2021-10-24,2021-10-24 11:31:48.833797+00:00,,,,Json Failure - Issue at our AWS end,False
5174,a50c1ac7-b669-407b-a71d-fce052776ab9,,True,True,2021-11-11,2021-11-11 13:55:19.433218+00:00,,,,"{'RULE 1': 'N', 'RULE 10': 'N', 'RULE 2': 'N', 'RULE 3': 'Y', 'RULE 4': 'Y', 'RULE 5': 'Y', 'RULE 6': 'Y', 'RULE 7': 'Y', 'RULE 8': 'N', 'RULE 9': 'N'}",False
5182,fcd59448-ec6b-4e5c-a4db-bb33593fa0d6,,True,True,2021-11-12,2021-11-12 05:03:52.526955+00:00,,,,Json Failure - Issue at our AWS end,False
5299,69879889-c587-4adc-baf7-54cd0398376f,,True,True,2021-10-28,2021-10-28 13:12:13.373235+00:00,,,,SYS100007(Invalid State)/ SYS100005 (Additional Address Mandatory field missing),False
5301,34bb9a88-368e-444f-b59f-5ace9396553b,,True,True,2021-10-28,2021-10-28 13:14:39.434841+00:00,,,,SYS100007(Invalid State)/ SYS100005 (Additional Address Mandatory field missing),False
5453,9f13c6cc-83aa-402b-8f52-b50164ea3512,,True,True,2021-11-12,2021-11-12 06:40:06.151338+00:00,,,,"{'RULE 1': 'N', 'RULE 10': 'N', 'RULE 2': 'Y', 'RULE 3': 'Y', 'RULE 4': 'Y', 'RULE 5': 'Y', 'RULE 6': 'Y', 'RULE 7': 'Y', 'RULE 8': 'N', 'RULE 9': 'N'}",False
5518,d9bb84be-34c8-4a8b-bb45-197d0b73cc63,,True,True,2021-11-12,2021-11-12 06:40:42.994324+00:00,,,,"{'RULE 1': 'N', 'RULE 10': 'N', 'RULE 2': 'Y', 'RULE 3': 'Y', 'RULE 4': 'Y', 'RULE 5': 'Y', 'RULE 6': 'Y', 'RULE 7': 'Y', 'RULE 8': 'N', 'RULE 9': 'N'}",False
5530,8470635a-ca88-48a4-9cfe-220429b481a9,,True,True,2021-11-12,2021-11-12 11:26:10.089726+00:00,,,,"{'RULE 1': 'Y', 'RULE 10': 'N', 'RULE 2': 'N', 'RULE 3': 'N', 'RULE 4': 'N', 'RULE 5': 'N', 'RULE 6': 'N', 'RULE 7': 'N', 'RULE 8': 'N', 'RULE 9': 'N'}",False
5715,461cc447-9a3d-48ef-b3e2-3d5f4f02283c,,True,True,2021-10-28,2021-10-28 13:18:48.049217+00:00,,,,"<RULE 1> <Y>,<RULE 2> <N>,<RULE 3> <N>,<RULE 4> <N>,<RULE 5> <N>,<RULE 6> <N>,<RULE 7> <N>,<RULE 8> <N>,<RULE 9> <N>,<RULE 10> <N>",False
5729,ae8c637e-f3c2-4337-bfaa-a194ae263198,,True,True,2021-10-28,2021-10-28 13:21:37.659674+00:00,,,,"<RULE 1> <N>,<RULE 2> <Y>,<RULE 3> <Y>,<RULE 4> <Y>,<RULE 5> <Y>,<RULE 6> <Y>,<RULE 7> <Y>,<RULE 8> <N>,<RULE 9> <N>,<RULE 10> <N>",False
5738,2db221ce-abe4-4005-8b87-b77ad3134f74,,True,True,2021-10-28,2021-10-28 13:23:37.376373+00:00,,,,SYS100007(Invalid State)/ SYS100005 (Additional Address Mandatory field missing),False
5744,b456f66c-0f56-45bb-ae34-3a8145cec313,,True,True,2021-10-28,2021-10-28 13:25:46.925393+00:00,,,,SYS100007(Invalid State)/ SYS100005 (Additional Address Mandatory field missing),False
5785,6d9e7fbd-dd89-4357-8ca9-467f027d7079,,True,True,2021-10-28,2021-10-28 13:44:49.658684+00:00,,,,SYS100007(Invalid State)/ SYS100005 (Additional Address Mandatory field missing),False
5818,e6d0baec-568f-45d1-a77e-f871e5979964,,True,True,2021-10-28,2021-10-28 15:48:55.852052+00:00,,,,SYS100007(Invalid State)/ SYS100005 (Additional Address Mandatory field missing),False
5845,aa2d153c-c1ef-424f-a605-65b2c36cb88f,,True,True,2021-11-20,2021-11-20 11:36:41.754485+00:00,,,,"{'RULE 1': 'Y', 'RULE 10': 'N', 'RULE 2': 'N', 'RULE 3': 'N', 'RULE 4': 'N', 'RULE 5': 'N', 'RULE 6': 'N', 'RULE 7': 'N', 'RULE 8': 'N', 'RULE 9': 'Y'}",False
5952,96fc2c9a-4016-4506-8b8e-593044a12305,,True,True,2021-11-26,2021-11-26 08:21:32.249438+00:00,,,,"{'RULE 1': 'Y', 'RULE 10': 'N', 'RULE 2': 'N', 'RULE 3': 'N', 'RULE 4': 'N', 'RULE 5': 'N', 'RULE 6': 'N', 'RULE 7': 'N', 'RULE 8': 'N', 'RULE 9': 'N'}",False
6005,59e03b30-ffa4-4fdf-a753-e8be324c4cbd,,True,True,2021-11-13,2021-11-13 20:21:34.078729+00:00,,,,Json Failure - Issue at our AWS end,False
6088,b4a5ed0f-bab1-46cf-a800-b8fe2f546515,,True,True,2021-10-29,2021-10-29 06:19:07.744747+00:00,,,,Json Failure - Issue at our AWS end,False
6122,1d79ea45-c511-4709-a820-2531a10f2aea,,True,True,2021-10-29,2021-10-29 15:09:52.212786+00:00,,,,"{'RULE 1': 'Y', 'RULE 10': 'N', 'RULE 2': 'N', 'RULE 3': 'N', 'RULE 4': 'N', 'RULE 5': 'N', 'RULE 6': 'Y', 'RULE 7': 'N', 'RULE 8': 'N', 'RULE 9': 'N'}",False
6233,e7aad1e6-5732-42b9-a1bb-e60b9e719c48,,True,True,2021-10-29,2021-10-29 16:02:19.752072+00:00,,,,Json Failure - Issue at our AWS end,False
6339,55eb8a61-86aa-4e57-be61-a01a94cdfec5,,True,True,2021-10-30,2021-10-30 07:56:05.648770+00:00,,,,"{'RULE 1': 'N', 'RULE 10': 'N', 'RULE 2': 'Y', 'RULE 3': 'Y', 'RULE 4': 'Y', 'RULE 5': 'Y', 'RULE 6': 'Y', 'RULE 7': 'Y', 'RULE 8': 'N', 'RULE 9': 'N'}",False
6345,7d50d18d-8f56-4ff2-a5e4-6aaf3c5f8a6b,,True,True,2021-10-30,2021-10-30 07:57:31.217129+00:00,,,,"{'RULE 1': 'Y', 'RULE 10': 'N', 'RULE 2': 'N', 'RULE 3': 'N', 'RULE 4': 'N', 'RULE 5': 'N', 'RULE 6': 'Y', 'RULE 7': 'N', 'RULE 8': 'N', 'RULE 9': 'N'}",False
6348,ae729e74-9f03-4bc2-b5d4-37645bea3781,,True,True,2021-10-30,2021-10-30 07:57:59.120193+00:00,,,,"{'RULE 1': 'N', 'RULE 10': 'N', 'RULE 2': 'Y', 'RULE 3': 'Y', 'RULE 4': 'Y', 'RULE 5': 'Y', 'RULE 6': 'Y', 'RULE 7': 'Y', 'RULE 8': 'N', 'RULE 9': 'N'}",False
6361,2ecc4f84-e3eb-4749-b926-db8772d95fab,,True,True,2021-10-30,2021-10-30 08:04:04.147617+00:00,,,,"{'RULE 1': 'Y', 'RULE 10': 'N', 'RULE 2': 'N', 'RULE 3': 'N', 'RULE 4': 'N', 'RULE 5': 'N', 'RULE 6': 'Y', 'RULE 7': 'N', 'RULE 8': 'N', 'RULE 9': 'N'}",False
6370,9c58f48d-a5e4-419a-a04a-64d24b2ef28d,,True,True,2021-10-30,2021-10-30 10:36:22.124524+00:00,,,,"{'RULE 1': 'Y', 'RULE 10': 'N', 'RULE 2': 'N', 'RULE 3': 'N', 'RULE 4': 'N', 'RULE 5': 'N', 'RULE 6': 'N', 'RULE 7': 'N', 'RULE 8': 'N', 'RULE 9': 'N'}",False
6398,d580b68d-9474-461d-b53f-56c27378773e,,True,True,2021-11-14,2021-11-14 08:13:41.651787+00:00,,,,"{'RULE 1': 'Y', 'RULE 10': 'N', 'RULE 2': 'N', 'RULE 3': 'N', 'RULE 4': 'N', 'RULE 5': 'N', 'RULE 6': 'N', 'RULE 7': 'N', 'RULE 8': 'N', 'RULE 9': 'Y'}",False
6488,4b223d73-70f8-414a-9166-ac8652929849,,True,True,2021-10-30,2021-10-30 08:06:48.382282+00:00,,,,Json Failure - Issue at our AWS end,False
6489,ed6d2bd4-08db-47e7-8621-52245dab6105,,True,True,2021-10-30,2021-10-30 08:07:15.659543+00:00,,,,Json Failure - Issue at our AWS end,False
6497,ab7f2b65-7ae0-49e8-b381-922c83b9aeba,,True,True,2021-10-30,2021-10-30 09:03:19.033962+00:00,,,,"{'RULE 1': 'N', 'RULE 10': 'N', 'RULE 2': 'Y', 'RULE 3': 'Y', 'RULE 4': 'Y', 'RULE 5': 'Y', 'RULE 6': 'Y', 'RULE 7': 'Y', 'RULE 8': 'N', 'RULE 9': 'N'}",False
6633,4826145f-069f-4366-8ae1-27a0500c723f,,True,True,2021-11-02,2021-11-02 13:53:12.898034+00:00,,,,Json Failure - Issue at our AWS end,False
6652,23666dcd-3d8b-476c-a95a-2f5c46b63871,True,True,True,2021-10-13,2021-11-02 18:42:15.631852+00:00,False,True,,SYS100007(Invalid State)/ SYS100005 (Additional Address Mandatory field missing),False
6654,5b2ed0dc-773d-4f0f-9b11-e5ada51d3aec,True,True,True,2021-10-22,2021-11-02 18:50:55.944645+00:00,False,True,,SYS100007(Invalid State)/ SYS100005 (Additional Address Mandatory field missing),False
6658,c4e9c41b-1a86-4dd0-9b5c-a7bd22993e49,True,True,True,2021-09-20,2021-11-02 19:57:46.410557+00:00,False,False,,Yes,True
6676,aec300d4-f1db-48fb-a923-a7be6bbfecbe,True,True,True,2021-10-14,2021-11-03 01:45:11.131910+00:00,True,False,,SYS100007(Invalid State)/ SYS100005 (Additional Address Mandatory field missing),False
6680,280d4282-912e-400a-85e8-8c9c910517ad,True,True,True,2021-10-01,2021-11-03 01:54:18.672335+00:00,False,False,,Yes,True
6685,76773f29-090f-4f34-9810-d28273b04526,True,True,True,2021-09-26,2021-11-03 02:35:44.287424+00:00,False,False,,SYS100007(Invalid State)/ SYS100005 (Additional Address Mandatory field missing),False
6686,745769ac-5bae-4db6-8d0d-d699497a1a25,True,True,True,2021-09-01,2021-11-03 02:39:29.429542+00:00,False,False,,Yes,True
6726,7f4be323-cb4c-4f10-908f-0bd925765c8c,True,True,True,2021-09-22,2021-11-03 02:16:23.652695+00:00,False,False,,Yes,True
6740,ef6bd5b2-4837-4b9e-8c61-993f2c12de86,True,True,True,2021-10-20,2021-11-03 04:24:13.327249+00:00,False,True,,"<RULE 1> <Y>,<RULE 2> <N>,<RULE 3> <N>,<RULE 4> <N>,<RULE 5> <N>,<RULE 6> <Y>,<RULE 7> <N>,<RULE 8> <N>,<RULE 9> <N>,<RULE 10> <N>",False
6744,c4e9c08e-f866-430a-afed-fd36bba4a935,True,True,True,2021-09-11,2021-11-03 04:47:18.541560+00:00,False,True,,Yes,True
6753,54ba018d-b525-4e44-8f5f-2cf881346e53,True,True,True,2021-10-15,2021-11-03 05:34:00.891732+00:00,False,False,,SYS100007(Invalid State)/ SYS100005 (Additional Address Mandatory field missing),False
6756,1909a3e2-0318-46c8-a198-ea569fb0d33b,True,True,True,2021-10-26,2021-11-03 05:53:55.337335+00:00,False,False,,"<RULE 1> <Y>,<RULE 2> <N>,<RULE 3> <N>,<RULE 4> <N>,<RULE 5> <N>,<RULE 6> <N>,<RULE 7> <N>,<RULE 8> <N>,<RULE 9> <N>,<RULE 10> <N>",False
6757,8a66d741-3c6a-43d8-863b-4e9dc1c4b6b9,True,True,True,2021-10-17,2021-11-03 05:54:44.260212+00:00,False,True,,SYS100007(Invalid State)/ SYS100005 (Additional Address Mandatory field missing),False
6778,dbaa297c-0f12-4042-8187-c8c427cc8697,,True,True,2021-11-03,2021-11-03 14:41:36.201517+00:00,,,,Json Failure - Issue at our AWS end,False
6798,1780f3ed-c455-4d63-a455-bbc5969a525f,,True,True,2021-11-16,2021-11-16 02:33:44.454967+00:00,,,,Json Failure - Issue at our AWS end,False
6800,fd6f83f9-bad6-45db-b181-cadc5b100cb3,,True,True,2021-11-16,2021-11-16 05:21:34.531220+00:00,,,,"{'RULE 1': 'N', 'RULE 10': 'N', 'RULE 2': 'N', 'RULE 3': 'Y', 'RULE 4': 'Y', 'RULE 5': 'Y', 'RULE 6': 'Y', 'RULE 7': 'Y', 'RULE 8': 'N', 'RULE 9': 'N'}",False
6816,e618cab5-5ac8-4696-9cda-fd7dd579d8fd,,True,True,2021-11-03,2021-11-03 08:58:48.234348+00:00,,,,Json Failure - Issue at our AWS end,False
6866,0e4d0d5f-b3b4-4284-8e29-e15275845391,,True,True,2021-11-03,2021-11-03 19:18:34.259792+00:00,,,,"{'RULE 1': 'N', 'RULE 10': 'N', 'RULE 2': 'N', 'RULE 3': 'Y', 'RULE 4': 'Y', 'RULE 5': 'Y', 'RULE 6': 'Y', 'RULE 7': 'Y', 'RULE 8': 'N', 'RULE 9': 'N'}",False
6939,846495be-f00a-4cd4-ad39-a27141983375,,True,True,2021-11-16,2021-11-16 12:05:41.486522+00:00,,,,"{'RULE 1': 'N', 'RULE 10': 'N', 'RULE 2': 'Y', 'RULE 3': 'Y', 'RULE 4': 'Y', 'RULE 5': 'Y', 'RULE 6': 'Y', 'RULE 7': 'Y', 'RULE 8': 'N', 'RULE 9': 'N'}",False
7118,3f23477c-2337-44ed-9692-0b4a1809044a,,True,True,2021-11-05,2021-11-05 10:07:09.865036+00:00,,,,"{'RULE 1': 'Y', 'RULE 10': 'N', 'RULE 2': 'N', 'RULE 3': 'N', 'RULE 4': 'N', 'RULE 5': 'N', 'RULE 6': 'N', 'RULE 7': 'N', 'RULE 8': 'N', 'RULE 9': 'N'}",False
7128,5b1e8188-8493-4c5f-bdba-72f41d6ef203,,True,True,2021-11-05,2021-11-05 10:08:08.493219+00:00,,,,"{'RULE 1': 'Y', 'RULE 10': 'N', 'RULE 2': 'N', 'RULE 3': 'N', 'RULE 4': 'N', 'RULE 5': 'N', 'RULE 6': 'Y', 'RULE 7': 'N', 'RULE 8': 'N', 'RULE 9': 'N'}",False
7431,8fff3ffc-67c0-40b0-abc9-b61f91976a85,,True,True,2021-11-06,2021-11-06 03:10:32.916795+00:00,,,,"{'RULE 1': 'Y', 'RULE 10': 'N', 'RULE 2': 'N', 'RULE 3': 'N', 'RULE 4': 'N', 'RULE 5': 'N', 'RULE 6': 'N', 'RULE 7': 'N', 'RULE 8': 'N', 'RULE 9': 'N'}",False
7522,aabcea6e-6a93-4ce5-86fd-5e7ef6216138,,True,True,2021-11-06,2021-11-06 12:23:34.788770+00:00,,,,"{'RULE 1': 'N', 'RULE 10': 'N', 'RULE 2': 'N', 'RULE 3': 'Y', 'RULE 4': 'Y', 'RULE 5': 'Y', 'RULE 6': 'Y', 'RULE 7': 'Y', 'RULE 8': 'N', 'RULE 9': 'N'}",False
7527,abf901dc-4599-4729-aead-041cade4f44f,,True,True,2021-11-06,2021-11-06 13:04:47.016155+00:00,,,,"{'RULE 1': 'N', 'RULE 10': 'N', 'RULE 2': 'Y', 'RULE 3': 'Y', 'RULE 4': 'Y', 'RULE 5': 'Y', 'RULE 6': 'Y', 'RULE 7': 'Y', 'RULE 8': 'N', 'RULE 9': 'N'}",False
7541,52f56db1-c51a-45a9-9390-980d1c34fe32,,True,True,2021-11-21,2021-11-21 13:37:49.810117+00:00,,,,"{'RULE 1': 'Y', 'RULE 10': 'N', 'RULE 2': 'N', 'RULE 3': 'N', 'RULE 4': 'N', 'RULE 5': 'N', 'RULE 6': 'N', 'RULE 7': 'N', 'RULE 8': 'N', 'RULE 9': 'N'}",False
7594,d71cfa40-b372-4f07-b14c-8ac8b1660fad,,True,True,2021-11-06,2021-11-06 12:21:26.627089+00:00,,,,"{'RULE 1': 'Y', 'RULE 10': 'N', 'RULE 2': 'N', 'RULE 3': 'N', 'RULE 4': 'N', 'RULE 5': 'N', 'RULE 6': 'N', 'RULE 7': 'N', 'RULE 8': 'N', 'RULE 9': 'Y'}",False
7605,a458bcec-eb0b-4fa3-a787-4cb2e47d82db,,True,True,2021-11-06,2021-11-06 13:46:11.439302+00:00,,,,Json Failure - Issue at our AWS end,False
7675,e2c43013-669e-4e59-85fc-522cf30a63f2,,True,True,2021-11-06,2021-11-06 15:30:55.423668+00:00,,,,Json Failure - Issue at our AWS end,False
7724,14ae9515-97eb-4053-940b-2ef5bee00d9c,,True,True,2021-11-07,2021-11-07 10:52:50.054191+00:00,,,,"{'RULE 1': 'N', 'RULE 10': 'N', 'RULE 2': 'Y', 'RULE 3': 'Y', 'RULE 4': 'Y', 'RULE 5': 'Y', 'RULE 6': 'Y', 'RULE 7': 'Y', 'RULE 8': 'N', 'RULE 9': 'N'}",False
7806,a7aba861-ae70-4a78-a371-eebdf9c6856c,,True,True,2021-11-18,2021-11-18 06:26:51.792381+00:00,,,,"{'RULE 1': 'N', 'RULE 10': 'N', 'RULE 2': 'N', 'RULE 3': 'Y', 'RULE 4': 'Y', 'RULE 5': 'Y', 'RULE 6': 'Y', 'RULE 7': 'Y', 'RULE 8': 'N', 'RULE 9': 'N'}",False
7811,74df7f18-cbf9-499a-9861-5594610c0d39,,True,True,2021-11-07,2021-11-07 09:53:23.052204+00:00,,,,"{'RULE 1': 'Y', 'RULE 10': 'N', 'RULE 2': 'N', 'RULE 3': 'N', 'RULE 4': 'N', 'RULE 5': 'N', 'RULE 6': 'Y', 'RULE 7': 'N', 'RULE 8': 'N', 'RULE 9': 'N'}",False
7840,5e5065a7-d026-4259-a031-7622d3503074,,True,True,2021-11-18,2021-11-18 01:17:27.225272+00:00,,,,"{'RULE 1': 'Y', 'RULE 10': 'N', 'RULE 2': 'N', 'RULE 3': 'N', 'RULE 4': 'N', 'RULE 5': 'N', 'RULE 6': 'N', 'RULE 7': 'N', 'RULE 8': 'N', 'RULE 9': 'Y'}",False
7865,935ddc5a-b843-4dc8-9d27-c4b10d201f1a,,True,True,2021-11-07,2021-11-07 10:00:34.098845+00:00,,,,"{'RULE 1': 'N', 'RULE 10': 'N', 'RULE 2': 'Y', 'RULE 3': 'Y', 'RULE 4': 'Y', 'RULE 5': 'Y', 'RULE 6': 'Y', 'RULE 7': 'Y', 'RULE 8': 'N', 'RULE 9': 'N'}",False
7945,a35fbaa8-66f1-46cf-bbc0-2eaeb795a443,,True,True,2021-11-21,2021-11-21 14:06:39.710684+00:00,,,,"{'RULE 1': 'N', 'RULE 10': 'N', 'RULE 2': 'N', 'RULE 3': 'N', 'RULE 4': 'N', 'RULE 5': 'N', 'RULE 6': 'Y', 'RULE 7': 'Y', 'RULE 8': 'N', 'RULE 9': 'N'}",False
7972,c89d5932-113a-4744-9549-85b84e270ac8,,True,True,2021-11-08,2021-11-08 11:01:00.718310+00:00,,,,"{'RULE 1': 'Y', 'RULE 10': 'N', 'RULE 2': 'N', 'RULE 3': 'N', 'RULE 4': 'N', 'RULE 5': 'N', 'RULE 6': 'N', 'RULE 7': 'N', 'RULE 8': 'N', 'RULE 9': 'N'}",False
7982,cc2bfebd-c804-4f9e-8da5-2e0bdc738c4f,,True,True,2021-11-18,2021-11-18 13:31:08.891558+00:00,,,,"{'RULE 1': 'N', 'RULE 10': 'N', 'RULE 2': 'Y', 'RULE 3': 'Y', 'RULE 4': 'Y', 'RULE 5': 'Y', 'RULE 6': 'Y', 'RULE 7': 'Y', 'RULE 8': 'N', 'RULE 9': 'N'}",False
8127,1cb0809d-72cb-4359-93e4-ce323b605e86,,True,True,2021-11-09,2021-11-09 07:28:31.169083+00:00,,,,Json Failure - Issue at our AWS end,False
8143,599ea34d-2a4f-4ed9-a0af-89679cb47021,,True,True,2021-11-09,2021-11-09 07:56:27.634836+00:00,,,,"{'RULE 1': 'Y', 'RULE 10': 'N', 'RULE 2': 'N', 'RULE 3': 'N', 'RULE 4': 'N', 'RULE 5': 'N', 'RULE 6': 'N', 'RULE 7': 'N', 'RULE 8': 'N', 'RULE 9': 'Y'}",False
8147,431a691d-c3bf-47d3-aa74-4bec9b92c5d4,,True,True,2021-11-09,2021-11-09 08:30:41.910264+00:00,,,,"{'RULE 1': 'Y', 'RULE 10': 'N', 'RULE 2': 'N', 'RULE 3': 'N', 'RULE 4': 'N', 'RULE 5': 'N', 'RULE 6': 'Y', 'RULE 7': 'N', 'RULE 8': 'N', 'RULE 9': 'N'}",False
8177,2716bc41-c807-417c-8868-304791d0beee,,True,True,2021-11-10,2021-11-10 04:05:19.247778+00:00,,,,Json Failure - Issue at our AWS end,False
8186,3bfbdbea-4c45-40a7-bd3b-a46a189e5cbd,,True,True,2021-11-18,2021-11-18 18:24:18.525568+00:00,,,,"{'RULE 1': 'N', 'RULE 10': 'N', 'RULE 2': 'N', 'RULE 3': 'N', 'RULE 4': 'N', 'RULE 5': 'N', 'RULE 6': 'Y', 'RULE 7': 'Y', 'RULE 8': 'N', 'RULE 9': 'N'}",False
8313,dae21879-b316-41a8-82f1-0aede006e932,,True,True,2021-11-09,2021-11-09 16:25:13.936264+00:00,,,,"{'RULE 1': 'N', 'RULE 10': 'N', 'RULE 2': 'N', 'RULE 3': 'Y', 'RULE 4': 'Y', 'RULE 5': 'Y', 'RULE 6': 'Y', 'RULE 7': 'Y', 'RULE 8': 'N', 'RULE 9': 'N'}",False
8372,8e6fcc66-daa3-449b-bd4d-41b8907e11e1,,True,True,2021-11-09,2021-11-09 09:44:38.656363+00:00,,,,"{'RULE 1': 'Y', 'RULE 10': 'N', 'RULE 2': 'N', 'RULE 3': 'N', 'RULE 4': 'N', 'RULE 5': 'N', 'RULE 6': 'N', 'RULE 7': 'N', 'RULE 8': 'N', 'RULE 9': 'Y'}",False
8377,2582899a-4118-452e-9751-1c639902c6ab,,True,True,2021-11-10,2021-11-10 10:40:07.992089+00:00,,,,"{'RULE 1': 'Y', 'RULE 10': 'N', 'RULE 2': 'N', 'RULE 3': 'N', 'RULE 4': 'N', 'RULE 5': 'N', 'RULE 6': 'Y', 'RULE 7': 'N', 'RULE 8': 'N', 'RULE 9': 'N'}",False
8412,c9f75794-eb83-403d-8d76-1ca347e648a0,,True,True,2021-11-10,2021-11-10 10:51:15.535560+00:00,,,,"{'RULE 1': 'N', 'RULE 10': 'N', 'RULE 2': 'Y', 'RULE 3': 'Y', 'RULE 4': 'Y', 'RULE 5': 'Y', 'RULE 6': 'Y', 'RULE 7': 'Y', 'RULE 8': 'N', 'RULE 9': 'N'}",False
8441,94bed475-4d86-4bb0-b3bd-1d585c6d6e76,,True,True,2021-11-10,2021-11-10 11:22:47.501124+00:00,,,,"{'RULE 1': 'N', 'RULE 10': 'N', 'RULE 2': 'Y', 'RULE 3': 'Y', 'RULE 4': 'Y', 'RULE 5': 'Y', 'RULE 6': 'Y', 'RULE 7': 'Y', 'RULE 8': 'N', 'RULE 9': 'N'}",False
8444,b14a28ad-bfab-4ad6-b0ce-2aa3121297eb,,True,True,2021-11-19,2021-11-19 02:31:58.260938+00:00,,,,Json Failure - Issue at our AWS end,False
8656,75f44485-7c71-4c56-8e40-30d762a7f138,,True,True,2021-11-11,2021-11-11 03:27:46.062206+00:00,,,,"{'RULE 1': 'N', 'RULE 10': 'N', 'RULE 2': 'N', 'RULE 3': 'N', 'RULE 4': 'N', 'RULE 5': 'N', 'RULE 6': 'Y', 'RULE 7': 'Y', 'RULE 8': 'N', 'RULE 9': 'N'}",False
8660,4c2d1e79-13ad-4297-89c9-f4d51aca8462,,True,True,2021-11-11,2021-11-11 09:04:06.962872+00:00,,,,Json Failure - Issue at our AWS end,False
8690,7c42c220-187d-4e2c-8ae8-9e7b79568563,,True,True,2021-11-11,2021-11-11 13:09:38.135362+00:00,,,,"{'RULE 1': 'Y', 'RULE 10': 'N', 'RULE 2': 'N', 'RULE 3': 'N', 'RULE 4': 'N', 'RULE 5': 'N', 'RULE 6': 'N', 'RULE 7': 'N', 'RULE 8': 'N', 'RULE 9': 'N'}",False
8696,a4f19dcb-3080-4c8e-8eeb-5857bed9a0f4,,True,True,2021-11-11,2021-11-11 13:17:07.019435+00:00,,,,"{'RULE 1': 'Y', 'RULE 10': 'N', 'RULE 2': 'N', 'RULE 3': 'N', 'RULE 4': 'N', 'RULE 5': 'N', 'RULE 6': 'N', 'RULE 7': 'N', 'RULE 8': 'N', 'RULE 9': 'N'}",False
8848,733d1bdd-1a47-4507-b293-e80ac982d4fd,,True,True,2021-11-11,2021-11-11 13:11:07.195918+00:00,,,,"{'RULE 1': 'Y', 'RULE 10': 'N', 'RULE 2': 'N', 'RULE 3': 'N', 'RULE 4': 'N', 'RULE 5': 'N', 'RULE 6': 'N', 'RULE 7': 'N', 'RULE 8': 'N', 'RULE 9': 'N'}",False
8961,247ab252-d1b5-43a6-9751-1fb906953b5c,,True,True,2021-11-22,2021-11-22 08:19:56.855381+00:00,,,,"{'RULE 1': 'Y', 'RULE 10': 'N', 'RULE 2': 'N', 'RULE 3': 'N', 'RULE 4': 'N', 'RULE 5': 'N', 'RULE 6': 'Y', 'RULE 7': 'N', 'RULE 8': 'N', 'RULE 9': 'N'}",False
8993,f023cb0a-1af3-4ff6-817f-e4fbf14433d6,,True,True,2021-11-27,2021-11-27 12:19:42.214294+00:00,,,,"{'RULE 1': 'N', 'RULE 10': 'N', 'RULE 2': 'Y', 'RULE 3': 'Y', 'RULE 4': 'Y', 'RULE 5': 'Y', 'RULE 6': 'Y', 'RULE 7': 'Y', 'RULE 8': 'N', 'RULE 9': 'N'}",False
9366,8eb5381d-1c72-454e-a1f4-32ea50a79cd7,,True,True,2021-11-29,2021-11-29 03:32:13.739780+00:00,,,,"{'RULE 1': 'Y', 'RULE 10': 'N', 'RULE 2': 'N', 'RULE 3': 'N', 'RULE 4': 'N', 'RULE 5': 'N', 'RULE 6': 'Y', 'RULE 7': 'N', 'RULE 8': 'N', 'RULE 9': 'N'}",False
9558,effb1a1a-a43f-4630-bd8f-c6b967e8bcfd,False,True,True,2021-10-28,2021-11-29 12:32:58.315754+00:00,False,True,,"<RULE 1> <Y>,<RULE 2> <N>,<RULE 3> <N>,<RULE 4> <N>,<RULE 5> <N>,<RULE 6> <N>,<RULE 7> <N>,<RULE 8> <N>,<RULE 9> <Y>,<RULE 10> <N>",False
10559,5171c24b-e9cc-4208-9014-f3a1a09fa993,,True,True,2021-11-25,2021-11-25 10:25:24.227275+00:00,,,,"{'RULE 1': 'Y', 'RULE 10': 'N', 'RULE 2': 'N', 'RULE 3': 'N', 'RULE 4': 'N', 'RULE 5': 'N', 'RULE 6': 'N', 'RULE 7': 'N', 'RULE 8': 'N', 'RULE 9': 'N'}",False
10569,65bf5ec8-ad63-4f62-a205-ae449800603c,,True,True,2021-10-30,2021-11-25 15:09:10.842174+00:00,,,,Json Failure - Issue at our AWS end,False
