{"itemCount":11162,"md5Checksum":"yGUgS4U0maC+LQqfaptc3A==","etag":"3c764d0c4e2e40007475437f1bf54ae2-1","dataFileS3Key":"AWSDynamoDB/01646629116993-86cf6bc4/data/2tlrnunc4477zoahuua3xtenne.json.gz"}
{"itemCount":11416,"md5Checksum":"DUC2GCD81cGEJ1382ujf2w==","etag":"c1687c92e932feb431fc855b5b75efd6-1","dataFileS3Key":"AWSDynamoDB/01646629116993-86cf6bc4/data/ek5yxqfbsa64tby3lieutp4tny.json.gz"}
{"itemCount":11453,"md5Checksum":"IQBpdDA5c7fGfYb/vDIMPw==","etag":"74c8d90d46745dc47f3b9f0b6bf965b2-1","dataFileS3Key":"AWSDynamoDB/01646629116993-86cf6bc4/data/iuskfzneum2dbfvlbnkrsecwra.json.gz"}
{"itemCount":11347,"md5Checksum":"R2/FMdB5J+O1r0TQaR3wXQ==","etag":"fa2c2000945ad269307b797dc3ccb3f8-1","dataFileS3Key":"AWSDynamoDB/01646629116993-86cf6bc4/data/4slbbugddmzd3mv5rzhx6z4wkq.json.gz"}
