{"itemCount":6775,"md5Checksum":"bQe4P//7KRJ5XkNyJK04TQ==","etag":"51b1952079bc81794b051ba52d475c1b-1","dataFileS3Key":"AWSDynamoDB/01639448306893-2e36bb39/data/wwuxvi2ycu5rpddpejuhsbvg3q.json.gz"}
{"itemCount":6955,"md5Checksum":"44HvopVorg5cu/a/+G7Oaw==","etag":"bd4d2f3a946b09220f942e4120a0f63a-1","dataFileS3Key":"AWSDynamoDB/01639448306893-2e36bb39/data/lwvzkdo43q7ormxeyvo3f4kcmq.json.gz"}
{"itemCount":6991,"md5Checksum":"B+X71KxFH5z86zlZP0cxAw==","etag":"8ec90a7a9a6db4ad5875fa15e73f3a36-1","dataFileS3Key":"AWSDynamoDB/01639448306893-2e36bb39/data/zzsg2z4nqi4abjc4xotktz7ytm.json.gz"}
{"itemCount":6917,"md5Checksum":"w0bJO+sGbOmCOr1YQKzAdA==","etag":"145cff13dc6ee5f1995720a7f5887163-1","dataFileS3Key":"AWSDynamoDB/01639448306893-2e36bb39/data/2gi6jd6ypm2utfkefcig6juxwi.json.gz"}
