[
  {
    "_id": "7e0b3cb0-41c1-11e9-a7ab-6fd8d1b4b606",
    "_type": "visualization",
    "_source": {
      "title": "Location",
      "visState": "{\"title\":\"Location\",\"type\":\"tile_map\",\"params\":{\"colorSchema\":\"Yellow to Red\",\"mapType\":\"Scaled Circle Markers\",\"isDesaturated\":true,\"addTooltip\":true,\"heatClusterSize\":1.5,\"legendPosition\":\"bottomright\",\"mapZoom\":2,\"mapCenter\":[0,0],\"wms\":{\"enabled\":false,\"options\":{\"format\":\"image/png\",\"transparent\":true},\"selectedTmsLayer\":{\"origin\":\"elastic_maps_service\",\"id\":\"road_map\",\"minZoom\":0,\"maxZoom\":18,\"attribution\":\"<p>&#169; <a href=\\\"http://www.openstreetmap.org/copyright\\\">OpenStreetMap</a> contributors | <a href=\\\"https://www.elastic.co/elastic-maps-service\\\">Elastic Maps Service</a></p>&#10;\"}}},\"aggs\":[{\"id\":\"1\",\"enabled\":true,\"type\":\"count\",\"schema\":\"metric\",\"params\":{}},{\"id\":\"2\",\"enabled\":true,\"type\":\"geohash_grid\",\"schema\":\"segment\",\"params\":{\"field\":\"location\",\"autoPrecision\":true,\"isFilteredByCollar\":true,\"useGeocentroid\":true,\"mapZoom\":5,\"mapCenter\":{\"lon\":18.061523437500004,\"lat\":52.32191088594773},\"mapBounds\":{\"bottom_right\":{\"lat\":40.44694705960048,\"lon\":41.30859375},\"top_left\":{\"lat\":61.689872200460016,\"lon\":-5.185546875000004}},\"precision\":4}}]}",
      "uiStateJSON": "{\"mapZoom\":6,\"mapCenter\":[61.11140578200479,12.963867187500002]}",
      "description": "",
      "version": 1,
      "kibanaSavedObjectMeta": {
        "searchSourceJSON": "{\"index\":\"5b0cfbc0-41be-11e9-a7ab-6fd8d1b4b606\",\"query\":{\"query\":\"\",\"language\":\"lucene\"},\"filter\":[]}"
      }
    },
    "_meta": {
      "savedObjectVersion": 2
    }
  },
  {
    "_id": "9dfe04a0-41bf-11e9-a7ab-6fd8d1b4b606",
    "_type": "visualization",
    "_source": {
      "title": "Humidity",
      "visState": "{\"title\":\"Humidity\",\"type\":\"gauge\",\"params\":{\"type\":\"gauge\",\"addTooltip\":true,\"addLegend\":true,\"isDisplayWarning\":false,\"gauge\":{\"verticalSplit\":false,\"extendRange\":true,\"percentageMode\":false,\"gaugeType\":\"Arc\",\"gaugeStyle\":\"Full\",\"backStyle\":\"Full\",\"orientation\":\"vertical\",\"colorSchema\":\"Green to Red\",\"gaugeColorMode\":\"Labels\",\"colorsRange\":[{\"from\":0,\"to\":50},{\"from\":50,\"to\":75},{\"from\":75,\"to\":100}],\"invertColors\":false,\"labels\":{\"show\":true,\"color\":\"black\"},\"scale\":{\"show\":true,\"labels\":false,\"color\":\"#333\"},\"type\":\"meter\",\"style\":{\"bgWidth\":0.9,\"width\":0.9,\"mask\":false,\"bgMask\":false,\"maskBars\":50,\"bgFill\":\"#eee\",\"bgColor\":false,\"subText\":\"\",\"fontSize\":60,\"labelColor\":true}}},\"aggs\":[{\"id\":\"1\",\"enabled\":true,\"type\":\"avg\",\"schema\":\"metric\",\"params\":{\"field\":\"humidity\",\"customLabel\":\"Humidity (%)\"}}]}",
      "uiStateJSON": "{\"vis\":{\"defaultColors\":{\"0 - 50\":\"rgb(0,104,55)\",\"50 - 75\":\"rgb(255,255,190)\",\"75 - 100\":\"rgb(165,0,38)\"}}}",
      "description": "",
      "version": 1,
      "kibanaSavedObjectMeta": {
        "searchSourceJSON": "{\"index\":\"5b0cfbc0-41be-11e9-a7ab-6fd8d1b4b606\",\"query\":{\"query\":\"\",\"language\":\"lucene\"},\"filter\":[]}"
      }
    },
    "_meta": {
      "savedObjectVersion": 2
    }
  },
  {
    "_id": "b1c1e510-41d3-11e9-a7ab-6fd8d1b4b606",
    "_type": "visualization",
    "_source": {
      "title": "Speed history",
      "visState": "{\"title\":\"Speed history\",\"type\":\"line\",\"params\":{\"type\":\"line\",\"grid\":{\"categoryLines\":false,\"style\":{\"color\":\"#eee\"}},\"categoryAxes\":[{\"id\":\"CategoryAxis-1\",\"type\":\"category\",\"position\":\"bottom\",\"show\":true,\"style\":{},\"scale\":{\"type\":\"linear\"},\"labels\":{\"show\":true,\"truncate\":100},\"title\":{}}],\"valueAxes\":[{\"id\":\"ValueAxis-1\",\"name\":\"LeftAxis-1\",\"type\":\"value\",\"position\":\"left\",\"show\":true,\"style\":{},\"scale\":{\"type\":\"linear\",\"mode\":\"normal\"},\"labels\":{\"show\":true,\"rotate\":0,\"filter\":false,\"truncate\":100},\"title\":{\"text\":\"Speed (km/h)\"}}],\"seriesParams\":[{\"show\":\"true\",\"type\":\"line\",\"mode\":\"normal\",\"data\":{\"label\":\"Speed (km/h)\",\"id\":\"1\"},\"valueAxis\":\"ValueAxis-1\",\"drawLinesBetweenPoints\":true,\"showCircles\":true}],\"addTooltip\":true,\"addLegend\":true,\"legendPosition\":\"right\",\"times\":[],\"addTimeMarker\":false},\"aggs\":[{\"id\":\"1\",\"enabled\":true,\"type\":\"avg\",\"schema\":\"metric\",\"params\":{\"field\":\"speed\",\"customLabel\":\"Speed (km/h)\"}},{\"id\":\"2\",\"enabled\":true,\"type\":\"date_histogram\",\"schema\":\"segment\",\"params\":{\"field\":\"timestamp\",\"timeRange\":{\"from\":\"now-15m\",\"to\":\"now\",\"mode\":\"quick\"},\"useNormalizedEsInterval\":true,\"interval\":\"auto\",\"time_zone\":\"Europe/Berlin\",\"drop_partials\":false,\"customInterval\":\"2h\",\"min_doc_count\":1,\"extended_bounds\":{}}}]}",
      "uiStateJSON": "{}",
      "description": "",
      "version": 1,
      "kibanaSavedObjectMeta": {
        "searchSourceJSON": "{\"index\":\"5b0cfbc0-41be-11e9-a7ab-6fd8d1b4b606\",\"query\":{\"query\":\"\",\"language\":\"lucene\"},\"filter\":[]}"
      }
    },
    "_meta": {
      "savedObjectVersion": 2
    }
  },
  {
    "_id": "1a0dfce0-41d3-11e9-a7ab-6fd8d1b4b606",
    "_type": "visualization",
    "_source": {
      "title": "Speed",
      "visState": "{\"title\":\"Speed\",\"type\":\"gauge\",\"params\":{\"type\":\"gauge\",\"addTooltip\":true,\"addLegend\":true,\"isDisplayWarning\":false,\"gauge\":{\"verticalSplit\":false,\"extendRange\":true,\"percentageMode\":false,\"gaugeType\":\"Arc\",\"gaugeStyle\":\"Full\",\"backStyle\":\"Full\",\"orientation\":\"vertical\",\"colorSchema\":\"Green to Red\",\"gaugeColorMode\":\"Labels\",\"colorsRange\":[{\"from\":0,\"to\":10},{\"from\":10,\"to\":20},{\"from\":20,\"to\":50}],\"invertColors\":false,\"labels\":{\"show\":true,\"color\":\"black\"},\"scale\":{\"show\":true,\"labels\":false,\"color\":\"#333\"},\"type\":\"meter\",\"style\":{\"bgWidth\":0.9,\"width\":0.9,\"mask\":false,\"bgMask\":false,\"maskBars\":50,\"bgFill\":\"#eee\",\"bgColor\":false,\"subText\":\"\",\"fontSize\":60,\"labelColor\":true}}},\"aggs\":[{\"id\":\"1\",\"enabled\":true,\"type\":\"avg\",\"schema\":\"metric\",\"params\":{\"field\":\"speed\",\"customLabel\":\"Speed (km/h)\"}}]}",
      "uiStateJSON": "{\"vis\":{\"defaultColors\":{\"0 - 10\":\"rgb(0,104,55)\",\"10 - 20\":\"rgb(255,255,190)\",\"20 - 50\":\"rgb(165,0,38)\"}}}",
      "description": "",
      "version": 1,
      "kibanaSavedObjectMeta": {
        "searchSourceJSON": "{\"index\":\"5b0cfbc0-41be-11e9-a7ab-6fd8d1b4b606\",\"query\":{\"query\":\"\",\"language\":\"lucene\"},\"filter\":[]}"
      }
    },
    "_meta": {
      "savedObjectVersion": 2
    }
  },
  {
    "_id": "90e0b060-41d3-11e9-a7ab-6fd8d1b4b606",
    "_type": "visualization",
    "_source": {
      "title": "Temperature history",
      "visState": "{\"title\":\"Temperature history\",\"type\":\"line\",\"params\":{\"type\":\"line\",\"grid\":{\"categoryLines\":false,\"style\":{\"color\":\"#eee\"}},\"categoryAxes\":[{\"id\":\"CategoryAxis-1\",\"type\":\"category\",\"position\":\"bottom\",\"show\":true,\"style\":{},\"scale\":{\"type\":\"linear\"},\"labels\":{\"show\":true,\"truncate\":100},\"title\":{}}],\"valueAxes\":[{\"id\":\"ValueAxis-1\",\"name\":\"LeftAxis-1\",\"type\":\"value\",\"position\":\"left\",\"show\":true,\"style\":{},\"scale\":{\"type\":\"linear\",\"mode\":\"normal\"},\"labels\":{\"show\":true,\"rotate\":0,\"filter\":false,\"truncate\":100},\"title\":{\"text\":\"Pi temperature (C)\"}}],\"seriesParams\":[{\"show\":\"true\",\"type\":\"line\",\"mode\":\"normal\",\"data\":{\"label\":\"Pi temperature (C)\",\"id\":\"1\"},\"valueAxis\":\"ValueAxis-1\",\"drawLinesBetweenPoints\":true,\"showCircles\":true}],\"addTooltip\":true,\"addLegend\":true,\"legendPosition\":\"right\",\"times\":[],\"addTimeMarker\":false},\"aggs\":[{\"id\":\"1\",\"enabled\":true,\"type\":\"avg\",\"schema\":\"metric\",\"params\":{\"field\":\"temperature\",\"customLabel\":\"Pi temperature (C)\"}},{\"id\":\"2\",\"enabled\":true,\"type\":\"date_histogram\",\"schema\":\"segment\",\"params\":{\"field\":\"timestamp\",\"timeRange\":{\"from\":\"now-1h\",\"to\":\"now\",\"mode\":\"quick\"},\"useNormalizedEsInterval\":true,\"interval\":\"auto\",\"time_zone\":\"Europe/Berlin\",\"drop_partials\":false,\"customInterval\":\"2h\",\"min_doc_count\":1,\"extended_bounds\":{}}}]}",
      "uiStateJSON": "{}",
      "description": "",
      "version": 1,
      "kibanaSavedObjectMeta": {
        "searchSourceJSON": "{\"index\":\"5b0cfbc0-41be-11e9-a7ab-6fd8d1b4b606\",\"query\":{\"query\":\"\",\"language\":\"lucene\"},\"filter\":[]}"
      }
    },
    "_meta": {
      "savedObjectVersion": 2
    }
  },
  {
    "_id": "b1103ef0-41ec-11e9-a7ab-6fd8d1b4b606",
    "_type": "visualization",
    "_source": {
      "title": "Acceleration",
      "visState": "{\"title\":\"Acceleration\",\"type\":\"goal\",\"params\":{\"addTooltip\":true,\"addLegend\":true,\"isDisplayWarning\":false,\"type\":\"gauge\",\"gauge\":{\"verticalSplit\":false,\"autoExtend\":false,\"percentageMode\":false,\"gaugeType\":\"Arc\",\"gaugeStyle\":\"Full\",\"backStyle\":\"Full\",\"orientation\":\"vertical\",\"useRanges\":false,\"colorSchema\":\"Green to Red\",\"gaugeColorMode\":\"None\",\"colorsRange\":[{\"from\":0,\"to\":0.8},{\"from\":0.8,\"to\":1.2},{\"from\":1.2,\"to\":1.5999999999999999},{\"from\":1.5999999999999999,\"to\":3}],\"invertColors\":false,\"labels\":{\"show\":true,\"color\":\"black\"},\"scale\":{\"show\":true,\"labels\":false,\"color\":\"#333\",\"width\":2},\"type\":\"meter\",\"style\":{\"bgFill\":\"#000\",\"bgColor\":false,\"labelColor\":false,\"subText\":\"\",\"fontSize\":60}}},\"aggs\":[{\"id\":\"1\",\"enabled\":true,\"type\":\"avg\",\"schema\":\"metric\",\"params\":{\"field\":\"acceleration.abs\",\"customLabel\":\"Acceleration (g)\"}}]}",
      "uiStateJSON": "{\"vis\":{\"defaultColors\":{\"0 - 0.8\":\"rgb(0,104,55)\",\"0.8 - 1.2\":\"rgb(183,224,117)\",\"1.2 - 1.5999999999999999\":\"rgb(253,191,111)\",\"1.5999999999999999 - 3\":\"rgb(165,0,38)\"},\"colors\":{\"0 - 0.8\":\"#EA6460\",\"0.8 - 1.2\":\"#508642\",\"1.2 - 1.5999999999999999\":\"#BF1B00\",\"1.5999999999999999 - 3\":\"#58140C\"}}}",
      "description": "",
      "version": 1,
      "kibanaSavedObjectMeta": {
        "searchSourceJSON": "{\"index\":\"5b0cfbc0-41be-11e9-a7ab-6fd8d1b4b606\",\"query\":{\"query\":\"\",\"language\":\"lucene\"},\"filter\":[]}"
      }
    },
    "_meta": {
      "savedObjectVersion": 2
    }
  },
  {
    "_id": "2a54fd50-41c0-11e9-a7ab-6fd8d1b4b606",
    "_type": "visualization",
    "_source": {
      "title": "Pressure",
      "visState": "{\"title\":\"Pressure\",\"type\":\"gauge\",\"params\":{\"type\":\"gauge\",\"addTooltip\":true,\"addLegend\":true,\"isDisplayWarning\":false,\"gauge\":{\"verticalSplit\":false,\"extendRange\":true,\"percentageMode\":false,\"gaugeType\":\"Arc\",\"gaugeStyle\":\"Full\",\"backStyle\":\"Full\",\"orientation\":\"vertical\",\"colorSchema\":\"Green to Red\",\"gaugeColorMode\":\"Labels\",\"colorsRange\":[{\"from\":0.9,\"to\":0.95},{\"from\":0.95,\"to\":1.05},{\"from\":1.05,\"to\":1.1}],\"invertColors\":false,\"labels\":{\"show\":true,\"color\":\"black\"},\"scale\":{\"show\":true,\"labels\":false,\"color\":\"#333\"},\"type\":\"meter\",\"style\":{\"bgWidth\":0.9,\"width\":0.9,\"mask\":false,\"bgMask\":false,\"maskBars\":50,\"bgFill\":\"#eee\",\"bgColor\":false,\"subText\":\"\",\"fontSize\":60,\"labelColor\":true}}},\"aggs\":[{\"id\":\"1\",\"enabled\":true,\"type\":\"avg\",\"schema\":\"metric\",\"params\":{\"field\":\"pressure\",\"customLabel\":\"Pressure (bar)\"}}]}",
      "uiStateJSON": "{\"vis\":{\"defaultColors\":{\"0.9 - 0.95\":\"rgb(0,104,55)\",\"0.95 - 1.05\":\"rgb(255,255,190)\",\"1.05 - 1.1\":\"rgb(165,0,38)\"},\"colors\":{\"0 - 50\":\"#BF1B00\",\"75 - 100\":\"#BF1B00\",\"50 - 75\":\"#508642\",\"0 - 90000\":\"#F29191\",\"110000 - 200000\":\"#BF1B00\",\"90000 - 110000\":\"#508642\",\"80000 - 90000\":\"#E24D42\",\"0.9 - 0.95\":\"#E24D42\",\"0.95 - 1.05\":\"#508642\"}}}",
      "description": "",
      "version": 1,
      "kibanaSavedObjectMeta": {
        "searchSourceJSON": "{\"index\":\"5b0cfbc0-41be-11e9-a7ab-6fd8d1b4b606\",\"query\":{\"query\":\"\",\"language\":\"lucene\"},\"filter\":[]}"
      }
    },
    "_meta": {
      "savedObjectVersion": 2
    }
  },
  {
    "_id": "2bd3dfb0-41c1-11e9-a7ab-6fd8d1b4b606",
    "_type": "visualization",
    "_source": {
      "title": "Temperature",
      "visState": "{\"title\":\"Temperature\",\"type\":\"gauge\",\"params\":{\"type\":\"gauge\",\"addTooltip\":true,\"addLegend\":true,\"isDisplayWarning\":false,\"gauge\":{\"verticalSplit\":false,\"extendRange\":true,\"percentageMode\":false,\"gaugeType\":\"Arc\",\"gaugeStyle\":\"Full\",\"backStyle\":\"Full\",\"orientation\":\"vertical\",\"colorSchema\":\"Green to Red\",\"gaugeColorMode\":\"Labels\",\"colorsRange\":[{\"from\":0,\"to\":25},{\"from\":25,\"to\":50},{\"from\":50,\"to\":100}],\"invertColors\":false,\"labels\":{\"show\":true,\"color\":\"black\"},\"scale\":{\"show\":true,\"labels\":false,\"color\":\"#333\"},\"type\":\"meter\",\"style\":{\"bgWidth\":0.9,\"width\":0.9,\"mask\":false,\"bgMask\":false,\"maskBars\":50,\"bgFill\":\"#eee\",\"bgColor\":false,\"subText\":\"\",\"fontSize\":60,\"labelColor\":true}}},\"aggs\":[{\"id\":\"1\",\"enabled\":true,\"type\":\"avg\",\"schema\":\"metric\",\"params\":{\"field\":\"temperature\",\"customLabel\":\"Pi temperature (C)\"}}]}",
      "uiStateJSON": "{\"vis\":{\"defaultColors\":{\"0 - 25\":\"rgb(0,104,55)\",\"25 - 50\":\"rgb(255,255,190)\",\"50 - 100\":\"rgb(165,0,38)\"},\"colors\":{\"0 - 10\":\"#CFFAFF\",\"10 - 50\":\"#508642\",\"50 - 100\":\"#BF1B00\",\"230 - 273.15\":\"#447EBC\",\"273.15 - 298.15\":\"#508642\",\"0 - 25\":\"#3F6833\",\"25 - 50\":\"#EA6460\"}}}",
      "description": "",
      "version": 1,
      "kibanaSavedObjectMeta": {
        "searchSourceJSON": "{\"index\":\"5b0cfbc0-41be-11e9-a7ab-6fd8d1b4b606\",\"query\":{\"query\":\"\",\"language\":\"lucene\"},\"filter\":[]}"
      }
    },
    "_meta": {
      "savedObjectVersion": 2
    }
  },
  {
    "_id": "149b7350-41ec-11e9-a7ab-6fd8d1b4b606",
    "_type": "visualization",
    "_source": {
      "title": "Acceleration history",
      "visState": "{\"title\":\"Acceleration history\",\"type\":\"line\",\"params\":{\"type\":\"line\",\"grid\":{\"categoryLines\":false,\"style\":{\"color\":\"#eee\"}},\"categoryAxes\":[{\"id\":\"CategoryAxis-1\",\"type\":\"category\",\"position\":\"bottom\",\"show\":true,\"style\":{},\"scale\":{\"type\":\"linear\"},\"labels\":{\"show\":true,\"truncate\":100},\"title\":{}}],\"valueAxes\":[{\"id\":\"ValueAxis-1\",\"name\":\"LeftAxis-1\",\"type\":\"value\",\"position\":\"left\",\"show\":true,\"style\":{},\"scale\":{\"type\":\"linear\",\"mode\":\"normal\"},\"labels\":{\"show\":true,\"rotate\":0,\"filter\":false,\"truncate\":100},\"title\":{\"text\":\"Acceleration\"}}],\"seriesParams\":[{\"show\":\"true\",\"type\":\"line\",\"mode\":\"normal\",\"data\":{\"label\":\"Absolute acceleration (g)\",\"id\":\"1\"},\"valueAxis\":\"ValueAxis-1\",\"drawLinesBetweenPoints\":true,\"showCircles\":true},{\"show\":true,\"mode\":\"normal\",\"type\":\"line\",\"drawLinesBetweenPoints\":true,\"showCircles\":true,\"data\":{\"id\":\"3\",\"label\":\"x-acceleration (g)\"},\"valueAxis\":\"ValueAxis-1\"},{\"show\":true,\"mode\":\"normal\",\"type\":\"line\",\"drawLinesBetweenPoints\":true,\"showCircles\":true,\"data\":{\"id\":\"4\",\"label\":\"y-acceleration (g)\"},\"valueAxis\":\"ValueAxis-1\"},{\"show\":true,\"mode\":\"normal\",\"type\":\"line\",\"drawLinesBetweenPoints\":true,\"showCircles\":true,\"data\":{\"id\":\"5\",\"label\":\"z-acceleration (g)\"},\"valueAxis\":\"ValueAxis-1\"}],\"addTooltip\":true,\"addLegend\":true,\"legendPosition\":\"right\",\"times\":[],\"addTimeMarker\":false},\"aggs\":[{\"id\":\"1\",\"enabled\":true,\"type\":\"avg\",\"schema\":\"metric\",\"params\":{\"field\":\"acceleration.abs\",\"customLabel\":\"Absolute acceleration (g)\"}},{\"id\":\"2\",\"enabled\":true,\"type\":\"date_histogram\",\"schema\":\"segment\",\"params\":{\"field\":\"timestamp\",\"timeRange\":{\"from\":\"now-15m\",\"to\":\"now\",\"mode\":\"quick\"},\"useNormalizedEsInterval\":true,\"interval\":\"auto\",\"time_zone\":\"Europe/Berlin\",\"drop_partials\":false,\"customInterval\":\"2h\",\"min_doc_count\":1,\"extended_bounds\":{},\"customLabel\":\"\"}},{\"id\":\"3\",\"enabled\":true,\"type\":\"avg\",\"schema\":\"metric\",\"params\":{\"field\":\"acceleration.x\",\"customLabel\":\"x-acceleration (g)\"}},{\"id\":\"4\",\"enabled\":true,\"type\":\"avg\",\"schema\":\"metric\",\"params\":{\"field\":\"acceleration.y\",\"customLabel\":\"y-acceleration (g)\"}},{\"id\":\"5\",\"enabled\":true,\"type\":\"avg\",\"schema\":\"metric\",\"params\":{\"field\":\"acceleration.z\",\"customLabel\":\"z-acceleration (g)\"}}]}",
      "uiStateJSON": "{}",
      "description": "",
      "version": 1,
      "kibanaSavedObjectMeta": {
        "searchSourceJSON": "{\"index\":\"5b0cfbc0-41be-11e9-a7ab-6fd8d1b4b606\",\"query\":{\"query\":\"\",\"language\":\"lucene\"},\"filter\":[]}"
      }
    },
    "_meta": {
      "savedObjectVersion": 2
    }
  },
  {
    "_id": "9856abd0-424e-11e9-9b11-0145943ebfbf",
    "_type": "visualization",
    "_source": {
      "title": "Speed map",
      "visState": "{\"title\":\"Speed map\",\"type\":\"tile_map\",\"params\":{\"colorSchema\":\"Yellow to Red\",\"mapType\":\"Heatmap\",\"isDesaturated\":true,\"addTooltip\":true,\"heatClusterSize\":1.5,\"legendPosition\":\"bottomright\",\"mapZoom\":2,\"mapCenter\":[0,0],\"wms\":{\"enabled\":false,\"options\":{\"format\":\"image/png\",\"transparent\":true},\"selectedTmsLayer\":{\"origin\":\"elastic_maps_service\",\"id\":\"road_map\",\"minZoom\":0,\"maxZoom\":18,\"attribution\":\"<p>&#169; <a href=\\\"http://www.openstreetmap.org/copyright\\\">OpenStreetMap</a> contributors | <a href=\\\"https://www.elastic.co/elastic-maps-service\\\">Elastic Maps Service</a></p>&#10;\"}}},\"aggs\":[{\"id\":\"1\",\"enabled\":true,\"type\":\"avg\",\"schema\":\"metric\",\"params\":{\"field\":\"speed\",\"customLabel\":\"Speed (km/h)\"}},{\"id\":\"2\",\"enabled\":true,\"type\":\"geohash_grid\",\"schema\":\"segment\",\"params\":{\"field\":\"location\",\"autoPrecision\":true,\"isFilteredByCollar\":true,\"useGeocentroid\":true,\"mapZoom\":13,\"mapCenter\":{\"lon\":10.711326599121094,\"lat\":59.962916479136254},\"mapBounds\":{\"bottom_right\":{\"lat\":59.929043982141664,\"lon\":10.802135467529297},\"top_left\":{\"lat\":59.996754379031124,\"lon\":10.620517730712892}},\"precision\":6}}]}",
      "uiStateJSON": "{\"mapZoom\":13,\"mapCenter\":[59.962916479136254,10.711326599121094]}",
      "description": "",
      "version": 1,
      "kibanaSavedObjectMeta": {
        "searchSourceJSON": "{\"index\":\"5b0cfbc0-41be-11e9-a7ab-6fd8d1b4b606\",\"query\":{\"query\":\"\",\"language\":\"lucene\"},\"filter\":[]}"
      }
    },
    "_meta": {
      "savedObjectVersion": 2
    }
  },
  {
    "_id": "3f320af0-424d-11e9-9b11-0145943ebfbf",
    "_type": "visualization",
    "_source": {
      "title": "Acceleration histogram",
      "visState": "{\"title\":\"Acceleration histogram\",\"type\":\"histogram\",\"params\":{\"type\":\"histogram\",\"grid\":{\"categoryLines\":false,\"style\":{\"color\":\"#eee\"}},\"categoryAxes\":[{\"id\":\"CategoryAxis-1\",\"type\":\"category\",\"position\":\"bottom\",\"show\":true,\"style\":{},\"scale\":{\"type\":\"linear\"},\"labels\":{\"show\":true,\"truncate\":100},\"title\":{}}],\"valueAxes\":[{\"id\":\"ValueAxis-1\",\"name\":\"LeftAxis-1\",\"type\":\"value\",\"position\":\"left\",\"show\":true,\"style\":{},\"scale\":{\"type\":\"linear\",\"mode\":\"normal\"},\"labels\":{\"show\":true,\"rotate\":0,\"filter\":false,\"truncate\":100},\"title\":{\"text\":\"Count\"}}],\"seriesParams\":[{\"show\":\"true\",\"type\":\"histogram\",\"mode\":\"stacked\",\"data\":{\"label\":\"Count\",\"id\":\"1\"},\"valueAxis\":\"ValueAxis-1\",\"drawLinesBetweenPoints\":true,\"showCircles\":true}],\"addTooltip\":true,\"addLegend\":true,\"legendPosition\":\"right\",\"times\":[],\"addTimeMarker\":false},\"aggs\":[{\"id\":\"1\",\"enabled\":true,\"type\":\"count\",\"schema\":\"metric\",\"params\":{}},{\"id\":\"2\",\"enabled\":true,\"type\":\"range\",\"schema\":\"segment\",\"params\":{\"field\":\"acceleration.abs\",\"ranges\":[{\"from\":0,\"to\":0.8},{\"from\":0.8,\"to\":0.9},{\"from\":0.9,\"to\":1},{\"from\":1,\"to\":1.1},{\"from\":1.1,\"to\":1.2},{\"from\":1.2,\"to\":1.3},{\"from\":1.3,\"to\":1.5},{\"from\":1.5,\"to\":2},{\"from\":2,\"to\":5}],\"customLabel\":\"Absolute acceleration (g)\"}}]}",
      "uiStateJSON": "{}",
      "description": "",
      "version": 1,
      "kibanaSavedObjectMeta": {
        "searchSourceJSON": "{\"index\":\"5b0cfbc0-41be-11e9-a7ab-6fd8d1b4b606\",\"query\":{\"query\":\"\",\"language\":\"lucene\"},\"filter\":[]}"
      }
    },
    "_meta": {
      "savedObjectVersion": 2
    }
  },
  {
    "_id": "77616f60-424d-11e9-9b11-0145943ebfbf",
    "_type": "visualization",
    "_source": {
      "title": "Speed histogram",
      "visState": "{\"aggs\":[{\"enabled\":true,\"id\":\"1\",\"params\":{},\"schema\":\"metric\",\"type\":\"count\"},{\"enabled\":true,\"id\":\"2\",\"params\":{\"customLabel\":\"Speed (km/h)\",\"field\":\"speed\",\"ranges\":[{\"from\":0,\"to\":2},{\"from\":2,\"to\":5},{\"from\":5,\"to\":10},{\"from\":10,\"to\":15},{\"from\":15,\"to\":20},{\"from\":20,\"to\":30},{\"from\":30,\"to\":50},{\"from\":50,\"to\":100}]},\"schema\":\"segment\",\"type\":\"range\"}],\"params\":{\"addLegend\":true,\"addTimeMarker\":false,\"addTooltip\":true,\"categoryAxes\":[{\"id\":\"CategoryAxis-1\",\"labels\":{\"show\":true,\"truncate\":100},\"position\":\"bottom\",\"scale\":{\"type\":\"linear\"},\"show\":true,\"style\":{},\"title\":{},\"type\":\"category\"}],\"grid\":{\"categoryLines\":false,\"style\":{\"color\":\"#eee\"}},\"legendPosition\":\"right\",\"seriesParams\":[{\"data\":{\"id\":\"1\",\"label\":\"Count\"},\"drawLinesBetweenPoints\":true,\"mode\":\"stacked\",\"show\":\"true\",\"showCircles\":true,\"type\":\"histogram\",\"valueAxis\":\"ValueAxis-1\"}],\"times\":[],\"type\":\"histogram\",\"valueAxes\":[{\"id\":\"ValueAxis-1\",\"labels\":{\"filter\":false,\"rotate\":0,\"show\":true,\"truncate\":100},\"name\":\"LeftAxis-1\",\"position\":\"left\",\"scale\":{\"mode\":\"normal\",\"type\":\"linear\"},\"show\":true,\"style\":{},\"title\":{\"text\":\"Count\"},\"type\":\"value\"}]},\"title\":\"Speed histogram\",\"type\":\"histogram\"}",
      "uiStateJSON": "{}",
      "description": "",
      "version": 1,
      "kibanaSavedObjectMeta": {
        "searchSourceJSON": "{\"index\":\"5b0cfbc0-41be-11e9-a7ab-6fd8d1b4b606\",\"query\":{\"language\":\"lucene\",\"query\":\"\"},\"filter\":[]}"
      }
    },
    "_meta": {
      "savedObjectVersion": 2
    }
  },
  {
    "_id": "5b0cfbc0-41be-11e9-a7ab-6fd8d1b4b606",
    "_type": "index-pattern",
    "_source": {
      "title": "smarthjelm-sensors-*",
      "timeFieldName": "timestamp",
      "fields": "[{\"name\":\"_id\",\"type\":\"string\",\"count\":0,\"scripted\":false,\"searchable\":true,\"aggregatable\":true,\"readFromDocValues\":false},{\"name\":\"_index\",\"type\":\"string\",\"count\":0,\"scripted\":false,\"searchable\":true,\"aggregatable\":true,\"readFromDocValues\":false},{\"name\":\"_score\",\"type\":\"number\",\"count\":0,\"scripted\":false,\"searchable\":false,\"aggregatable\":false,\"readFromDocValues\":false},{\"name\":\"_source\",\"type\":\"_source\",\"count\":0,\"scripted\":false,\"searchable\":false,\"aggregatable\":false,\"readFromDocValues\":false},{\"name\":\"_type\",\"type\":\"string\",\"count\":0,\"scripted\":false,\"searchable\":true,\"aggregatable\":true,\"readFromDocValues\":false},{\"name\":\"acceleration.abs\",\"type\":\"number\",\"count\":1,\"scripted\":false,\"searchable\":true,\"aggregatable\":true,\"readFromDocValues\":true},{\"name\":\"acceleration.x\",\"type\":\"number\",\"count\":0,\"scripted\":false,\"searchable\":true,\"aggregatable\":true,\"readFromDocValues\":true},{\"name\":\"acceleration.y\",\"type\":\"number\",\"count\":0,\"scripted\":false,\"searchable\":true,\"aggregatable\":true,\"readFromDocValues\":true},{\"name\":\"acceleration.z\",\"type\":\"number\",\"count\":0,\"scripted\":false,\"searchable\":true,\"aggregatable\":true,\"readFromDocValues\":true},{\"name\":\"alt\",\"type\":\"number\",\"count\":0,\"scripted\":false,\"searchable\":true,\"aggregatable\":true,\"readFromDocValues\":true},{\"name\":\"gps_valid\",\"type\":\"boolean\",\"count\":1,\"scripted\":false,\"searchable\":true,\"aggregatable\":true,\"readFromDocValues\":true},{\"name\":\"humidity\",\"type\":\"number\",\"count\":0,\"scripted\":false,\"searchable\":true,\"aggregatable\":true,\"readFromDocValues\":true},{\"name\":\"location\",\"type\":\"geo_point\",\"count\":1,\"scripted\":false,\"searchable\":true,\"aggregatable\":true,\"readFromDocValues\":true},{\"name\":\"pressure\",\"type\":\"number\",\"count\":0,\"scripted\":false,\"searchable\":true,\"aggregatable\":true,\"readFromDocValues\":true},{\"name\":\"speed\",\"type\":\"number\",\"count\":0,\"scripted\":false,\"searchable\":true,\"aggregatable\":true,\"readFromDocValues\":true},{\"name\":\"temperature\",\"type\":\"number\",\"count\":1,\"scripted\":false,\"searchable\":true,\"aggregatable\":true,\"readFromDocValues\":true},{\"name\":\"timestamp\",\"type\":\"date\",\"count\":0,\"scripted\":false,\"searchable\":true,\"aggregatable\":true,\"readFromDocValues\":true}]"
    },
    "_meta": {
      "savedObjectVersion": 2
    },
    "_migrationVersion": {
      "index-pattern": "6.5.0"
    }
  },
  {
    "_id": "f6a16b80-4258-11e9-9b11-0145943ebfbf",
    "_type": "index-pattern",
    "_source": {
      "title": "smarthjelm-grovepi-*",
      "timeFieldName": "timestamp",
      "fields": "[{\"name\":\"_id\",\"type\":\"string\",\"count\":0,\"scripted\":false,\"searchable\":true,\"aggregatable\":true,\"readFromDocValues\":false},{\"name\":\"_index\",\"type\":\"string\",\"count\":0,\"scripted\":false,\"searchable\":true,\"aggregatable\":true,\"readFromDocValues\":false},{\"name\":\"_score\",\"type\":\"number\",\"count\":0,\"scripted\":false,\"searchable\":false,\"aggregatable\":false,\"readFromDocValues\":false},{\"name\":\"_source\",\"type\":\"_source\",\"count\":0,\"scripted\":false,\"searchable\":false,\"aggregatable\":false,\"readFromDocValues\":false},{\"name\":\"_type\",\"type\":\"string\",\"count\":0,\"scripted\":false,\"searchable\":true,\"aggregatable\":true,\"readFromDocValues\":false},{\"name\":\"humidity\",\"type\":\"number\",\"count\":0,\"scripted\":false,\"searchable\":true,\"aggregatable\":true,\"readFromDocValues\":true},{\"name\":\"temperature\",\"type\":\"number\",\"count\":0,\"scripted\":false,\"searchable\":true,\"aggregatable\":true,\"readFromDocValues\":true},{\"name\":\"timestamp\",\"type\":\"date\",\"count\":0,\"scripted\":false,\"searchable\":true,\"aggregatable\":true,\"readFromDocValues\":true}]"
    },
    "_meta": {
      "savedObjectVersion": 2
    },
    "_migrationVersion": {
      "index-pattern": "6.5.0"
    }
  },
  {
    "_id": "31dc3b30-4259-11e9-9b11-0145943ebfbf",
    "_type": "visualization",
    "_source": {
      "title": "Head temperature",
      "visState": "{\"title\":\"Head temperature\",\"type\":\"gauge\",\"params\":{\"type\":\"gauge\",\"addTooltip\":true,\"addLegend\":true,\"isDisplayWarning\":false,\"gauge\":{\"verticalSplit\":false,\"extendRange\":true,\"percentageMode\":false,\"gaugeType\":\"Arc\",\"gaugeStyle\":\"Full\",\"backStyle\":\"Full\",\"orientation\":\"vertical\",\"colorSchema\":\"Green to Red\",\"gaugeColorMode\":\"Labels\",\"colorsRange\":[{\"from\":0,\"to\":35},{\"from\":35,\"to\":38},{\"from\":38,\"to\":50}],\"invertColors\":false,\"labels\":{\"show\":true,\"color\":\"black\"},\"scale\":{\"show\":true,\"labels\":false,\"color\":\"#333\"},\"type\":\"meter\",\"style\":{\"bgWidth\":0.9,\"width\":0.9,\"mask\":false,\"bgMask\":false,\"maskBars\":50,\"bgFill\":\"#eee\",\"bgColor\":false,\"subText\":\"\",\"fontSize\":60,\"labelColor\":true}}},\"aggs\":[{\"id\":\"1\",\"enabled\":true,\"type\":\"avg\",\"schema\":\"metric\",\"params\":{\"field\":\"temperature\",\"customLabel\":\"Head temperature\"}}]}",
      "uiStateJSON": "{\"vis\":{\"defaultColors\":{\"0 - 35\":\"rgb(0,104,55)\",\"35 - 38\":\"rgb(255,255,190)\",\"38 - 50\":\"rgb(165,0,38)\"},\"colors\":{\"36 - 38\":\"#3F6833\",\"0 - 35\":\"#447EBC\",\"35 - 38\":\"#3F6833\"}}}",
      "description": "",
      "version": 1,
      "kibanaSavedObjectMeta": {
        "searchSourceJSON": "{\"index\":\"f6a16b80-4258-11e9-9b11-0145943ebfbf\",\"query\":{\"query\":\"\",\"language\":\"lucene\"},\"filter\":[]}"
      }
    },
    "_meta": {
      "savedObjectVersion": 2
    }
  },
  {
    "_id": "648d3890-4259-11e9-9b11-0145943ebfbf",
    "_type": "visualization",
    "_source": {
      "title": "Head humidity",
      "visState": "{\"title\":\"Head humidity\",\"type\":\"gauge\",\"params\":{\"type\":\"gauge\",\"addTooltip\":true,\"addLegend\":true,\"isDisplayWarning\":false,\"gauge\":{\"verticalSplit\":false,\"extendRange\":true,\"percentageMode\":false,\"gaugeType\":\"Arc\",\"gaugeStyle\":\"Full\",\"backStyle\":\"Full\",\"orientation\":\"vertical\",\"colorSchema\":\"Green to Red\",\"gaugeColorMode\":\"Labels\",\"colorsRange\":[{\"from\":0,\"to\":20},{\"from\":20,\"to\":50},{\"from\":50,\"to\":100}],\"invertColors\":false,\"labels\":{\"show\":true,\"color\":\"black\"},\"scale\":{\"show\":true,\"labels\":false,\"color\":\"#333\"},\"type\":\"meter\",\"style\":{\"bgWidth\":0.9,\"width\":0.9,\"mask\":false,\"bgMask\":false,\"maskBars\":50,\"bgFill\":\"#eee\",\"bgColor\":false,\"subText\":\"\",\"fontSize\":60,\"labelColor\":true}}},\"aggs\":[{\"id\":\"1\",\"enabled\":true,\"type\":\"avg\",\"schema\":\"metric\",\"params\":{\"field\":\"humidity\",\"customLabel\":\"Head humidity\"}}]}",
      "uiStateJSON": "{\"vis\":{\"defaultColors\":{\"0 - 20\":\"rgb(0,104,55)\",\"20 - 50\":\"rgb(255,255,190)\",\"50 - 100\":\"rgb(165,0,38)\"}}}",
      "description": "",
      "version": 1,
      "kibanaSavedObjectMeta": {
        "searchSourceJSON": "{\"index\":\"f6a16b80-4258-11e9-9b11-0145943ebfbf\",\"query\":{\"query\":\"\",\"language\":\"lucene\"},\"filter\":[]}"
      }
    },
    "_meta": {
      "savedObjectVersion": 2
    }
  },
  {
    "_id": "51f0cd20-41c1-11e9-a7ab-6fd8d1b4b606",
    "_type": "dashboard",
    "_source": {
      "title": "SmartHjelm",
      "hits": 0,
      "description": "",
      "panelsJSON": "[{\"embeddableConfig\":{\"vis\":{\"colors\":{\"50 - 75\":\"#EA6460\"},\"defaultColors\":{\"0 - 50\":\"rgb(0,104,55)\",\"50 - 75\":\"rgb(255,255,190)\",\"75 - 100\":\"rgb(165,0,38)\"},\"legendOpen\":false}},\"gridData\":{\"x\":0,\"y\":0,\"w\":9,\"h\":10,\"i\":\"1\"},\"id\":\"9dfe04a0-41bf-11e9-a7ab-6fd8d1b4b606\",\"panelIndex\":\"1\",\"type\":\"visualization\",\"version\":\"6.6.1\"},{\"embeddableConfig\":{\"vis\":{\"colors\":{\"0 - 50\":\"#BF1B00\",\"0 - 90000\":\"#F29191\",\"0.9 - 0.95\":\"#82B5D8\",\"0.95 - 1.05\":\"#3F6833\",\"1.05 - 1.1\":\"#0A437C\",\"110000 - 200000\":\"#BF1B00\",\"50 - 75\":\"#508642\",\"75 - 100\":\"#BF1B00\",\"80000 - 90000\":\"#E24D42\",\"90000 - 110000\":\"#508642\"},\"defaultColors\":{\"0.9 - 0.95\":\"rgb(0,104,55)\",\"0.95 - 1.05\":\"rgb(255,255,190)\",\"1.05 - 1.1\":\"rgb(165,0,38)\"},\"legendOpen\":false}},\"gridData\":{\"x\":9,\"y\":0,\"w\":10,\"h\":10,\"i\":\"2\"},\"id\":\"2a54fd50-41c0-11e9-a7ab-6fd8d1b4b606\",\"panelIndex\":\"2\",\"type\":\"visualization\",\"version\":\"6.6.1\"},{\"embeddableConfig\":{\"vis\":{\"colors\":{\"0 - 10\":\"#CFFAFF\",\"0 - 25\":\"#3F6833\",\"10 - 50\":\"#508642\",\"230 - 273.15\":\"#447EBC\",\"25 - 50\":\"#EA6460\",\"273.15 - 298.15\":\"#508642\",\"50 - 100\":\"#890F02\"},\"defaultColors\":{\"0 - 25\":\"rgb(0,104,55)\",\"25 - 50\":\"rgb(255,255,190)\",\"50 - 100\":\"rgb(165,0,38)\"},\"legendOpen\":false}},\"gridData\":{\"x\":38,\"y\":0,\"w\":10,\"h\":10,\"i\":\"3\"},\"id\":\"2bd3dfb0-41c1-11e9-a7ab-6fd8d1b4b606\",\"panelIndex\":\"3\",\"type\":\"visualization\",\"version\":\"6.6.1\"},{\"embeddableConfig\":{\"mapCenter\":[59.96729846067738,10.69295883178711],\"mapZoom\":13},\"gridData\":{\"x\":0,\"y\":32,\"w\":21,\"h\":17,\"i\":\"4\"},\"id\":\"7e0b3cb0-41c1-11e9-a7ab-6fd8d1b4b606\",\"panelIndex\":\"4\",\"type\":\"visualization\",\"version\":\"6.6.1\"},{\"embeddableConfig\":{\"vis\":{\"colors\":{\"10 - 20\":\"#F2C96D\"},\"defaultColors\":{\"0 - 10\":\"rgb(0,104,55)\",\"10 - 20\":\"rgb(255,255,190)\",\"20 - 50\":\"rgb(165,0,38)\"},\"legendOpen\":false}},\"gridData\":{\"x\":19,\"y\":0,\"w\":9,\"h\":10,\"i\":\"5\"},\"id\":\"1a0dfce0-41d3-11e9-a7ab-6fd8d1b4b606\",\"panelIndex\":\"5\",\"type\":\"visualization\",\"version\":\"6.6.1\"},{\"embeddableConfig\":{\"vis\":{\"legendOpen\":false}},\"gridData\":{\"x\":0,\"y\":20,\"w\":23,\"h\":12,\"i\":\"6\"},\"id\":\"b1c1e510-41d3-11e9-a7ab-6fd8d1b4b606\",\"panelIndex\":\"6\",\"type\":\"visualization\",\"version\":\"6.6.1\"},{\"embeddableConfig\":{\"vis\":{\"legendOpen\":false}},\"gridData\":{\"x\":23,\"y\":10,\"w\":25,\"h\":10,\"i\":\"7\"},\"id\":\"90e0b060-41d3-11e9-a7ab-6fd8d1b4b606\",\"panelIndex\":\"7\",\"type\":\"visualization\",\"version\":\"6.6.1\"},{\"embeddableConfig\":{\"vis\":{\"legendOpen\":true}},\"gridData\":{\"x\":21,\"y\":32,\"w\":27,\"h\":17,\"i\":\"8\"},\"id\":\"149b7350-41ec-11e9-a7ab-6fd8d1b4b606\",\"panelIndex\":\"8\",\"type\":\"visualization\",\"version\":\"6.6.1\"},{\"embeddableConfig\":{\"vis\":{\"colors\":{\"0 - 0.8\":\"#EA6460\",\"0.8 - 1.2\":\"#508642\",\"1.2 - 1.5999999999999999\":\"#BF1B00\",\"1.5999999999999999 - 3\":\"#58140C\"},\"defaultColors\":{\"0 - 0.8\":\"rgb(0,104,55)\",\"0.8 - 1.2\":\"rgb(183,224,117)\",\"1.2 - 1.5999999999999999\":\"rgb(253,191,111)\",\"1.5999999999999999 - 3\":\"rgb(165,0,38)\"},\"legendOpen\":false}},\"gridData\":{\"x\":28,\"y\":0,\"w\":10,\"h\":10,\"i\":\"9\"},\"id\":\"b1103ef0-41ec-11e9-a7ab-6fd8d1b4b606\",\"panelIndex\":\"9\",\"type\":\"visualization\",\"version\":\"6.6.1\"},{\"embeddableConfig\":{\"vis\":{\"legendOpen\":false}},\"gridData\":{\"x\":0,\"y\":49,\"w\":24,\"h\":15,\"i\":\"10\"},\"id\":\"3f320af0-424d-11e9-9b11-0145943ebfbf\",\"panelIndex\":\"10\",\"type\":\"visualization\",\"version\":\"6.6.1\"},{\"embeddableConfig\":{\"vis\":{\"legendOpen\":false}},\"gridData\":{\"x\":24,\"y\":49,\"w\":24,\"h\":15,\"i\":\"11\"},\"id\":\"77616f60-424d-11e9-9b11-0145943ebfbf\",\"panelIndex\":\"11\",\"type\":\"visualization\",\"version\":\"6.6.1\"},{\"embeddableConfig\":{\"mapCenter\":[59.93644042418626,10.735359191894531],\"mapZoom\":11},\"gridData\":{\"x\":23,\"y\":20,\"w\":25,\"h\":12,\"i\":\"12\"},\"id\":\"9856abd0-424e-11e9-9b11-0145943ebfbf\",\"panelIndex\":\"12\",\"type\":\"visualization\",\"version\":\"6.6.1\"},{\"gridData\":{\"x\":0,\"y\":10,\"w\":12,\"h\":10,\"i\":\"13\"},\"version\":\"6.6.1\",\"panelIndex\":\"13\",\"type\":\"visualization\",\"id\":\"31dc3b30-4259-11e9-9b11-0145943ebfbf\",\"embeddableConfig\":{\"vis\":{\"defaultColors\":{\"0 - 35\":\"rgb(0,104,55)\",\"35 - 38\":\"rgb(255,255,190)\",\"38 - 50\":\"rgb(165,0,38)\"},\"colors\":{\"36 - 38\":\"#3F6833\",\"0 - 35\":\"#447EBC\",\"35 - 38\":\"#3F6833\"},\"legendOpen\":false}}},{\"gridData\":{\"x\":12,\"y\":10,\"w\":11,\"h\":10,\"i\":\"14\"},\"version\":\"6.6.1\",\"panelIndex\":\"14\",\"type\":\"visualization\",\"id\":\"648d3890-4259-11e9-9b11-0145943ebfbf\",\"embeddableConfig\":{\"vis\":{\"defaultColors\":{\"0 - 20\":\"rgb(0,104,55)\",\"20 - 50\":\"rgb(255,255,190)\",\"50 - 100\":\"rgb(165,0,38)\"},\"legendOpen\":false}}}]",
      "optionsJSON": "{\"darkTheme\":false,\"hidePanelTitles\":false,\"useMargins\":true}",
      "version": 1,
      "timeRestore": false,
      "kibanaSavedObjectMeta": {
        "searchSourceJSON": "{\"query\":{\"language\":\"lucene\",\"query\":\"\"},\"filter\":[]}"
      }
    },
    "_meta": {
      "savedObjectVersion": 2
    }
  },
  {
    "_id": "611d7a50-4266-11e9-9b11-0145943ebfbf",
    "_type": "index-pattern",
    "_source": {
      "title": "smarthjelm-test-*",
      "timeFieldName": "timestamp",
      "fields": "[{\"name\":\"_id\",\"type\":\"string\",\"count\":0,\"scripted\":false,\"searchable\":true,\"aggregatable\":true,\"readFromDocValues\":false},{\"name\":\"_index\",\"type\":\"string\",\"count\":0,\"scripted\":false,\"searchable\":true,\"aggregatable\":true,\"readFromDocValues\":false},{\"name\":\"_score\",\"type\":\"number\",\"count\":0,\"scripted\":false,\"searchable\":false,\"aggregatable\":false,\"readFromDocValues\":false},{\"name\":\"_source\",\"type\":\"_source\",\"count\":0,\"scripted\":false,\"searchable\":false,\"aggregatable\":false,\"readFromDocValues\":false},{\"name\":\"_type\",\"type\":\"string\",\"count\":0,\"scripted\":false,\"searchable\":true,\"aggregatable\":true,\"readFromDocValues\":false},{\"name\":\"humidity\",\"type\":\"number\",\"count\":0,\"scripted\":false,\"searchable\":true,\"aggregatable\":true,\"readFromDocValues\":true},{\"name\":\"temperature\",\"type\":\"number\",\"count\":0,\"scripted\":false,\"searchable\":true,\"aggregatable\":true,\"readFromDocValues\":true},{\"name\":\"timestamp\",\"type\":\"date\",\"count\":0,\"scripted\":false,\"searchable\":true,\"aggregatable\":true,\"readFromDocValues\":true}]"
    },
    "_meta": {
      "savedObjectVersion": 2
    },
    "_migrationVersion": {
      "index-pattern": "6.5.0"
    }
  }
]