<svg width="640" height="480" xmlns="http://www.w3.org/2000/svg" xmlns:svg="http://www.w3.org/2000/svg" xmlns:xlink="http://www.w3.org/1999/xlink">
 <!-- Created with SVG-edit - http://svg-edit.googlecode.com/ -->
 <defs>
  <symbol viewBox="-75 -9.143 181 50.393" height="50.393px" width="181px" y="0px" x="0px" id="svg_2" xmlns:xlink="http://www.w3.org/1999/xlink" xmlns="http://www.w3.org/2000/svg">
   <g>
    <g>
     <path d="m13.753,30.582l1.111,0l5.731,7.898l0,-7.898l0.98,0l0,9.575l-0.935,0l-5.905,-8.131l0,8.131l-0.984,0l0,-9.575l0.002,0z" fill="#000000"/>
     <path d="m24.02,30.582l6.337,0l0,0.969l-5.315,0l0,3.163l5.188,0l0,0.964l-5.188,0l0,3.551l5.362,0l0,0.929l-6.384,0l0,-9.576l0,0z" fill="#000000"/>
     <path d="m35.487,31.551l-3.593,0l0,-0.969l8.212,0l0,0.969l-3.598,0l0,8.606l-1.021,0l0,-8.606l0,0z" fill="#000000"/>
     <path d="m41.349,30.582l1.045,0l2.519,7.928l2.576,-7.928l0.877,0l2.56,7.928l2.536,-7.928l0.98,0l-3.076,9.646l-0.882,0l-2.584,-7.975l-2.57,7.975l-0.894,0l-3.087,-9.646z" fill="#000000"/>
     <path d="m55.358,35.364c0,-3.413 1.747,-4.939 4.812,-4.939c3.075,0 4.834,1.526 4.834,4.939c0,3.424 -1.759,4.956 -4.834,4.956c-3.065,0 -4.812,-1.532 -4.812,-4.956zm8.624,0.011c0,-2.588 -1.201,-3.98 -3.812,-3.98c-2.601,0 -3.79,1.393 -3.79,3.98c0,2.601 1.189,3.999 3.79,3.999c2.611,0 3.812,-1.398 3.812,-3.999z" fill="#000000"/>
     <path d="m70.952,36.258l-2.872,0l0,3.899l-0.993,0l0,-9.575l4.139,0c2.223,0 3.227,0.894 3.227,2.791c0,1.654 -0.784,2.623 -2.449,2.844l2.31,3.94l-1.085,0l-2.277,-3.899zm0.284,-0.929c1.358,0 2.194,-0.418 2.194,-1.927c0,-1.491 -0.812,-1.881 -2.229,-1.881l-3.121,0l0,3.808l3.156,0l0,0z" fill="#000000"/>
     <path d="m79.536,35.079l-1.915,2.096l0,2.982l-0.993,0l0,-9.575l0.993,0l0,5.287l4.852,-5.287l1.172,0l-3.436,3.761l3.906,5.814l-1.155,0l-3.424,-5.078z" fill="#000000"/>
     <path d="m84.968,39.194l0.517,-0.778c1.149,0.72 2.275,0.97 3.43,0.97c1.974,0 2.855,-0.558 2.855,-1.875c0,-1.357 -1.138,-1.555 -2.855,-1.862c-2.071,-0.366 -3.471,-0.714 -3.471,-2.652c0,-1.846 1.19,-2.571 3.471,-2.571c1.497,0 2.571,0.337 3.331,0.854l-0.546,0.823c-0.685,-0.453 -1.706,-0.743 -2.786,-0.743c-1.724,0 -2.461,0.476 -2.461,1.613c0,1.219 0.999,1.451 2.705,1.759c2.089,0.377 3.609,0.685 3.609,2.739c0,1.903 -1.219,2.82 -3.83,2.82c-1.451,0 -2.75,-0.296 -3.969,-1.097z" fill="#000000"/>
    </g>
    <g>
     <g>
      <g>
       <path d="m102.779,-9.016c-13.47,0 -14.039,6.036 -14.039,14.55l0,20.899l3.175,0l0,-20.899c0,-6.418 -0.256,-11.563 10.864,-11.563c1.189,0 2.245,0.061 3.197,0.174l0,-3.027c-0.974,-0.087 -2.037,-0.134 -3.197,-0.134z" fill="#000000"/>
      </g>
      <path d="m-54.311,12.837l0,-21.153l3.241,0l0,21.218c0,6.097 -0.064,11.244 11.117,11.244c11.117,0 10.864,-5.147 10.864,-11.563l0,-20.899l3.177,0l0,20.898c0,8.517 -0.575,14.553 -14.042,14.553c-13.53,0 -14.357,-6.036 -14.357,-14.298z" fill="#000000"/>
      <path d="m7.859,5.278l0,21.154l-3.241,0l0,-21.217c0,-6.1 0.064,-11.245 -11.117,-11.245c-11.117,0 -10.861,5.145 -10.861,11.563l0,20.899l-3.177,0l0,-20.898c0,-8.514 0.572,-14.549 14.039,-14.549c13.53,-0.001 14.357,6.035 14.357,14.293z" fill="#000000"/>
      <path d="m13.753,-8.252l3.11,0l0,34.685l-3.11,0l0,-34.685z" fill="#000000"/>
      <path d="m22.685,-8.252l16.238,0c8.056,0 11.706,4.001 11.706,11.117c0,7.162 -3.604,11.517 -11.747,11.517l-13.087,0l0,12.051l-3.11,0l0,-34.685zm16.284,19.514c5.618,0 8.404,-2.733 8.404,-8.258c0,-5.522 -3.007,-8.142 -8.543,-8.142l-13.035,0l0,16.4l13.174,0z" fill="#000000"/>
      <path d="m54.244,8.964c0,-10.229 2.925,-18.107 16.018,-18.107c13.528,0 13.975,9.082 13.911,18.675l-26.807,0c0.059,8.45 2.159,14.741 13.146,14.741c5.844,0 8.514,-1.59 11.369,-3.686l1.781,2.351c-3.175,2.351 -6.924,4.196 -13.15,4.196c-13.72,0.001 -16.268,-7.945 -16.268,-18.17zm3.181,-2.354l23.632,0c-0.314,-6.923 -0.761,-12.831 -10.865,-12.831c-9.715,0 -12.384,5.272 -12.767,12.831z" fill="#000000"/>
      <g>
       <path d="m-73.816,33.959c13.467,0 14.039,-6.035 14.039,-14.549l0,-27.726l-3.175,0l0,27.726c0,6.413 0.252,11.566 -10.864,11.566c-0.42,0 -0.818,-0.012 -1.207,-0.029l0,2.995c0.388,0.011 0.792,0.017 1.207,0.017z" fill="#000000"/>
      </g>
     </g>
     <g>
      <path d="m98.873,26.583c-1.213,0 -2.193,-0.98 -2.193,-2.193c0,-1.207 0.98,-2.188 2.193,-2.188c1.207,0 2.188,0.981 2.188,2.188c0,1.213 -0.981,2.193 -2.188,2.193l0,0zm0,-4.103c-1.057,0 -1.915,0.858 -1.915,1.909c0,1.05 0.858,1.909 1.915,1.909c1.045,0 1.903,-0.859 1.903,-1.909c0,-1.05 -0.858,-1.909 -1.903,-1.909l0,0z" fill="#000000"/>
      <g>
       <path d="m99.013,24.686l-0.708,0l0,0.963l-0.337,0l0,-2.519l1.126,0c0.639,0 0.882,0.268 0.882,0.761c0,0.406 -0.174,0.69 -0.604,0.771l0.569,0.986l-0.372,0l-0.556,-0.962zm0.075,-0.32c0.343,0 0.54,-0.099 0.54,-0.464c0,-0.366 -0.187,-0.447 -0.546,-0.447l-0.777,0l0,0.911l0.783,0l0,0z" fill="#000000"/>
      </g>
     </g>
    </g>
   </g>
  </symbol>
 </defs>
 <g>
  <title>Layer 1</title>
  <use x="0" y="0" transform="matrix(0.8839778900146484,0,0,0.8839778900146484,0,0) " xlink:href="#svg_2" id="svg_3"/>
  <g id="svg_4"/>
 </g>
</svg>