{
  "textures": {
    "0": "blocks/awool_colored_cyanv",
    "1": "blocks/awool_colored_cyanv",
    "2": "blocks/awool_colored_cyanv",
    "3": "blocks/awool_colored_cyanv",
    "particle": "blocks/awool_colored_cyanv"
  },
  "elements": [
    {
      "name": "cube",
      "from": [
        7.812500000000001,
        11.8125,
        7.84
      ],
      "to": [
        8.05,
        22.5625,
        8.24
      ],
      "faces": {
        "north": {
          "uv": [
            0,
            0,
            0.2375,
            10.75
          ],
          "texture": "#0"
        },
        "east": {
          "uv": [
            0,
            0,
            0.4,
            10.75
          ],
          "texture": "#0"
        },
        "south": {
          "uv": [
            0,
            0,
            0.2375,
            10.75
          ],
          "texture": "#0"
        },
        "west": {
          "uv": [
            0,
            0,
            0.4,
            10.75
          ],
          "texture": "#0"
        },
        "up": {
          "uv": [
            0,
            0,
            0.2375,
            0.4
          ],
          "texture": "#0"
        },
        "down": {
          "uv": [
            0,
            0,
            0.2375,
            0.4
          ],
          "texture": "#0"
        }
      }
    },
    {
      "name": "cube",
      "from": [
        7.812500000000001,
        15.6875,
        7.937500000000001
      ],
      "to": [
        8.05,
        29.3125,
        8.1125
      ],
      "faces": {
        "north": {
          "uv": [
            0,
            0,
            0.2375,
            13.625
          ],
          "texture": "#0"
        },
        "east": {
          "uv": [
            0,
            0,
            0.175,
            13.625
          ],
          "texture": "#0"
        },
        "south": {
          "uv": [
            0,
            0,
            0.2375,
            13.625
          ],
          "texture": "#0"
        },
        "west": {
          "uv": [
            0,
            0,
            0.175,
            13.625
          ],
          "texture": "#0"
        },
        "up": {
          "uv": [
            0,
            0,
            0.2375,
            0.175
          ],
          "texture": "#0"
        },
        "down": {
          "uv": [
            0,
            0,
            0.2375,
            0.175
          ],
          "texture": "#0"
        }
      }
    },
    {
      "name": "cube",
      "from": [
        7.812500000000001,
        15.1875,
        7.875000000000001
      ],
      "to": [
        8.05,
        28.25,
        8.175
      ],
      "faces": {
        "north": {
          "uv": [
            0,
            0,
            0.2375,
            13.0625
          ],
          "texture": "#0"
        },
        "east": {
          "uv": [
            0,
            0,
            0.3,
            13.0625
          ],
          "texture": "#0"
        },
        "south": {
          "uv": [
            0,
            0,
            0.2375,
            13.0625
          ],
          "texture": "#0"
        },
        "west": {
          "uv": [
            0,
            0,
            0.3,
            13.0625
          ],
          "texture": "#0"
        },
        "up": {
          "uv": [
            0,
            0,
            0.2375,
            0.3
          ],
          "texture": "#0"
        },
        "down": {
          "uv": [
            0,
            0,
            0.2375,
            0.3
          ],
          "texture": "#0"
        }
      }
    },
    {
      "name": "cube",
      "from": [
        7.750000000000001,
        20.875,
        7.59
      ],
      "to": [
        8.1125,
        22.5625,
        8.49
      ],
      "faces": {
        "north": {
          "uv": [
            0,
            0,
            0.3625,
            1.6875
          ],
          "texture": "#0"
        },
        "east": {
          "uv": [
            0,
            0,
            0.9,
            1.6875
          ],
          "texture": "#0"
        },
        "south": {
          "uv": [
            0,
            0,
            0.3625,
            1.6875
          ],
          "texture": "#0"
        },
        "west": {
          "uv": [
            0,
            0,
            0.9,
            1.6875
          ],
          "texture": "#0"
        },
        "up": {
          "uv": [
            0,
            0,
            0.3625,
            0.9
          ],
          "texture": "#0"
        },
        "down": {
          "uv": [
            0,
            0,
            0.3625,
            0.9
          ],
          "texture": "#0"
        }
      }
    },
    {
      "name": "cube",
      "from": [
        7.750000000000001,
        22.8125,
        11.9025
      ],
      "to": [
        8.1125,
        24.125,
        12.365
      ],
      "faces": {
        "north": {
          "uv": [
            0,
            0,
            0.3625,
            1.3125
          ],
          "texture": "#0"
        },
        "east": {
          "uv": [
            0,
            0,
            0.4625,
            1.3125
          ],
          "texture": "#0"
        },
        "south": {
          "uv": [
            0,
            0,
            0.3625,
            1.3125
          ],
          "texture": "#0"
        },
        "west": {
          "uv": [
            0,
            0,
            0.4625,
            1.3125
          ],
          "texture": "#0"
        },
        "up": {
          "uv": [
            0,
            0,
            0.3625,
            0.4625
          ],
          "texture": "#0"
        },
        "down": {
          "uv": [
            0,
            0,
            0.3625,
            0.4625
          ],
          "texture": "#0"
        }
      },
      "rotation": {
        "origin": [
          8,
          17.5625,
          11.875
        ],
        "axis": "x",
        "angle": -45
      }
    },
    {
      "name": "cube",
      "from": [
        7.750000000000001,
        23.1875,
        3.8400000000000003
      ],
      "to": [
        8.1125,
        24.5,
        4.3025
      ],
      "faces": {
        "north": {
          "uv": [
            0,
            0,
            0.3625,
            1.3125
          ],
          "texture": "#0"
        },
        "east": {
          "uv": [
            0,
            0,
            0.4625,
            1.3125
          ],
          "texture": "#0"
        },
        "south": {
          "uv": [
            0,
            0,
            0.3625,
            1.3125
          ],
          "texture": "#0"
        },
        "west": {
          "uv": [
            0,
            0,
            0.4625,
            1.3125
          ],
          "texture": "#0"
        },
        "up": {
          "uv": [
            0,
            0,
            0.3625,
            0.4625
          ],
          "texture": "#0"
        },
        "down": {
          "uv": [
            0,
            0,
            0.3625,
            0.4625
          ],
          "texture": "#0"
        }
      },
      "rotation": {
        "origin": [
          8,
          17.9375,
          3.8125
        ],
        "axis": "x",
        "angle": 45
      }
    },
    {
      "name": "cube",
      "from": [
        7.750000000000001,
        20.9375,
        7.2775
      ],
      "to": [
        8.1125,
        22.25,
        8.8025
      ],
      "faces": {
        "north": {
          "uv": [
            0,
            0,
            0.3625,
            1.3125
          ],
          "texture": "#0"
        },
        "east": {
          "uv": [
            0,
            0,
            1.525,
            1.3125
          ],
          "texture": "#0"
        },
        "south": {
          "uv": [
            0,
            0,
            0.3625,
            1.3125
          ],
          "texture": "#0"
        },
        "west": {
          "uv": [
            0,
            0,
            1.525,
            1.3125
          ],
          "texture": "#0"
        },
        "up": {
          "uv": [
            0,
            0,
            0.3625,
            1.525
          ],
          "texture": "#0"
        },
        "down": {
          "uv": [
            0,
            0,
            0.3625,
            1.525
          ],
          "texture": "#0"
        }
      }
    },
    {
      "name": "cube",
      "from": [
        7.750000000000001,
        21.8125,
        11.965
      ],
      "to": [
        8.1125,
        22.8125,
        12.4275
      ],
      "faces": {
        "north": {
          "uv": [
            0,
            0,
            0.3625,
            1
          ],
          "texture": "#0"
        },
        "east": {
          "uv": [
            0,
            0,
            0.4625,
            1
          ],
          "texture": "#0"
        },
        "south": {
          "uv": [
            0,
            0,
            0.3625,
            1
          ],
          "texture": "#0"
        },
        "west": {
          "uv": [
            0,
            0,
            0.4625,
            1
          ],
          "texture": "#0"
        },
        "up": {
          "uv": [
            0,
            0,
            0.3625,
            0.4625
          ],
          "texture": "#0"
        },
        "down": {
          "uv": [
            0,
            0,
            0.3625,
            0.4625
          ],
          "texture": "#0"
        }
      },
      "rotation": {
        "origin": [
          8,
          16.25,
          11.9375
        ],
        "axis": "x",
        "angle": -45
      }
    },
    {
      "name": "cube",
      "from": [
        7.750000000000001,
        22.1875,
        3.8400000000000003
      ],
      "to": [
        8.1125,
        23.25,
        4.3025
      ],
      "faces": {
        "north": {
          "uv": [
            0,
            0,
            0.3625,
            1.0625
          ],
          "texture": "#0"
        },
        "east": {
          "uv": [
            0,
            0,
            0.4625,
            1.0625
          ],
          "texture": "#0"
        },
        "south": {
          "uv": [
            0,
            0,
            0.3625,
            1.0625
          ],
          "texture": "#0"
        },
        "west": {
          "uv": [
            0,
            0,
            0.4625,
            1.0625
          ],
          "texture": "#0"
        },
        "up": {
          "uv": [
            0,
            0,
            0.3625,
            0.4625
          ],
          "texture": "#0"
        },
        "down": {
          "uv": [
            0,
            0,
            0.3625,
            0.4625
          ],
          "texture": "#0"
        }
      },
      "rotation": {
        "origin": [
          8,
          16.6875,
          3.8125
        ],
        "axis": "x",
        "angle": 45
      }
    },
    {
      "name": "cube",
      "from": [
        7.812500000000001,
        15.1875,
        7.812500000000001
      ],
      "to": [
        8.05,
        28.125,
        8.2375
      ],
      "faces": {
        "north": {
          "uv": [
            0,
            0,
            0.2375,
            12.9375
          ],
          "texture": "#0"
        },
        "east": {
          "uv": [
            0,
            0,
            0.425,
            12.9375
          ],
          "texture": "#0"
        },
        "south": {
          "uv": [
            0,
            0,
            0.2375,
            12.9375
          ],
          "texture": "#0"
        },
        "west": {
          "uv": [
            0,
            0,
            0.425,
            12.9375
          ],
          "texture": "#0"
        },
        "up": {
          "uv": [
            0,
            0,
            0.2375,
            0.425
          ],
          "texture": "#0"
        },
        "down": {
          "uv": [
            0,
            0,
            0.2375,
            0.425
          ],
          "texture": "#0"
        }
      }
    },
    {
      "name": "cube",
      "from": [
        7.750000000000001,
        19.0625,
        7.59
      ],
      "to": [
        8.1125,
        20.75,
        8.49
      ],
      "faces": {
        "north": {
          "uv": [
            0,
            0,
            0.3625,
            1.6875
          ],
          "texture": "#0"
        },
        "east": {
          "uv": [
            0,
            0,
            0.9,
            1.6875
          ],
          "texture": "#0"
        },
        "south": {
          "uv": [
            0,
            0,
            0.3625,
            1.6875
          ],
          "texture": "#0"
        },
        "west": {
          "uv": [
            0,
            0,
            0.9,
            1.6875
          ],
          "texture": "#0"
        },
        "up": {
          "uv": [
            0,
            0,
            0.3625,
            0.9
          ],
          "texture": "#0"
        },
        "down": {
          "uv": [
            0,
            0,
            0.3625,
            0.9
          ],
          "texture": "#0"
        }
      }
    },
    {
      "name": "cube",
      "from": [
        7.750000000000001,
        19.75,
        11.9025
      ],
      "to": [
        8.1125,
        21.0625,
        12.365
      ],
      "faces": {
        "north": {
          "uv": [
            0,
            0,
            0.3625,
            1.3125
          ],
          "texture": "#0"
        },
        "east": {
          "uv": [
            0,
            0,
            0.4625,
            1.3125
          ],
          "texture": "#0"
        },
        "south": {
          "uv": [
            0,
            0,
            0.3625,
            1.3125
          ],
          "texture": "#0"
        },
        "west": {
          "uv": [
            0,
            0,
            0.4625,
            1.3125
          ],
          "texture": "#0"
        },
        "up": {
          "uv": [
            0,
            0,
            0.3625,
            0.4625
          ],
          "texture": "#0"
        },
        "down": {
          "uv": [
            0,
            0,
            0.3625,
            0.4625
          ],
          "texture": "#0"
        }
      },
      "rotation": {
        "origin": [
          8,
          14.5,
          11.875
        ],
        "axis": "x",
        "angle": -45
      }
    },
    {
      "name": "cube",
      "from": [
        7.750000000000001,
        20.125,
        3.8400000000000003
      ],
      "to": [
        8.1125,
        21.4375,
        4.3025
      ],
      "faces": {
        "north": {
          "uv": [
            0,
            0,
            0.3625,
            1.3125
          ],
          "texture": "#0"
        },
        "east": {
          "uv": [
            0,
            0,
            0.4625,
            1.3125
          ],
          "texture": "#0"
        },
        "south": {
          "uv": [
            0,
            0,
            0.3625,
            1.3125
          ],
          "texture": "#0"
        },
        "west": {
          "uv": [
            0,
            0,
            0.4625,
            1.3125
          ],
          "texture": "#0"
        },
        "up": {
          "uv": [
            0,
            0,
            0.3625,
            0.4625
          ],
          "texture": "#0"
        },
        "down": {
          "uv": [
            0,
            0,
            0.3625,
            0.4625
          ],
          "texture": "#0"
        }
      },
      "rotation": {
        "origin": [
          8,
          14.875,
          3.8125
        ],
        "axis": "x",
        "angle": 45
      }
    },
    {
      "name": "cube",
      "from": [
        7.750000000000001,
        17.875,
        7.26
      ],
      "to": [
        8.1125,
        19.1875,
        8.8
      ],
      "faces": {
        "north": {
          "uv": [
            0,
            0,
            0.3625,
            1.3125
          ],
          "texture": "#0"
        },
        "east": {
          "uv": [
            0,
            0,
            1.54,
            1.3125
          ],
          "texture": "#0"
        },
        "south": {
          "uv": [
            0,
            0,
            0.3625,
            1.3125
          ],
          "texture": "#0"
        },
        "west": {
          "uv": [
            0,
            0,
            1.54,
            1.3125
          ],
          "texture": "#0"
        },
        "up": {
          "uv": [
            0,
            0,
            0.3625,
            1.54
          ],
          "texture": "#0"
        },
        "down": {
          "uv": [
            0,
            0,
            0.3625,
            1.54
          ],
          "texture": "#0"
        }
      }
    },
    {
      "name": "cube",
      "from": [
        7.875000000000001,
        12.1875,
        7.562500000000001
      ],
      "to": [
        7.987500000000001,
        29.9375,
        8.4875
      ],
      "faces": {
        "north": {
          "uv": [
            0,
            0,
            0.1125,
            16
          ],
          "texture": "#2"
        },
        "east": {
          "uv": [
            0,
            0,
            0.925,
            16
          ],
          "texture": "#2"
        },
        "south": {
          "uv": [
            0,
            0,
            0.1125,
            16
          ],
          "texture": "#2"
        },
        "west": {
          "uv": [
            0,
            0,
            0.925,
            16
          ],
          "texture": "#2"
        },
        "up": {
          "uv": [
            0,
            0,
            0.1125,
            0.925
          ],
          "texture": "#2"
        },
        "down": {
          "uv": [
            0,
            0,
            0.1125,
            0.925
          ],
          "texture": "#2"
        }
      }
    },
    {
      "name": "cube",
      "from": [
        7.875000000000001,
        16.75,
        7.687500000000001
      ],
      "to": [
        7.987500000000001,
        31,
        8.3625
      ],
      "faces": {
        "north": {
          "uv": [
            0,
            0,
            0.1125,
            14.25
          ],
          "texture": "#2"
        },
        "east": {
          "uv": [
            0,
            0,
            0.675,
            14.25
          ],
          "texture": "#2"
        },
        "south": {
          "uv": [
            0,
            0,
            0.1125,
            14.25
          ],
          "texture": "#2"
        },
        "west": {
          "uv": [
            0,
            0,
            0.675,
            14.25
          ],
          "texture": "#2"
        },
        "up": {
          "uv": [
            0,
            0,
            0.1125,
            0.675
          ],
          "texture": "#2"
        },
        "down": {
          "uv": [
            0,
            0,
            0.1125,
            0.675
          ],
          "texture": "#2"
        }
      }
    },
    {
      "name": "cube",
      "from": [
        7.875000000000001,
        17.5,
        7.812500000000001
      ],
      "to": [
        7.987500000000001,
        31.75,
        8.2375
      ],
      "faces": {
        "north": {
          "uv": [
            0,
            0,
            0.1125,
            14.25
          ],
          "texture": "#2"
        },
        "east": {
          "uv": [
            0,
            0,
            0.425,
            14.25
          ],
          "texture": "#2"
        },
        "south": {
          "uv": [
            0,
            0,
            0.1125,
            14.25
          ],
          "texture": "#2"
        },
        "west": {
          "uv": [
            0,
            0,
            0.425,
            14.25
          ],
          "texture": "#2"
        },
        "up": {
          "uv": [
            0,
            0,
            0.1125,
            0.425
          ],
          "texture": "#2"
        },
        "down": {
          "uv": [
            0,
            0,
            0.1125,
            0.425
          ],
          "texture": "#2"
        }
      }
    },
    {
      "name": "cube",
      "from": [
        7.875000000000001,
        15.6875,
        7.625000000000001
      ],
      "to": [
        7.987500000000001,
        29.9375,
        8.4875
      ],
      "faces": {
        "north": {
          "uv": [
            0,
            0,
            0.1125,
            14.25
          ],
          "texture": "#2"
        },
        "east": {
          "uv": [
            0,
            0,
            0.8625,
            14.25
          ],
          "texture": "#2"
        },
        "south": {
          "uv": [
            0,
            0,
            0.1125,
            14.25
          ],
          "texture": "#2"
        },
        "west": {
          "uv": [
            0,
            0,
            0.8625,
            14.25
          ],
          "texture": "#2"
        },
        "up": {
          "uv": [
            0,
            0,
            0.1125,
            0.8625
          ],
          "texture": "#2"
        },
        "down": {
          "uv": [
            0,
            0,
            0.1125,
            0.8625
          ],
          "texture": "#2"
        }
      }
    },
    {
      "name": "cube",
      "from": [
        7.875000000000001,
        24.75,
        16.625
      ],
      "to": [
        7.987500000000001,
        26.625,
        17.6125
      ],
      "faces": {
        "north": {
          "uv": [
            0,
            0,
            0.1125,
            1.875
          ],
          "texture": "#2"
        },
        "east": {
          "uv": [
            0,
            0,
            0.9875,
            1.875
          ],
          "texture": "#2"
        },
        "south": {
          "uv": [
            0,
            0,
            0.1125,
            1.875
          ],
          "texture": "#2"
        },
        "west": {
          "uv": [
            0,
            0,
            0.9875,
            1.875
          ],
          "texture": "#2"
        },
        "up": {
          "uv": [
            0,
            0,
            0.1125,
            0.9875
          ],
          "texture": "#2"
        },
        "down": {
          "uv": [
            0,
            0,
            0.1125,
            0.9875
          ],
          "texture": "#2"
        }
      },
      "rotation": {
        "origin": [
          8,
          12.6875,
          17.125
        ],
        "axis": "x",
        "angle": -45
      }
    },
    {
      "name": "cube",
      "from": [
        7.875000000000001,
        24.625,
        -1.5625
      ],
      "to": [
        7.987500000000001,
        26.6875,
        -0.5125
      ],
      "faces": {
        "north": {
          "uv": [
            0,
            0,
            0.1125,
            2.0625
          ],
          "texture": "#2"
        },
        "east": {
          "uv": [
            0,
            0,
            1.05,
            2.0625
          ],
          "texture": "#2"
        },
        "south": {
          "uv": [
            0,
            0,
            0.1125,
            2.0625
          ],
          "texture": "#2"
        },
        "west": {
          "uv": [
            0,
            0,
            1.05,
            2.0625
          ],
          "texture": "#2"
        },
        "up": {
          "uv": [
            0,
            0,
            0.1125,
            1.05
          ],
          "texture": "#2"
        },
        "down": {
          "uv": [
            0,
            0,
            0.1125,
            1.05
          ],
          "texture": "#2"
        }
      },
      "rotation": {
        "origin": [
          8,
          12.8125,
          -1.0625
        ],
        "axis": "x",
        "angle": 45
      }
    },
    {
      "name": "cube",
      "from": [
        7.875000000000001,
        20.875,
        6.937500000000001
      ],
      "to": [
        7.987500000000001,
        22.1875,
        9.1125
      ],
      "faces": {
        "north": {
          "uv": [
            0,
            0,
            0.1125,
            1.3125
          ],
          "texture": "#2"
        },
        "east": {
          "uv": [
            0,
            0,
            2.175,
            1.3125
          ],
          "texture": "#2"
        },
        "south": {
          "uv": [
            0,
            0,
            0.1125,
            1.3125
          ],
          "texture": "#2"
        },
        "west": {
          "uv": [
            0,
            0,
            2.175,
            1.3125
          ],
          "texture": "#2"
        },
        "up": {
          "uv": [
            0,
            0,
            0.1125,
            2.175
          ],
          "texture": "#2"
        },
        "down": {
          "uv": [
            0,
            0,
            0.1125,
            2.175
          ],
          "texture": "#2"
        }
      },
      "rotation": {
        "origin": [
          8,
          8.25,
          7.375
        ],
        "axis": "x",
        "angle": 0
      }
    },
    {
      "name": "cube",
      "from": [
        7.875000000000001,
        24.0625,
        16.75
      ],
      "to": [
        7.987500000000001,
        25.875,
        17.7375
      ],
      "faces": {
        "north": {
          "uv": [
            0,
            0,
            0.1125,
            1.8125
          ],
          "texture": "#2"
        },
        "east": {
          "uv": [
            0,
            0,
            0.9875,
            1.8125
          ],
          "texture": "#2"
        },
        "south": {
          "uv": [
            0,
            0,
            0.1125,
            1.8125
          ],
          "texture": "#2"
        },
        "west": {
          "uv": [
            0,
            0,
            0.9875,
            1.8125
          ],
          "texture": "#2"
        },
        "up": {
          "uv": [
            0,
            0,
            0.1125,
            0.9875
          ],
          "texture": "#2"
        },
        "down": {
          "uv": [
            0,
            0,
            0.1125,
            0.9875
          ],
          "texture": "#2"
        }
      },
      "rotation": {
        "origin": [
          8,
          12,
          17.25
        ],
        "axis": "x",
        "angle": -45
      }
    },
    {
      "name": "cube",
      "from": [
        7.875000000000001,
        24.0625,
        -1.75
      ],
      "to": [
        7.987500000000001,
        25.875,
        -0.7625
      ],
      "faces": {
        "north": {
          "uv": [
            0,
            0,
            0.1125,
            1.8125
          ],
          "texture": "#2"
        },
        "east": {
          "uv": [
            0,
            0,
            0.9875,
            1.8125
          ],
          "texture": "#2"
        },
        "south": {
          "uv": [
            0,
            0,
            0.1125,
            1.8125
          ],
          "texture": "#2"
        },
        "west": {
          "uv": [
            0,
            0,
            0.9875,
            1.8125
          ],
          "texture": "#2"
        },
        "up": {
          "uv": [
            0,
            0,
            0.1125,
            0.9875
          ],
          "texture": "#2"
        },
        "down": {
          "uv": [
            0,
            0,
            0.1125,
            0.9875
          ],
          "texture": "#2"
        }
      },
      "rotation": {
        "origin": [
          8,
          12,
          -1.25
        ],
        "axis": "x",
        "angle": 45
      }
    },
    {
      "name": "cube",
      "from": [
        7.875000000000001,
        19.1875,
        7.250000000000001
      ],
      "to": [
        7.987500000000001,
        22.25,
        8.8625
      ],
      "faces": {
        "north": {
          "uv": [
            0,
            0,
            0.1125,
            3.0625
          ],
          "texture": "#2"
        },
        "east": {
          "uv": [
            0,
            0,
            1.6125,
            3.0625
          ],
          "texture": "#2"
        },
        "south": {
          "uv": [
            0,
            0,
            0.1125,
            3.0625
          ],
          "texture": "#2"
        },
        "west": {
          "uv": [
            0,
            0,
            1.6125,
            3.0625
          ],
          "texture": "#2"
        },
        "up": {
          "uv": [
            0,
            0,
            0.1125,
            1.6125
          ],
          "texture": "#2"
        },
        "down": {
          "uv": [
            0,
            0,
            0.1125,
            1.6125
          ],
          "texture": "#2"
        }
      }
    },
    {
      "name": "cube",
      "from": [
        7.875000000000001,
        21.75,
        16.650000000000002
      ],
      "to": [
        7.987500000000001,
        23.625,
        17.637500000000003
      ],
      "faces": {
        "north": {
          "uv": [
            0,
            0,
            0.1125,
            1.875
          ],
          "texture": "#2"
        },
        "east": {
          "uv": [
            0,
            0,
            0.9875,
            1.875
          ],
          "texture": "#2"
        },
        "south": {
          "uv": [
            0,
            0,
            0.1125,
            1.875
          ],
          "texture": "#2"
        },
        "west": {
          "uv": [
            0,
            0,
            0.9875,
            1.875
          ],
          "texture": "#2"
        },
        "up": {
          "uv": [
            0,
            0,
            0.1125,
            0.9875
          ],
          "texture": "#2"
        },
        "down": {
          "uv": [
            0,
            0,
            0.1125,
            0.9875
          ],
          "texture": "#2"
        }
      },
      "rotation": {
        "origin": [
          8,
          9.6875,
          17.150000000000002
        ],
        "axis": "x",
        "angle": -45
      }
    },
    {
      "name": "cube",
      "from": [
        7.875000000000001,
        21.775,
        -1.6124999999999998
      ],
      "to": [
        7.987500000000001,
        23.674999999999997,
        -0.5224999999999997
      ],
      "faces": {
        "north": {
          "uv": [
            0,
            0,
            0.1125,
            1.9
          ],
          "texture": "#2"
        },
        "east": {
          "uv": [
            0,
            0,
            1.09,
            1.9
          ],
          "texture": "#2"
        },
        "south": {
          "uv": [
            0,
            0,
            0.1125,
            1.9
          ],
          "texture": "#2"
        },
        "west": {
          "uv": [
            0,
            0,
            1.09,
            1.9
          ],
          "texture": "#2"
        },
        "up": {
          "uv": [
            0,
            0,
            0.1125,
            1.09
          ],
          "texture": "#2"
        },
        "down": {
          "uv": [
            0,
            0,
            0.1125,
            1.09
          ],
          "texture": "#2"
        }
      },
      "rotation": {
        "origin": [
          8,
          9.799999999999997,
          -1.1124999999999998
        ],
        "axis": "x",
        "angle": 45
      }
    },
    {
      "name": "cube",
      "from": [
        7.875000000000001,
        17.875,
        6.937500000000001
      ],
      "to": [
        7.987500000000001,
        19.1875,
        9.1125
      ],
      "faces": {
        "north": {
          "uv": [
            0,
            0,
            0.1125,
            1.3125
          ],
          "texture": "#2"
        },
        "east": {
          "uv": [
            0,
            0,
            2.175,
            1.3125
          ],
          "texture": "#2"
        },
        "south": {
          "uv": [
            0,
            0,
            0.1125,
            1.3125
          ],
          "texture": "#2"
        },
        "west": {
          "uv": [
            0,
            0,
            2.175,
            1.3125
          ],
          "texture": "#2"
        },
        "up": {
          "uv": [
            0,
            0,
            0.1125,
            2.175
          ],
          "texture": "#2"
        },
        "down": {
          "uv": [
            0,
            0,
            0.1125,
            2.175
          ],
          "texture": "#2"
        }
      },
      "rotation": {
        "origin": [
          8,
          5.25,
          7.375
        ],
        "axis": "x",
        "angle": 0
      }
    },
    {
      "name": "cube",
      "from": [
        7.875000000000001,
        16.5,
        7.437500000000001
      ],
      "to": [
        7.987500000000001,
        29.25,
        8.6125
      ],
      "faces": {
        "north": {
          "uv": [
            0,
            0,
            0.1125,
            12.75
          ],
          "texture": "#2"
        },
        "east": {
          "uv": [
            0,
            0,
            1.175,
            12.75
          ],
          "texture": "#2"
        },
        "south": {
          "uv": [
            0,
            0,
            0.1125,
            12.75
          ],
          "texture": "#2"
        },
        "west": {
          "uv": [
            0,
            0,
            1.175,
            12.75
          ],
          "texture": "#2"
        },
        "up": {
          "uv": [
            0,
            0,
            0.1125,
            1.175
          ],
          "texture": "#2"
        },
        "down": {
          "uv": [
            0,
            0,
            0.1125,
            1.175
          ],
          "texture": "#2"
        }
      }
    },
    {
      "name": "cube",
      "from": [
        7.687500000000001,
        18.25,
        7.625000000000001
      ],
      "to": [
        8.175,
        18.9375,
        8.425
      ],
      "faces": {
        "north": {
          "uv": [
            0,
            0,
            0.4875,
            0.6875
          ],
          "texture": "#1"
        },
        "east": {
          "uv": [
            0,
            0,
            0.8,
            0.6875
          ],
          "texture": "#1"
        },
        "south": {
          "uv": [
            0,
            0,
            0.4875,
            0.6875
          ],
          "texture": "#1"
        },
        "west": {
          "uv": [
            0,
            0,
            0.8,
            0.6875
          ],
          "texture": "#1"
        },
        "up": {
          "uv": [
            0,
            0,
            0.4875,
            0.8
          ],
          "texture": "#1"
        },
        "down": {
          "uv": [
            0,
            0,
            0.4875,
            0.8
          ],
          "texture": "#1"
        }
      }
    },
    {
      "name": "cube",
      "from": [
        7.687500000000001,
        18.1875,
        7.687500000000001
      ],
      "to": [
        8.175,
        19,
        8.3625
      ],
      "faces": {
        "north": {
          "uv": [
            0,
            0,
            0.4875,
            0.8125
          ],
          "texture": "#1"
        },
        "east": {
          "uv": [
            0,
            0,
            0.675,
            0.8125
          ],
          "texture": "#1"
        },
        "south": {
          "uv": [
            0,
            0,
            0.4875,
            0.8125
          ],
          "texture": "#1"
        },
        "west": {
          "uv": [
            0,
            0,
            0.675,
            0.8125
          ],
          "texture": "#1"
        },
        "up": {
          "uv": [
            0,
            0,
            0.4875,
            0.675
          ],
          "texture": "#1"
        },
        "down": {
          "uv": [
            0,
            0,
            0.4875,
            0.675
          ],
          "texture": "#1"
        }
      }
    },
    {
      "name": "cube",
      "from": [
        7.687500000000001,
        18.3125,
        7.562500000000001
      ],
      "to": [
        8.175,
        18.875,
        8.4875
      ],
      "faces": {
        "north": {
          "uv": [
            0,
            0,
            0.4875,
            0.5625
          ],
          "texture": "#1"
        },
        "east": {
          "uv": [
            0,
            0,
            0.925,
            0.5625
          ],
          "texture": "#1"
        },
        "south": {
          "uv": [
            0,
            0,
            0.4875,
            0.5625
          ],
          "texture": "#1"
        },
        "west": {
          "uv": [
            0,
            0,
            0.925,
            0.5625
          ],
          "texture": "#1"
        },
        "up": {
          "uv": [
            0,
            0,
            0.4875,
            0.925
          ],
          "texture": "#1"
        },
        "down": {
          "uv": [
            0,
            0,
            0.4875,
            0.925
          ],
          "texture": "#1"
        }
      }
    },
    {
      "name": "cube",
      "from": [
        7.687500000000001,
        11.75,
        7.750000000000001
      ],
      "to": [
        8.175,
        18.1875,
        7.862500000000001
      ],
      "faces": {
        "north": {
          "uv": [
            0,
            0,
            0.4875,
            6.4375
          ],
          "texture": "#1"
        },
        "east": {
          "uv": [
            0,
            0,
            0.1125,
            6.4375
          ],
          "texture": "#1"
        },
        "south": {
          "uv": [
            0,
            0,
            0.4875,
            6.4375
          ],
          "texture": "#1"
        },
        "west": {
          "uv": [
            0,
            0,
            0.1125,
            6.4375
          ],
          "texture": "#1"
        },
        "up": {
          "uv": [
            0,
            0,
            0.4875,
            0.1125
          ],
          "texture": "#1"
        },
        "down": {
          "uv": [
            0,
            0,
            0.4875,
            0.1125
          ],
          "texture": "#1"
        }
      }
    },
    {
      "name": "cube",
      "from": [
        7.687500000000001,
        11.75,
        8.1875
      ],
      "to": [
        8.175,
        18.1875,
        8.3
      ],
      "faces": {
        "north": {
          "uv": [
            0,
            0,
            0.4875,
            6.4375
          ],
          "texture": "#1"
        },
        "east": {
          "uv": [
            0,
            0,
            0.1125,
            6.4375
          ],
          "texture": "#1"
        },
        "south": {
          "uv": [
            0,
            0,
            0.4875,
            6.4375
          ],
          "texture": "#1"
        },
        "west": {
          "uv": [
            0,
            0,
            0.1125,
            6.4375
          ],
          "texture": "#1"
        },
        "up": {
          "uv": [
            0,
            0,
            0.4875,
            0.1125
          ],
          "texture": "#1"
        },
        "down": {
          "uv": [
            0,
            0,
            0.4875,
            0.1125
          ],
          "texture": "#1"
        }
      }
    },
    {
      "name": "cube",
      "from": [
        7.875000000000001,
        21.75,
        16.625
      ],
      "to": [
        7.987500000000001,
        23.625,
        17.6125
      ],
      "faces": {
        "north": {
          "uv": [
            0,
            0,
            0.1125,
            1.875
          ],
          "texture": "#2"
        },
        "east": {
          "uv": [
            0,
            0,
            0.9875,
            1.875
          ],
          "texture": "#2"
        },
        "south": {
          "uv": [
            0,
            0,
            0.1125,
            1.875
          ],
          "texture": "#2"
        },
        "west": {
          "uv": [
            0,
            0,
            0.9875,
            1.875
          ],
          "texture": "#2"
        },
        "up": {
          "uv": [
            0,
            0,
            0.1125,
            0.9875
          ],
          "texture": "#2"
        },
        "down": {
          "uv": [
            0,
            0,
            0.1125,
            0.9875
          ],
          "texture": "#2"
        }
      },
      "rotation": {
        "origin": [
          8,
          9.6875,
          17.125
        ],
        "axis": "x",
        "angle": -45
      }
    },
    {
      "name": "cube",
      "from": [
        7.875000000000001,
        21.1875,
        16.6875
      ],
      "to": [
        7.987500000000001,
        22.3075,
        17.675
      ],
      "faces": {
        "north": {
          "uv": [
            0,
            0,
            0.1125,
            1.12
          ],
          "texture": "#2"
        },
        "east": {
          "uv": [
            0,
            0,
            0.9875,
            1.12
          ],
          "texture": "#2"
        },
        "south": {
          "uv": [
            0,
            0,
            0.1125,
            1.12
          ],
          "texture": "#2"
        },
        "west": {
          "uv": [
            0,
            0,
            0.9875,
            1.12
          ],
          "texture": "#2"
        },
        "up": {
          "uv": [
            0,
            0,
            0.1125,
            0.9875
          ],
          "texture": "#2"
        },
        "down": {
          "uv": [
            0,
            0,
            0.1125,
            0.9875
          ],
          "texture": "#2"
        }
      },
      "rotation": {
        "origin": [
          8,
          8.3125,
          17.1875
        ],
        "axis": "x",
        "angle": -45
      }
    },
    {
      "name": "cube",
      "from": [
        7.875000000000001,
        20.875,
        -1.625
      ],
      "to": [
        7.987500000000001,
        22.315,
        -0.575
      ],
      "faces": {
        "north": {
          "uv": [
            0,
            0,
            0.1125,
            1.44
          ],
          "texture": "#2"
        },
        "east": {
          "uv": [
            0,
            0,
            1.05,
            1.44
          ],
          "texture": "#2"
        },
        "south": {
          "uv": [
            0,
            0,
            0.1125,
            1.44
          ],
          "texture": "#2"
        },
        "west": {
          "uv": [
            0,
            0,
            1.05,
            1.44
          ],
          "texture": "#2"
        },
        "up": {
          "uv": [
            0,
            0,
            0.1125,
            1.05
          ],
          "texture": "#2"
        },
        "down": {
          "uv": [
            0,
            0,
            0.1125,
            1.05
          ],
          "texture": "#2"
        }
      },
      "rotation": {
        "origin": [
          8,
          8.437500000000002,
          -1.125
        ],
        "axis": "x",
        "angle": 45
      }
    },
    {
      "name": "cube",
      "from": [
        7.8625,
        16.65,
        7.909999999999999
      ],
      "to": [
        8,
        17.9625,
        8.95
      ],
      "faces": {
        "north": {
          "uv": [
            0,
            0,
            0.1375,
            1.3125
          ],
          "texture": "#3"
        },
        "east": {
          "uv": [
            0,
            0,
            1.04,
            1.3125
          ],
          "texture": "#3"
        },
        "south": {
          "uv": [
            0,
            0,
            0.1375,
            1.3125
          ],
          "texture": "#3"
        },
        "west": {
          "uv": [
            0,
            0,
            1.04,
            1.3125
          ],
          "texture": "#3"
        },
        "up": {
          "uv": [
            0,
            0,
            0.1375,
            1.04
          ],
          "texture": "#3"
        },
        "down": {
          "uv": [
            0,
            0,
            0.1375,
            1.04
          ],
          "texture": "#3"
        }
      },
      "rotation": {
        "origin": [
          8,
          15.149999999999999,
          8.425
        ],
        "axis": "x",
        "angle": -22.5
      }
    },
    {
      "name": "cube",
      "from": [
        7.8625,
        16.012500000000003,
        7.084999999999998
      ],
      "to": [
        8,
        18.137500000000003,
        8.124999999999998
      ],
      "faces": {
        "north": {
          "uv": [
            0,
            0,
            0.1375,
            2.125
          ],
          "texture": "#3"
        },
        "east": {
          "uv": [
            0,
            0,
            1.04,
            2.125
          ],
          "texture": "#3"
        },
        "south": {
          "uv": [
            0,
            0,
            0.1375,
            2.125
          ],
          "texture": "#3"
        },
        "west": {
          "uv": [
            0,
            0,
            1.04,
            2.125
          ],
          "texture": "#3"
        },
        "up": {
          "uv": [
            0,
            0,
            0.1375,
            1.04
          ],
          "texture": "#3"
        },
        "down": {
          "uv": [
            0,
            0,
            0.1375,
            1.04
          ],
          "texture": "#3"
        }
      },
      "rotation": {
        "origin": [
          8,
          15.325000000000003,
          7.1
        ],
        "axis": "x",
        "angle": 22.5
      }
    },
    {
      "name": "cube",
      "from": [
        7.750000000000001,
        19.1875,
        3.8400000000000003
      ],
      "to": [
        8.1125,
        20.1875,
        4.3025
      ],
      "faces": {
        "north": {
          "uv": [
            0,
            0,
            0.3625,
            1
          ],
          "texture": "#0"
        },
        "east": {
          "uv": [
            0,
            0,
            0.4625,
            1
          ],
          "texture": "#0"
        },
        "south": {
          "uv": [
            0,
            0,
            0.3625,
            1
          ],
          "texture": "#0"
        },
        "west": {
          "uv": [
            0,
            0,
            0.4625,
            1
          ],
          "texture": "#0"
        },
        "up": {
          "uv": [
            0,
            0,
            0.3625,
            0.4625
          ],
          "texture": "#0"
        },
        "down": {
          "uv": [
            0,
            0,
            0.3625,
            0.4625
          ],
          "texture": "#0"
        }
      },
      "rotation": {
        "origin": [
          8,
          13.625,
          3.8125
        ],
        "axis": "x",
        "angle": 45
      }
    },
    {
      "name": "cube",
      "from": [
        7.750000000000001,
        18.75,
        11.9025
      ],
      "to": [
        8.1125,
        19.8125,
        12.365
      ],
      "faces": {
        "north": {
          "uv": [
            0,
            0,
            0.3625,
            1.0625
          ],
          "texture": "#0"
        },
        "east": {
          "uv": [
            0,
            0,
            0.4625,
            1.0625
          ],
          "texture": "#0"
        },
        "south": {
          "uv": [
            0,
            0,
            0.3625,
            1.0625
          ],
          "texture": "#0"
        },
        "west": {
          "uv": [
            0,
            0,
            0.4625,
            1.0625
          ],
          "texture": "#0"
        },
        "up": {
          "uv": [
            0,
            0,
            0.3625,
            0.4625
          ],
          "texture": "#0"
        },
        "down": {
          "uv": [
            0,
            0,
            0.3625,
            0.4625
          ],
          "texture": "#0"
        }
      },
      "rotation": {
        "origin": [
          8,
          13.25,
          11.875
        ],
        "axis": "x",
        "angle": -45
      }
    },
    {
      "name": "cube",
      "from": [
        7.750000000000001,
        17.625,
        7.697500000000001
      ],
      "to": [
        8.1125,
        19.1875,
        8.3
      ],
      "faces": {
        "north": {
          "uv": [
            0,
            0,
            0.3625,
            1.5625
          ],
          "texture": "#0"
        },
        "east": {
          "uv": [
            0,
            0,
            0.6025,
            1.5625
          ],
          "texture": "#0"
        },
        "south": {
          "uv": [
            0,
            0,
            0.3625,
            1.5625
          ],
          "texture": "#0"
        },
        "west": {
          "uv": [
            0,
            0,
            0.6025,
            1.5625
          ],
          "texture": "#0"
        },
        "up": {
          "uv": [
            0,
            0,
            0.3625,
            0.6025
          ],
          "texture": "#0"
        },
        "down": {
          "uv": [
            0,
            0,
            0.3625,
            0.6025
          ],
          "texture": "#0"
        }
      }
    },
    {
      "name": "cube",
      "from": [
        7.7375,
        11.7125,
        7.222499999999999
      ],
      "to": [
        8.125,
        14.525,
        8.075
      ],
      "faces": {
        "north": {
          "uv": [
            0,
            0,
            0.3875,
            2.8125
          ],
          "texture": "#3"
        },
        "east": {
          "uv": [
            0,
            0,
            0.8525,
            2.8125
          ],
          "texture": "#3"
        },
        "south": {
          "uv": [
            0,
            0,
            0.3875,
            2.8125
          ],
          "texture": "#3"
        },
        "west": {
          "uv": [
            0,
            0,
            0.8525,
            2.8125
          ],
          "texture": "#3"
        },
        "up": {
          "uv": [
            0,
            0,
            0.3875,
            0.8525
          ],
          "texture": "#3"
        },
        "down": {
          "uv": [
            0,
            0,
            0.3875,
            0.8525
          ],
          "texture": "#3"
        }
      },
      "rotation": {
        "origin": [
          8,
          11.7125,
          7.737500000000001
        ],
        "axis": "x",
        "angle": 0
      }
    },
    {
      "name": "cube",
      "from": [
        7.7375,
        12.65,
        6.284999999999999
      ],
      "to": [
        8.125,
        13.525,
        6.887499999999999
      ],
      "faces": {
        "north": {
          "uv": [
            0,
            0,
            0.3875,
            0.875
          ],
          "texture": "#3"
        },
        "east": {
          "uv": [
            0,
            0,
            0.6025,
            0.875
          ],
          "texture": "#3"
        },
        "south": {
          "uv": [
            0,
            0,
            0.3875,
            0.875
          ],
          "texture": "#3"
        },
        "west": {
          "uv": [
            0,
            0,
            0.6025,
            0.875
          ],
          "texture": "#3"
        },
        "up": {
          "uv": [
            0,
            0,
            0.3875,
            0.6025
          ],
          "texture": "#3"
        },
        "down": {
          "uv": [
            0,
            0,
            0.3875,
            0.6025
          ],
          "texture": "#3"
        }
      },
      "rotation": {
        "origin": [
          8,
          12.0875,
          6.800000000000001
        ],
        "axis": "x",
        "angle": 45
      }
    },
    {
      "name": "cube",
      "from": [
        7.8625,
        12.65,
        6.409999999999999
      ],
      "to": [
        8,
        13.525,
        7.449999999999999
      ],
      "faces": {
        "north": {
          "uv": [
            0,
            0,
            0.1375,
            0.875
          ],
          "texture": "#3"
        },
        "east": {
          "uv": [
            0,
            0,
            1.04,
            0.875
          ],
          "texture": "#3"
        },
        "south": {
          "uv": [
            0,
            0,
            0.1375,
            0.875
          ],
          "texture": "#3"
        },
        "west": {
          "uv": [
            0,
            0,
            1.04,
            0.875
          ],
          "texture": "#3"
        },
        "up": {
          "uv": [
            0,
            0,
            0.1375,
            1.04
          ],
          "texture": "#3"
        },
        "down": {
          "uv": [
            0,
            0,
            0.1375,
            1.04
          ],
          "texture": "#3"
        }
      },
      "rotation": {
        "origin": [
          8,
          12.0875,
          6.925000000000001
        ],
        "axis": "x",
        "angle": 45
      }
    },
    {
      "name": "cube",
      "from": [
        7.8625,
        11.7125,
        6.847499999999999
      ],
      "to": [
        8,
        12.8375,
        7.887499999999999
      ],
      "faces": {
        "north": {
          "uv": [
            0,
            0,
            0.1375,
            1.125
          ],
          "texture": "#3"
        },
        "east": {
          "uv": [
            0,
            0,
            1.04,
            1.125
          ],
          "texture": "#3"
        },
        "south": {
          "uv": [
            0,
            0,
            0.1375,
            1.125
          ],
          "texture": "#3"
        },
        "west": {
          "uv": [
            0,
            0,
            1.04,
            1.125
          ],
          "texture": "#3"
        },
        "up": {
          "uv": [
            0,
            0,
            0.1375,
            1.04
          ],
          "texture": "#3"
        },
        "down": {
          "uv": [
            0,
            0,
            0.1375,
            1.04
          ],
          "texture": "#3"
        }
      },
      "rotation": {
        "origin": [
          8,
          11.4,
          7.362500000000001
        ],
        "axis": "x",
        "angle": 0
      }
    },
    {
      "name": "cube",
      "from": [
        7.750000000000001,
        14.125,
        7.500000000000001
      ],
      "to": [
        8.1125,
        15.8125,
        7.737500000000001
      ],
      "faces": {
        "north": {
          "uv": [
            0,
            0,
            0.3625,
            1.6875
          ],
          "texture": "#2"
        },
        "east": {
          "uv": [
            0,
            0,
            0.2375,
            1.6875
          ],
          "texture": "#2"
        },
        "south": {
          "uv": [
            0,
            0,
            0.3625,
            1.6875
          ],
          "texture": "#2"
        },
        "west": {
          "uv": [
            0,
            0,
            0.2375,
            1.6875
          ],
          "texture": "#2"
        },
        "up": {
          "uv": [
            0,
            0,
            0.3625,
            0.2375
          ],
          "texture": "#2"
        },
        "down": {
          "uv": [
            0,
            0,
            0.3625,
            0.2375
          ],
          "texture": "#2"
        }
      }
    },
    {
      "name": "cube",
      "from": [
        7.7375,
        11.7125,
        6.847499999999999
      ],
      "to": [
        8.125,
        12.8375,
        7.887499999999999
      ],
      "faces": {
        "north": {
          "uv": [
            0,
            0,
            0.3875,
            1.125
          ],
          "texture": "#3"
        },
        "east": {
          "uv": [
            0,
            0,
            1.04,
            1.125
          ],
          "texture": "#3"
        },
        "south": {
          "uv": [
            0,
            0,
            0.3875,
            1.125
          ],
          "texture": "#3"
        },
        "west": {
          "uv": [
            0,
            0,
            1.04,
            1.125
          ],
          "texture": "#3"
        },
        "up": {
          "uv": [
            0,
            0,
            0.3875,
            1.04
          ],
          "texture": "#3"
        },
        "down": {
          "uv": [
            0,
            0,
            0.3875,
            1.04
          ],
          "texture": "#3"
        }
      },
      "rotation": {
        "origin": [
          8,
          11.4,
          7.362500000000001
        ],
        "axis": "x",
        "angle": 0
      }
    },
    {
      "name": "cube",
      "from": [
        7.875000000000001,
        14.125,
        7.250000000000001
      ],
      "to": [
        7.987500000000001,
        20,
        8.2375
      ],
      "faces": {
        "north": {
          "uv": [
            0,
            0,
            0.1125,
            5.875
          ],
          "texture": "#2"
        },
        "east": {
          "uv": [
            0,
            0,
            0.9875,
            5.875
          ],
          "texture": "#2"
        },
        "south": {
          "uv": [
            0,
            0,
            0.1125,
            5.875
          ],
          "texture": "#2"
        },
        "west": {
          "uv": [
            0,
            0,
            0.9875,
            5.875
          ],
          "texture": "#2"
        },
        "up": {
          "uv": [
            0,
            0,
            0.1125,
            0.9875
          ],
          "texture": "#2"
        },
        "down": {
          "uv": [
            0,
            0,
            0.1125,
            0.9875
          ],
          "texture": "#2"
        }
      }
    },
    {
      "name": "cube",
      "from": [
        7.812500000000001,
        14.125,
        7.312500000000001
      ],
      "to": [
        8.05,
        15.8125,
        7.550000000000001
      ],
      "faces": {
        "north": {
          "uv": [
            0,
            0,
            0.2375,
            1.6875
          ],
          "texture": "#2"
        },
        "east": {
          "uv": [
            0,
            0,
            0.2375,
            1.6875
          ],
          "texture": "#2"
        },
        "south": {
          "uv": [
            0,
            0,
            0.2375,
            1.6875
          ],
          "texture": "#2"
        },
        "west": {
          "uv": [
            0,
            0,
            0.2375,
            1.6875
          ],
          "texture": "#2"
        },
        "up": {
          "uv": [
            0,
            0,
            0.2375,
            0.2375
          ],
          "texture": "#2"
        },
        "down": {
          "uv": [
            0,
            0,
            0.2375,
            0.2375
          ],
          "texture": "#2"
        }
      }
    },
    {
      "name": "cube",
      "from": [
        7.8,
        15.825000000000003,
        7.334999999999998
      ],
      "to": [
        8.0625,
        17.137500000000003,
        7.749999999999998
      ],
      "faces": {
        "north": {
          "uv": [
            0,
            0,
            0.2625,
            1.3125
          ],
          "texture": "#3"
        },
        "east": {
          "uv": [
            0,
            0,
            0.415,
            1.3125
          ],
          "texture": "#3"
        },
        "south": {
          "uv": [
            0,
            0,
            0.2625,
            1.3125
          ],
          "texture": "#3"
        },
        "west": {
          "uv": [
            0,
            0,
            0.415,
            1.3125
          ],
          "texture": "#3"
        },
        "up": {
          "uv": [
            0,
            0,
            0.2625,
            0.415
          ],
          "texture": "#3"
        },
        "down": {
          "uv": [
            0,
            0,
            0.2625,
            0.415
          ],
          "texture": "#3"
        }
      },
      "rotation": {
        "origin": [
          8,
          14.325000000000003,
          7.225
        ],
        "axis": "x",
        "angle": 0
      }
    },
    {
      "name": "cube",
      "from": [
        7.675,
        11.7125,
        7.159999999999999
      ],
      "to": [
        8.1875,
        14.525,
        8.0125
      ],
      "faces": {
        "north": {
          "uv": [
            0,
            0,
            0.5125,
            2.8125
          ],
          "texture": "#3"
        },
        "east": {
          "uv": [
            0,
            0,
            0.8525,
            2.8125
          ],
          "texture": "#3"
        },
        "south": {
          "uv": [
            0,
            0,
            0.5125,
            2.8125
          ],
          "texture": "#3"
        },
        "west": {
          "uv": [
            0,
            0,
            0.8525,
            2.8125
          ],
          "texture": "#3"
        },
        "up": {
          "uv": [
            0,
            0,
            0.5125,
            0.8525
          ],
          "texture": "#3"
        },
        "down": {
          "uv": [
            0,
            0,
            0.5125,
            0.8525
          ],
          "texture": "#3"
        }
      },
      "rotation": {
        "origin": [
          8,
          11.7125,
          7.675000000000001
        ],
        "axis": "x",
        "angle": 0
      }
    },
    {
      "name": "cube",
      "from": [
        7.7375,
        11.712499999999999,
        7.847499999999999
      ],
      "to": [
        8.125,
        18.2125,
        8.2
      ],
      "faces": {
        "north": {
          "uv": [
            0,
            0,
            0.3875,
            6.5
          ],
          "texture": "#3"
        },
        "east": {
          "uv": [
            0,
            0,
            0.3525,
            6.5
          ],
          "texture": "#3"
        },
        "south": {
          "uv": [
            0,
            0,
            0.3875,
            6.5
          ],
          "texture": "#3"
        },
        "west": {
          "uv": [
            0,
            0,
            0.3525,
            6.5
          ],
          "texture": "#3"
        },
        "up": {
          "uv": [
            0,
            0,
            0.3875,
            0.3525
          ],
          "texture": "#3"
        },
        "down": {
          "uv": [
            0,
            0,
            0.3875,
            0.3525
          ],
          "texture": "#3"
        }
      },
      "rotation": {
        "origin": [
          8,
          11.712499999999999,
          7.925000000000001
        ],
        "axis": "x",
        "angle": 0
      }
    },
    {
      "name": "cube",
      "from": [
        7.875000000000001,
        11.4375,
        7.562500000000001
      ],
      "to": [
        7.987500000000001,
        14.5,
        8.3
      ],
      "faces": {
        "north": {
          "uv": [
            0,
            0,
            0.1125,
            3.0625
          ],
          "texture": "#2"
        },
        "east": {
          "uv": [
            0,
            0,
            0.7375,
            3.0625
          ],
          "texture": "#2"
        },
        "south": {
          "uv": [
            0,
            0,
            0.1125,
            3.0625
          ],
          "texture": "#2"
        },
        "west": {
          "uv": [
            0,
            0,
            0.7375,
            3.0625
          ],
          "texture": "#2"
        },
        "up": {
          "uv": [
            0,
            0,
            0.1125,
            0.7375
          ],
          "texture": "#2"
        },
        "down": {
          "uv": [
            0,
            0,
            0.1125,
            0.7375
          ],
          "texture": "#2"
        }
      }
    },
    {
      "name": "cube",
      "from": [
        7.812500000000001,
        11.4375,
        7.625000000000001
      ],
      "to": [
        8.05,
        14.5,
        8.2375
      ],
      "faces": {
        "north": {
          "uv": [
            0,
            0,
            0.2375,
            3.0625
          ],
          "texture": "#2"
        },
        "east": {
          "uv": [
            0,
            0,
            0.6125,
            3.0625
          ],
          "texture": "#2"
        },
        "south": {
          "uv": [
            0,
            0,
            0.2375,
            3.0625
          ],
          "texture": "#2"
        },
        "west": {
          "uv": [
            0,
            0,
            0.6125,
            3.0625
          ],
          "texture": "#2"
        },
        "up": {
          "uv": [
            0,
            0,
            0.2375,
            0.6125
          ],
          "texture": "#2"
        },
        "down": {
          "uv": [
            0,
            0,
            0.2375,
            0.6125
          ],
          "texture": "#2"
        }
      }
    },
    {
      "name": "cube",
      "from": [
        7.750000000000001,
        11.4375,
        7.687500000000001
      ],
      "to": [
        8.1125,
        14.5,
        8.175
      ],
      "faces": {
        "north": {
          "uv": [
            0,
            0,
            0.3625,
            3.0625
          ],
          "texture": "#2"
        },
        "east": {
          "uv": [
            0,
            0,
            0.4875,
            3.0625
          ],
          "texture": "#2"
        },
        "south": {
          "uv": [
            0,
            0,
            0.3625,
            3.0625
          ],
          "texture": "#2"
        },
        "west": {
          "uv": [
            0,
            0,
            0.4875,
            3.0625
          ],
          "texture": "#2"
        },
        "up": {
          "uv": [
            0,
            0,
            0.3625,
            0.4875
          ],
          "texture": "#2"
        },
        "down": {
          "uv": [
            0,
            0,
            0.3625,
            0.4875
          ],
          "texture": "#2"
        }
      }
    },
    {
      "name": "cube",
      "from": [
        7.675,
        11.8375,
        8.285
      ],
      "to": [
        8.1875,
        13.7125,
        8.825
      ],
      "faces": {
        "north": {
          "uv": [
            0,
            0,
            0.5125,
            1.875
          ],
          "texture": "#3"
        },
        "east": {
          "uv": [
            0,
            0,
            0.54,
            1.875
          ],
          "texture": "#3"
        },
        "south": {
          "uv": [
            0,
            0,
            0.5125,
            1.875
          ],
          "texture": "#3"
        },
        "west": {
          "uv": [
            0,
            0,
            0.54,
            1.875
          ],
          "texture": "#3"
        },
        "up": {
          "uv": [
            0,
            0,
            0.5125,
            0.54
          ],
          "texture": "#3"
        },
        "down": {
          "uv": [
            0,
            0,
            0.5125,
            0.54
          ],
          "texture": "#3"
        }
      },
      "rotation": {
        "origin": [
          8,
          11.65,
          8.6125
        ],
        "axis": "x",
        "angle": -22.5
      }
    },
    {
      "name": "cube",
      "from": [
        7.675,
        11.7125,
        7.159999999999999
      ],
      "to": [
        8.1875,
        13.0875,
        8.2625
      ],
      "faces": {
        "north": {
          "uv": [
            0,
            0,
            0.5125,
            1.375
          ],
          "texture": "#3"
        },
        "east": {
          "uv": [
            0,
            0,
            1.1025,
            1.375
          ],
          "texture": "#3"
        },
        "south": {
          "uv": [
            0,
            0,
            0.5125,
            1.375
          ],
          "texture": "#3"
        },
        "west": {
          "uv": [
            0,
            0,
            1.1025,
            1.375
          ],
          "texture": "#3"
        },
        "up": {
          "uv": [
            0,
            0,
            0.5125,
            1.1025
          ],
          "texture": "#3"
        },
        "down": {
          "uv": [
            0,
            0,
            0.5125,
            1.1025
          ],
          "texture": "#3"
        }
      },
      "rotation": {
        "origin": [
          8,
          11.7125,
          7.675000000000001
        ],
        "axis": "x",
        "angle": 0
      }
    },
    {
      "name": "cube",
      "from": [
        7.875000000000001,
        18.5,
        7.312500000000001
      ],
      "to": [
        7.987500000000001,
        27.875,
        8.7375
      ],
      "faces": {
        "north": {
          "uv": [
            0,
            0,
            0.1125,
            9.375
          ],
          "texture": "#2"
        },
        "east": {
          "uv": [
            0,
            0,
            1.425,
            9.375
          ],
          "texture": "#2"
        },
        "south": {
          "uv": [
            0,
            0,
            0.1125,
            9.375
          ],
          "texture": "#2"
        },
        "west": {
          "uv": [
            0,
            0,
            1.425,
            9.375
          ],
          "texture": "#2"
        },
        "up": {
          "uv": [
            0,
            0,
            0.1125,
            1.425
          ],
          "texture": "#2"
        },
        "down": {
          "uv": [
            0,
            0,
            0.1125,
            1.425
          ],
          "texture": "#2"
        }
      }
    },
    {
      "name": "cube",
      "from": [
        7.875000000000001,
        21.6875,
        7.125000000000001
      ],
      "to": [
        7.987500000000001,
        25.875,
        8.8625
      ],
      "faces": {
        "north": {
          "uv": [
            0,
            0,
            0.1125,
            4.1875
          ],
          "texture": "#2"
        },
        "east": {
          "uv": [
            0,
            0,
            1.7375,
            4.1875
          ],
          "texture": "#2"
        },
        "south": {
          "uv": [
            0,
            0,
            0.1125,
            4.1875
          ],
          "texture": "#2"
        },
        "west": {
          "uv": [
            0,
            0,
            1.7375,
            4.1875
          ],
          "texture": "#2"
        },
        "up": {
          "uv": [
            0,
            0,
            0.1125,
            1.7375
          ],
          "texture": "#2"
        },
        "down": {
          "uv": [
            0,
            0,
            0.1125,
            1.7375
          ],
          "texture": "#2"
        }
      }
    },
    {
      "name": "cube",
      "from": [
        7.812500000000001,
        -5.25,
        7.625000000000001
      ],
      "to": [
        8.05,
        12.6875,
        8.2375
      ],
      "faces": {
        "north": {
          "uv": [
            0,
            0,
            0.2375,
            16
          ],
          "texture": "#2"
        },
        "east": {
          "uv": [
            0,
            0,
            0.6125,
            16
          ],
          "texture": "#2"
        },
        "south": {
          "uv": [
            0,
            0,
            0.2375,
            16
          ],
          "texture": "#2"
        },
        "west": {
          "uv": [
            0,
            0,
            0.6125,
            16
          ],
          "texture": "#2"
        },
        "up": {
          "uv": [
            0,
            0,
            0.2375,
            0.6125
          ],
          "texture": "#2"
        },
        "down": {
          "uv": [
            0,
            0,
            0.2375,
            0.6125
          ],
          "texture": "#2"
        }
      }
    },
    {
      "name": "cube",
      "from": [
        7.875000000000001,
        -5.25,
        7.562500000000001
      ],
      "to": [
        7.987500000000001,
        12.6875,
        8.3
      ],
      "faces": {
        "north": {
          "uv": [
            0,
            0,
            0.1125,
            16
          ],
          "texture": "#2"
        },
        "east": {
          "uv": [
            0,
            0,
            0.7375,
            16
          ],
          "texture": "#2"
        },
        "south": {
          "uv": [
            0,
            0,
            0.1125,
            16
          ],
          "texture": "#2"
        },
        "west": {
          "uv": [
            0,
            0,
            0.7375,
            16
          ],
          "texture": "#2"
        },
        "up": {
          "uv": [
            0,
            0,
            0.1125,
            0.7375
          ],
          "texture": "#2"
        },
        "down": {
          "uv": [
            0,
            0,
            0.1125,
            0.7375
          ],
          "texture": "#2"
        }
      }
    },
    {
      "name": "cube",
      "from": [
        7.750000000000001,
        -5.25,
        7.687500000000001
      ],
      "to": [
        8.1125,
        12.6875,
        8.175
      ],
      "faces": {
        "north": {
          "uv": [
            0,
            0,
            0.3625,
            16
          ],
          "texture": "#2"
        },
        "east": {
          "uv": [
            0,
            0,
            0.4875,
            16
          ],
          "texture": "#2"
        },
        "south": {
          "uv": [
            0,
            0,
            0.3625,
            16
          ],
          "texture": "#2"
        },
        "west": {
          "uv": [
            0,
            0,
            0.4875,
            16
          ],
          "texture": "#2"
        },
        "up": {
          "uv": [
            0,
            0,
            0.3625,
            0.4875
          ],
          "texture": "#2"
        },
        "down": {
          "uv": [
            0,
            0,
            0.3625,
            0.4875
          ],
          "texture": "#2"
        }
      }
    },
    {
      "name": "cube",
      "from": [
        7.687500000000001,
        -5.125,
        7.687500000000001
      ],
      "to": [
        8.175,
        -4.1875,
        8.175
      ],
      "faces": {
        "north": {
          "uv": [
            0,
            0,
            0.4875,
            0.9375
          ],
          "texture": "#2"
        },
        "east": {
          "uv": [
            0,
            0,
            0.4875,
            0.9375
          ],
          "texture": "#2"
        },
        "south": {
          "uv": [
            0,
            0,
            0.4875,
            0.9375
          ],
          "texture": "#2"
        },
        "west": {
          "uv": [
            0,
            0,
            0.4875,
            0.9375
          ],
          "texture": "#2"
        },
        "up": {
          "uv": [
            0,
            0,
            0.4875,
            0.4875
          ],
          "texture": "#2"
        },
        "down": {
          "uv": [
            0,
            0,
            0.4875,
            0.4875
          ],
          "texture": "#2"
        }
      }
    },
    {
      "name": "cube",
      "from": [
        7.875000000000001,
        -5.125,
        7.500000000000001
      ],
      "to": [
        7.987500000000001,
        -4.1875,
        8.3625
      ],
      "faces": {
        "north": {
          "uv": [
            0,
            0,
            0.1125,
            0.9375
          ],
          "texture": "#2"
        },
        "east": {
          "uv": [
            0,
            0,
            0.8625,
            0.9375
          ],
          "texture": "#2"
        },
        "south": {
          "uv": [
            0,
            0,
            0.1125,
            0.9375
          ],
          "texture": "#2"
        },
        "west": {
          "uv": [
            0,
            0,
            0.8625,
            0.9375
          ],
          "texture": "#2"
        },
        "up": {
          "uv": [
            0,
            0,
            0.1125,
            0.8625
          ],
          "texture": "#2"
        },
        "down": {
          "uv": [
            0,
            0,
            0.1125,
            0.8625
          ],
          "texture": "#2"
        }
      }
    },
    {
      "name": "cube",
      "from": [
        7.750000000000001,
        -5.125,
        7.562500000000001
      ],
      "to": [
        8.1125,
        -4.1875,
        8.3
      ],
      "faces": {
        "north": {
          "uv": [
            0,
            0,
            0.3625,
            0.9375
          ],
          "texture": "#2"
        },
        "east": {
          "uv": [
            0,
            0,
            0.7375,
            0.9375
          ],
          "texture": "#2"
        },
        "south": {
          "uv": [
            0,
            0,
            0.3625,
            0.9375
          ],
          "texture": "#2"
        },
        "west": {
          "uv": [
            0,
            0,
            0.7375,
            0.9375
          ],
          "texture": "#2"
        },
        "up": {
          "uv": [
            0,
            0,
            0.3625,
            0.7375
          ],
          "texture": "#2"
        },
        "down": {
          "uv": [
            0,
            0,
            0.3625,
            0.7375
          ],
          "texture": "#2"
        }
      }
    }
  ],
  "display": {
    "thirdperson_righthand": {
      "translation": [
        0,
        -0.5,
        0
      ],
      "scale": [
        1.6,
        1.3,
        1.15
      ]
    },
    "thirdperson_lefthand": {
      "scale": [
        1.6,
        1.3,
        1.15
      ],
      "translation": [
        0,
        -0.5,
        0
      ]
    },
    "firstperson_righthand": {
      "scale": [
        1.6,
        1.3,
        1.15
      ],
      "translation": [
        0,
        -1,
        0
      ]
    },
    "firstperson_lefthand": {
      "scale": [
        1.6,
        1.3,
        1.15
      ]
    },
    "ground": {
      "scale": [
        0.55,
        0.55,
        0.525
      ]
    },
    "fixed": {
      "scale": [
        0.44999999999999996,
        0.475,
        0.675
      ],
      "rotation": [
        0,
        90,
        0
      ],
      "translation": [
        -0.5,
        -2.5,
        -1
      ]
    },
    "gui": {
      "scale": [
        0.475,
        0.4,
        0.625
      ],
      "rotation": [
        0,
        90,
        0
      ],
      "translation": [
        0,
        -2,
        0
      ]
    }
  }
}
