{
  "textures": {
    "0": "blocks/awool_colored_cyanv",
    "1": "blocks/awool_colored_cyanv",
    "2": "blocks/awool_colored_cyanv",
    "3": "blocks/awool_colored_cyanv"
  },
  "elements": [
    {
      "name": "Cube",
      "from": [
        -2.5,
        3,
        4
      ],
      "to": [
        1.5,
        11,
        12
      ],
      "faces": {
        "north": {
          "uv": [
            0,
            0,
            0,
            0
          ],
          "texture": "#0"
        },
        "east": {
          "uv": [
            0,
            0,
            0,
            0
          ],
          "texture": "#0"
        },
        "south": {
          "uv": [
            0,
            0,
            0,
            0
          ],
          "texture": "#0"
        },
        "west": {
          "uv": [
            0,
            0,
            0,
            0
          ],
          "texture": "#0"
        },
        "up": {
          "uv": [
            0,
            0,
            0,
            0
          ],
          "texture": "#0"
        },
        "down": {
          "uv": [
            0,
            0,
            0,
            0
          ],
          "texture": "#0"
        }
      }
    },
    {
      "name": "Cube",
      "from": [
        1.5,
        4,
        5
      ],
      "to": [
        15,
        10,
        11
      ],
      "faces": {
        "north": {
          "uv": [
            0,
            0,
            0,
            0
          ],
          "texture": "#1"
        },
        "east": {
          "uv": [
            0,
            0,
            0,
            0
          ],
          "texture": "#1"
        },
        "south": {
          "uv": [
            0,
            0,
            0,
            0
          ],
          "texture": "#1"
        },
        "west": {
          "uv": [
            0,
            0,
            0,
            0
          ],
          "texture": "#1"
        },
        "up": {
          "uv": [
            0,
            0,
            0,
            0
          ],
          "texture": "#1"
        },
        "down": {
          "uv": [
            0,
            0,
            0,
            0
          ],
          "texture": "#1"
        }
      }
    },
    {
      "name": "Cube",
      "from": [
        0.5,
        4.3,
        4.5
      ],
      "to": [
        6.5,
        5.3,
        11.5
      ],
      "faces": {
        "north": {
          "uv": [
            0,
            0,
            0,
            0
          ],
          "texture": "#2"
        },
        "east": {
          "uv": [
            0,
            0,
            0,
            0
          ],
          "texture": "#2"
        },
        "south": {
          "uv": [
            0,
            0,
            0,
            0
          ],
          "texture": "#2"
        },
        "west": {
          "uv": [
            0,
            0,
            0,
            0
          ],
          "texture": "#2"
        },
        "up": {
          "uv": [
            0,
            0,
            0,
            0
          ],
          "texture": "#2"
        },
        "down": {
          "uv": [
            0,
            0,
            0,
            0
          ],
          "texture": "#2"
        }
      }
    },
    {
      "name": "Cube",
      "from": [
        0.5,
        6.3,
        4.5
      ],
      "to": [
        6.5,
        7.3,
        11.5
      ],
      "faces": {
        "north": {
          "uv": [
            0,
            0,
            0,
            0
          ],
          "texture": "#2"
        },
        "east": {
          "uv": [
            0,
            0,
            0,
            0
          ],
          "texture": "#2"
        },
        "south": {
          "uv": [
            0,
            0,
            0,
            0
          ],
          "texture": "#2"
        },
        "west": {
          "uv": [
            0,
            0,
            0,
            0
          ],
          "texture": "#2"
        },
        "up": {
          "uv": [
            0,
            0,
            0,
            0
          ],
          "texture": "#2"
        },
        "down": {
          "uv": [
            0,
            0,
            0,
            0
          ],
          "texture": "#2"
        }
      }
    },
    {
      "name": "Cube",
      "from": [
        0.5,
        8.3,
        4.5
      ],
      "to": [
        6.5,
        9.3,
        11.5
      ],
      "faces": {
        "north": {
          "uv": [
            0,
            0,
            0,
            0
          ],
          "texture": "#2"
        },
        "east": {
          "uv": [
            0,
            0,
            0,
            0
          ],
          "texture": "#2"
        },
        "south": {
          "uv": [
            0,
            0,
            0,
            0
          ],
          "texture": "#2"
        },
        "west": {
          "uv": [
            0,
            0,
            0,
            0
          ],
          "texture": "#2"
        },
        "up": {
          "uv": [
            0,
            0,
            0,
            0
          ],
          "texture": "#2"
        },
        "down": {
          "uv": [
            0,
            0,
            0,
            0
          ],
          "texture": "#2"
        }
      }
    },
    {
      "name": "Cube",
      "from": [
        0.5,
        3.3000000000000007,
        9.5
      ],
      "to": [
        6.5,
        10.3,
        10.5
      ],
      "faces": {
        "north": {
          "uv": [
            0,
            0,
            0,
            0
          ],
          "texture": "#2"
        },
        "east": {
          "uv": [
            0,
            0,
            0,
            0
          ],
          "texture": "#2"
        },
        "south": {
          "uv": [
            0,
            0,
            0,
            0
          ],
          "texture": "#2"
        },
        "west": {
          "uv": [
            0,
            0,
            0,
            0
          ],
          "texture": "#2"
        },
        "up": {
          "uv": [
            0,
            0,
            0,
            0
          ],
          "texture": "#2"
        },
        "down": {
          "uv": [
            0,
            0,
            0,
            0
          ],
          "texture": "#2"
        }
      }
    },
    {
      "name": "Cube",
      "from": [
        0.5,
        3.3000000000000007,
        7.5
      ],
      "to": [
        6.5,
        10.3,
        8.5
      ],
      "faces": {
        "north": {
          "uv": [
            0,
            0,
            0,
            0
          ],
          "texture": "#2"
        },
        "east": {
          "uv": [
            0,
            0,
            0,
            0
          ],
          "texture": "#2"
        },
        "south": {
          "uv": [
            0,
            0,
            0,
            0
          ],
          "texture": "#2"
        },
        "west": {
          "uv": [
            0,
            0,
            0,
            0
          ],
          "texture": "#2"
        },
        "up": {
          "uv": [
            0,
            0,
            0,
            0
          ],
          "texture": "#2"
        },
        "down": {
          "uv": [
            0,
            0,
            0,
            0
          ],
          "texture": "#2"
        }
      }
    },
    {
      "name": "Cube",
      "from": [
        0.5,
        3.3000000000000007,
        5.5
      ],
      "to": [
        6.5,
        10.3,
        6.5
      ],
      "faces": {
        "north": {
          "uv": [
            0,
            0,
            0,
            0
          ],
          "texture": "#2"
        },
        "east": {
          "uv": [
            0,
            0,
            0,
            0
          ],
          "texture": "#2"
        },
        "south": {
          "uv": [
            0,
            0,
            0,
            0
          ],
          "texture": "#2"
        },
        "west": {
          "uv": [
            0,
            0,
            0,
            0
          ],
          "texture": "#2"
        },
        "up": {
          "uv": [
            0,
            0,
            0,
            0
          ],
          "texture": "#2"
        },
        "down": {
          "uv": [
            0,
            0,
            0,
            0
          ],
          "texture": "#2"
        }
      }
    },
    {
      "name": "Cube",
      "from": [
        1.5,
        12,
        4
      ],
      "to": [
        13.5,
        13,
        12
      ],
      "faces": {
        "north": {
          "uv": [
            0,
            0,
            0,
            0
          ],
          "texture": "#0"
        },
        "east": {
          "uv": [
            0,
            0,
            0,
            0
          ],
          "texture": "#0"
        },
        "south": {
          "uv": [
            0,
            0,
            0,
            0
          ],
          "texture": "#0"
        },
        "west": {
          "uv": [
            0,
            0,
            0,
            0
          ],
          "texture": "#0"
        },
        "up": {
          "uv": [
            0,
            0,
            0,
            0
          ],
          "texture": "#0"
        },
        "down": {
          "uv": [
            0,
            0,
            0,
            0
          ],
          "texture": "#0"
        }
      }
    },
    {
      "name": "Cube",
      "from": [
        1.5,
        13,
        4
      ],
      "to": [
        12.5,
        14,
        7
      ],
      "faces": {
        "north": {
          "uv": [
            0,
            0,
            0,
            0
          ],
          "texture": "#0"
        },
        "east": {
          "uv": [
            0,
            0,
            0,
            0
          ],
          "texture": "#0"
        },
        "south": {
          "uv": [
            0,
            0,
            0,
            0
          ],
          "texture": "#0"
        },
        "west": {
          "uv": [
            0,
            0,
            0,
            0
          ],
          "texture": "#0"
        },
        "up": {
          "uv": [
            0,
            0,
            0,
            0
          ],
          "texture": "#0"
        },
        "down": {
          "uv": [
            0,
            0,
            0,
            0
          ],
          "texture": "#0"
        }
      },
      "rotation": {
        "origin": [
          8,
          8,
          8
        ],
        "axis": "x",
        "angle": -22.5
      }
    },
    {
      "name": "Cube",
      "from": [
        1.5,
        13,
        9
      ],
      "to": [
        12.5,
        14,
        12
      ],
      "faces": {
        "north": {
          "uv": [
            0,
            0,
            0,
            0
          ],
          "texture": "#0"
        },
        "east": {
          "uv": [
            0,
            0,
            0,
            0
          ],
          "texture": "#0"
        },
        "south": {
          "uv": [
            0,
            0,
            0,
            0
          ],
          "texture": "#0"
        },
        "west": {
          "uv": [
            0,
            0,
            0,
            0
          ],
          "texture": "#0"
        },
        "up": {
          "uv": [
            0,
            0,
            0,
            0
          ],
          "texture": "#0"
        },
        "down": {
          "uv": [
            0,
            0,
            0,
            0
          ],
          "texture": "#0"
        }
      },
      "rotation": {
        "origin": [
          8,
          8,
          8
        ],
        "axis": "x",
        "angle": 22.5
      }
    },
    {
      "name": "Cube",
      "from": [
        1.5,
        10.5,
        4
      ],
      "to": [
        13.5,
        12.5,
        12
      ],
      "faces": {
        "north": {
          "uv": [
            8,
            13,
            9,
            14
          ],
          "texture": "#0"
        },
        "east": {
          "uv": [
            0,
            5,
            1,
            6
          ],
          "texture": "#0"
        },
        "south": {
          "uv": [
            8,
            13,
            9,
            14
          ],
          "texture": "#0"
        },
        "west": {
          "uv": [
            8,
            13,
            9,
            14
          ],
          "texture": "#0"
        },
        "up": {
          "uv": [
            8,
            13,
            9,
            14
          ],
          "texture": "#0"
        },
        "down": {
          "uv": [
            6,
            6,
            7,
            7
          ],
          "texture": "#0"
        }
      }
    },
    {
      "name": "Cube",
      "from": [
        5.6,
        3,
        4
      ],
      "to": [
        6.6,
        11,
        12
      ],
      "faces": {
        "north": {
          "uv": [
            0,
            0,
            0,
            0
          ],
          "texture": "#0"
        },
        "east": {
          "uv": [
            0,
            0,
            0,
            0
          ],
          "texture": "#0"
        },
        "south": {
          "uv": [
            0,
            0,
            0,
            0
          ],
          "texture": "#0"
        },
        "west": {
          "uv": [
            0,
            0,
            0,
            0
          ],
          "texture": "#0"
        },
        "up": {
          "uv": [
            0,
            0,
            0,
            0
          ],
          "texture": "#0"
        },
        "down": {
          "uv": [
            0,
            0,
            0,
            0
          ],
          "texture": "#0"
        }
      }
    },
    {
      "name": "Cube",
      "from": [
        1.5,
        4.2,
        4.4
      ],
      "to": [
        1.7,
        5.4,
        11.600000000000001
      ],
      "faces": {
        "north": {
          "uv": [
            0,
            0,
            0,
            0
          ],
          "texture": "#3"
        },
        "east": {
          "uv": [
            0,
            0,
            0,
            0
          ],
          "texture": "#3"
        },
        "south": {
          "uv": [
            0,
            0,
            0,
            0
          ],
          "texture": "#3"
        },
        "west": {
          "uv": [
            0,
            0,
            0,
            0
          ],
          "texture": "#3"
        },
        "up": {
          "uv": [
            0,
            0,
            0,
            0
          ],
          "texture": "#3"
        },
        "down": {
          "uv": [
            0,
            0,
            0,
            0
          ],
          "texture": "#3"
        }
      }
    },
    {
      "name": "Cube",
      "from": [
        1.5,
        6.2,
        4.4
      ],
      "to": [
        1.7,
        7.4,
        11.600000000000001
      ],
      "faces": {
        "north": {
          "uv": [
            0,
            0,
            0,
            0
          ],
          "texture": "#3"
        },
        "east": {
          "uv": [
            0,
            0,
            0,
            0
          ],
          "texture": "#3"
        },
        "south": {
          "uv": [
            0,
            0,
            0,
            0
          ],
          "texture": "#3"
        },
        "west": {
          "uv": [
            0,
            0,
            0,
            0
          ],
          "texture": "#3"
        },
        "up": {
          "uv": [
            0,
            0,
            0,
            0
          ],
          "texture": "#3"
        },
        "down": {
          "uv": [
            0,
            0,
            0,
            0
          ],
          "texture": "#3"
        }
      }
    },
    {
      "name": "Cube",
      "from": [
        1.5,
        8.2,
        4.4
      ],
      "to": [
        1.7,
        9.399999999999999,
        11.600000000000001
      ],
      "faces": {
        "north": {
          "uv": [
            0,
            0,
            0,
            0
          ],
          "texture": "#3"
        },
        "east": {
          "uv": [
            0,
            0,
            0,
            0
          ],
          "texture": "#3"
        },
        "south": {
          "uv": [
            0,
            0,
            0,
            0
          ],
          "texture": "#3"
        },
        "west": {
          "uv": [
            0,
            0,
            0,
            0
          ],
          "texture": "#3"
        },
        "up": {
          "uv": [
            0,
            0,
            0,
            0
          ],
          "texture": "#3"
        },
        "down": {
          "uv": [
            0,
            0,
            0,
            0
          ],
          "texture": "#3"
        }
      }
    },
    {
      "name": "Cube",
      "from": [
        1.5,
        3.1999999999999993,
        9.4
      ],
      "to": [
        1.7,
        10.399999999999999,
        10.6
      ],
      "faces": {
        "north": {
          "uv": [
            0,
            0,
            0,
            0
          ],
          "texture": "#3"
        },
        "east": {
          "uv": [
            0,
            0,
            0,
            0
          ],
          "texture": "#3"
        },
        "south": {
          "uv": [
            0,
            0,
            0,
            0
          ],
          "texture": "#3"
        },
        "west": {
          "uv": [
            0,
            0,
            0,
            0
          ],
          "texture": "#3"
        },
        "up": {
          "uv": [
            0,
            0,
            0,
            0
          ],
          "texture": "#3"
        },
        "down": {
          "uv": [
            0,
            0,
            0,
            0
          ],
          "texture": "#3"
        }
      }
    },
    {
      "name": "Cube",
      "from": [
        1.5,
        3.1999999999999993,
        7.4
      ],
      "to": [
        1.7,
        10.399999999999999,
        8.6
      ],
      "faces": {
        "north": {
          "uv": [
            0,
            0,
            0,
            0
          ],
          "texture": "#3"
        },
        "east": {
          "uv": [
            0,
            0,
            0,
            0
          ],
          "texture": "#3"
        },
        "south": {
          "uv": [
            0,
            0,
            0,
            0
          ],
          "texture": "#3"
        },
        "west": {
          "uv": [
            0,
            0,
            0,
            0
          ],
          "texture": "#3"
        },
        "up": {
          "uv": [
            0,
            0,
            0,
            0
          ],
          "texture": "#3"
        },
        "down": {
          "uv": [
            0,
            0,
            0,
            0
          ],
          "texture": "#3"
        }
      }
    },
    {
      "name": "Cube",
      "from": [
        1.5,
        3.1999999999999993,
        5.4
      ],
      "to": [
        1.7,
        10.399999999999999,
        6.6000000000000005
      ],
      "faces": {
        "north": {
          "uv": [
            0,
            0,
            0,
            0
          ],
          "texture": "#3"
        },
        "east": {
          "uv": [
            0,
            0,
            0,
            0
          ],
          "texture": "#3"
        },
        "south": {
          "uv": [
            0,
            0,
            0,
            0
          ],
          "texture": "#3"
        },
        "west": {
          "uv": [
            0,
            0,
            0,
            0
          ],
          "texture": "#3"
        },
        "up": {
          "uv": [
            0,
            0,
            0,
            0
          ],
          "texture": "#3"
        },
        "down": {
          "uv": [
            0,
            0,
            0,
            0
          ],
          "texture": "#3"
        }
      }
    },
    {
      "name": "Cube",
      "from": [
        -3.5,
        3.5,
        4.5
      ],
      "to": [
        -1.5,
        10.5,
        11.5
      ],
      "faces": {
        "north": {
          "uv": [
            0,
            0,
            0,
            0
          ],
          "texture": "#0"
        },
        "east": {
          "uv": [
            0,
            0,
            0,
            0
          ],
          "texture": "#0"
        },
        "south": {
          "uv": [
            0,
            0,
            0,
            0
          ],
          "texture": "#0"
        },
        "west": {
          "uv": [
            0,
            0,
            0,
            0
          ],
          "texture": "#0"
        },
        "up": {
          "uv": [
            0,
            0,
            0,
            0
          ],
          "texture": "#0"
        },
        "down": {
          "uv": [
            0,
            0,
            0,
            0
          ],
          "texture": "#0"
        }
      }
    },
    {
      "name": "Cube",
      "from": [
        -3.3,
        3.4,
        4.4
      ],
      "to": [
        -3.0999999999999996,
        10.6,
        11.600000000000001
      ],
      "faces": {
        "north": {
          "uv": [
            0,
            0,
            0,
            0
          ],
          "texture": "#1"
        },
        "east": {
          "uv": [
            0,
            0,
            0,
            0
          ],
          "texture": "#1"
        },
        "south": {
          "uv": [
            0,
            0,
            0,
            0
          ],
          "texture": "#1"
        },
        "west": {
          "uv": [
            0,
            0,
            0,
            0
          ],
          "texture": "#1"
        },
        "up": {
          "uv": [
            0,
            0,
            0,
            0
          ],
          "texture": "#1"
        },
        "down": {
          "uv": [
            0,
            0,
            0,
            0
          ],
          "texture": "#1"
        }
      }
    },
    {
      "name": "Cube",
      "from": [
        -2.3,
        2.9,
        3.9
      ],
      "to": [
        -2.0999999999999996,
        11.1,
        12.1
      ],
      "faces": {
        "north": {
          "uv": [
            0,
            0,
            0,
            0
          ],
          "texture": "#1"
        },
        "east": {
          "uv": [
            0,
            0,
            0,
            0
          ],
          "texture": "#1"
        },
        "south": {
          "uv": [
            0,
            0,
            0,
            0
          ],
          "texture": "#1"
        },
        "west": {
          "uv": [
            0,
            0,
            0,
            0
          ],
          "texture": "#1"
        },
        "up": {
          "uv": [
            0,
            0,
            0,
            0
          ],
          "texture": "#1"
        },
        "down": {
          "uv": [
            0,
            0,
            0,
            0
          ],
          "texture": "#1"
        }
      }
    },
    {
      "name": "Cube",
      "from": [
        0.9,
        2.9,
        3.9
      ],
      "to": [
        1.1,
        11.1,
        12.1
      ],
      "faces": {
        "north": {
          "uv": [
            0,
            0,
            0,
            0
          ],
          "texture": "#1"
        },
        "east": {
          "uv": [
            0,
            0,
            0,
            0
          ],
          "texture": "#1"
        },
        "south": {
          "uv": [
            0,
            0,
            0,
            0
          ],
          "texture": "#1"
        },
        "west": {
          "uv": [
            0,
            0,
            0,
            0
          ],
          "texture": "#1"
        },
        "up": {
          "uv": [
            0,
            0,
            0,
            0
          ],
          "texture": "#1"
        },
        "down": {
          "uv": [
            0,
            0,
            0,
            0
          ],
          "texture": "#1"
        }
      }
    },
    {
      "name": "Cube",
      "from": [
        5.8,
        2.9,
        3.9
      ],
      "to": [
        6,
        10.5,
        12.1
      ],
      "faces": {
        "north": {
          "uv": [
            0,
            0,
            0,
            0
          ],
          "texture": "#1"
        },
        "east": {
          "uv": [
            0,
            0,
            0,
            0
          ],
          "texture": "#1"
        },
        "south": {
          "uv": [
            0,
            0,
            0,
            0
          ],
          "texture": "#1"
        },
        "west": {
          "uv": [
            0,
            0,
            0,
            0
          ],
          "texture": "#1"
        },
        "up": {
          "uv": [
            0,
            0,
            0,
            0
          ],
          "texture": "#1"
        },
        "down": {
          "uv": [
            0,
            0,
            0,
            0
          ],
          "texture": "#1"
        }
      }
    },
    {
      "name": "Cube",
      "from": [
        2,
        12,
        2
      ],
      "to": [
        8,
        13,
        8
      ],
      "faces": {
        "north": {
          "uv": [
            0,
            0,
            0,
            0
          ],
          "texture": "#0"
        },
        "east": {
          "uv": [
            0,
            0,
            0,
            0
          ],
          "texture": "#0"
        },
        "south": {
          "uv": [
            0,
            0,
            0,
            0
          ],
          "texture": "#0"
        },
        "west": {
          "uv": [
            0,
            0,
            0,
            0
          ],
          "texture": "#0"
        },
        "up": {
          "uv": [
            0,
            0,
            0,
            0
          ],
          "texture": "#0"
        },
        "down": {
          "uv": [
            0,
            0,
            0,
            0
          ],
          "texture": "#0"
        }
      },
      "rotation": {
        "origin": [
          7,
          8,
          10
        ],
        "axis": "y",
        "angle": 45
      }
    },
    {
      "name": "Cube",
      "from": [
        1.5,
        10,
        2
      ],
      "to": [
        11.5,
        12,
        3
      ],
      "faces": {
        "north": {
          "uv": [
            0,
            0,
            0,
            0
          ],
          "texture": "#0"
        },
        "east": {
          "uv": [
            0,
            0,
            0,
            0
          ],
          "texture": "#0"
        },
        "south": {
          "uv": [
            0,
            0,
            0,
            0
          ],
          "texture": "#0"
        },
        "west": {
          "uv": [
            0,
            0,
            0,
            0
          ],
          "texture": "#0"
        },
        "up": {
          "uv": [
            0,
            0,
            0,
            0
          ],
          "texture": "#0"
        },
        "down": {
          "uv": [
            0,
            0,
            0,
            0
          ],
          "texture": "#0"
        }
      }
    },
    {
      "name": "Cube",
      "from": [
        1.5,
        10,
        13
      ],
      "to": [
        11.5,
        12,
        14
      ],
      "faces": {
        "north": {
          "uv": [
            0,
            0,
            0,
            0
          ],
          "texture": "#0"
        },
        "east": {
          "uv": [
            0,
            0,
            0,
            0
          ],
          "texture": "#0"
        },
        "south": {
          "uv": [
            0,
            0,
            0,
            0
          ],
          "texture": "#0"
        },
        "west": {
          "uv": [
            0,
            0,
            0,
            0
          ],
          "texture": "#0"
        },
        "up": {
          "uv": [
            0,
            0,
            0,
            0
          ],
          "texture": "#0"
        },
        "down": {
          "uv": [
            0,
            0,
            0,
            0
          ],
          "texture": "#0"
        }
      }
    },
    {
      "name": "Cube",
      "from": [
        1.5,
        12,
        4
      ],
      "to": [
        13.5,
        13,
        12
      ],
      "faces": {
        "north": {
          "uv": [
            0,
            0,
            0,
            0
          ],
          "texture": "#0"
        },
        "east": {
          "uv": [
            0,
            0,
            0,
            0
          ],
          "texture": "#0"
        },
        "south": {
          "uv": [
            0,
            0,
            0,
            0
          ],
          "texture": "#0"
        },
        "west": {
          "uv": [
            0,
            0,
            0,
            0
          ],
          "texture": "#0"
        },
        "up": {
          "uv": [
            0,
            0,
            0,
            0
          ],
          "texture": "#0"
        },
        "down": {
          "uv": [
            0,
            0,
            0,
            0
          ],
          "texture": "#0"
        }
      }
    },
    {
      "name": "Cube",
      "from": [
        10,
        12,
        9.9
      ],
      "to": [
        14,
        13,
        13.9
      ],
      "faces": {
        "north": {
          "uv": [
            0,
            0,
            0,
            0
          ],
          "texture": "#0"
        },
        "east": {
          "uv": [
            0,
            0,
            0,
            0
          ],
          "texture": "#0"
        },
        "south": {
          "uv": [
            0,
            0,
            0,
            0
          ],
          "texture": "#0"
        },
        "west": {
          "uv": [
            0,
            0,
            0,
            0
          ],
          "texture": "#0"
        },
        "up": {
          "uv": [
            0,
            0,
            0,
            0
          ],
          "texture": "#0"
        },
        "down": {
          "uv": [
            0,
            0,
            0,
            0
          ],
          "texture": "#0"
        }
      },
      "rotation": {
        "origin": [
          8,
          8,
          8
        ],
        "axis": "y",
        "angle": 45
      }
    },
    {
      "name": "Cube",
      "from": [
        6.2,
        2.9,
        3.9
      ],
      "to": [
        6.4,
        10.5,
        12.1
      ],
      "faces": {
        "north": {
          "uv": [
            0,
            0,
            0,
            0
          ],
          "texture": "#1"
        },
        "east": {
          "uv": [
            0,
            0,
            0,
            0
          ],
          "texture": "#1"
        },
        "south": {
          "uv": [
            0,
            0,
            0,
            0
          ],
          "texture": "#1"
        },
        "west": {
          "uv": [
            0,
            0,
            0,
            0
          ],
          "texture": "#1"
        },
        "up": {
          "uv": [
            0,
            0,
            0,
            0
          ],
          "texture": "#1"
        },
        "down": {
          "uv": [
            0,
            0,
            0,
            0
          ],
          "texture": "#1"
        }
      }
    },
    {
      "name": "Cube",
      "from": [
        2,
        12.2,
        2
      ],
      "to": [
        2.2,
        13.2,
        7.8
      ],
      "faces": {
        "north": {
          "uv": [
            0,
            0,
            0,
            0
          ],
          "texture": "#1"
        },
        "east": {
          "uv": [
            0,
            0,
            0,
            0
          ],
          "texture": "#0"
        },
        "south": {
          "uv": [
            0,
            0,
            0,
            0
          ],
          "texture": "#1"
        },
        "west": {
          "uv": [
            0,
            0,
            0,
            0
          ],
          "texture": "#0"
        },
        "up": {
          "uv": [
            0,
            0,
            0,
            0
          ],
          "texture": "#1"
        },
        "down": {
          "uv": [
            0,
            0,
            0,
            0
          ],
          "texture": "#1"
        }
      },
      "rotation": {
        "origin": [
          7,
          8,
          10
        ],
        "axis": "y",
        "angle": 45
      }
    },
    {
      "name": "Cube",
      "from": [
        -1,
        12.2,
        9
      ],
      "to": [
        -0.8,
        13.2,
        14.8
      ],
      "faces": {
        "north": {
          "uv": [
            0,
            0,
            0,
            0
          ],
          "texture": "#1"
        },
        "east": {
          "uv": [
            0,
            0,
            0,
            0
          ],
          "texture": "#0"
        },
        "south": {
          "uv": [
            0,
            0,
            0,
            0
          ],
          "texture": "#1"
        },
        "west": {
          "uv": [
            0,
            0,
            0,
            0
          ],
          "texture": "#0"
        },
        "up": {
          "uv": [
            0,
            0,
            0,
            0
          ],
          "texture": "#1"
        },
        "down": {
          "uv": [
            0,
            0,
            0,
            0
          ],
          "texture": "#1"
        }
      },
      "rotation": {
        "origin": [
          7,
          8,
          10
        ],
        "axis": "y",
        "angle": -45
      }
    },
    {
      "name": "Cube",
      "from": [
        14.9,
        12.2,
        9.3
      ],
      "to": [
        15.1,
        13.2,
        15.100000000000001
      ],
      "faces": {
        "north": {
          "uv": [
            0,
            0,
            0,
            0
          ],
          "texture": "#1"
        },
        "east": {
          "uv": [
            0,
            0,
            0,
            0
          ],
          "texture": "#0"
        },
        "south": {
          "uv": [
            0,
            0,
            0,
            0
          ],
          "texture": "#1"
        },
        "west": {
          "uv": [
            0,
            0,
            0,
            0
          ],
          "texture": "#0"
        },
        "up": {
          "uv": [
            0,
            0,
            0,
            0
          ],
          "texture": "#1"
        },
        "down": {
          "uv": [
            0,
            0,
            0,
            0
          ],
          "texture": "#1"
        }
      },
      "rotation": {
        "origin": [
          7,
          8,
          10
        ],
        "axis": "y",
        "angle": 45
      }
    },
    {
      "name": "Cube",
      "from": [
        11.9,
        12.2,
        2.0999999999999996
      ],
      "to": [
        12.1,
        13.2,
        7.8999999999999995
      ],
      "faces": {
        "north": {
          "uv": [
            0,
            0,
            0,
            0
          ],
          "texture": "#1"
        },
        "east": {
          "uv": [
            0,
            0,
            0,
            0
          ],
          "texture": "#0"
        },
        "south": {
          "uv": [
            0,
            0,
            0,
            0
          ],
          "texture": "#1"
        },
        "west": {
          "uv": [
            0,
            0,
            0,
            0
          ],
          "texture": "#0"
        },
        "up": {
          "uv": [
            0,
            0,
            0,
            0
          ],
          "texture": "#1"
        },
        "down": {
          "uv": [
            0,
            0,
            0,
            0
          ],
          "texture": "#1"
        }
      },
      "rotation": {
        "origin": [
          7,
          8,
          10
        ],
        "axis": "y",
        "angle": -45
      }
    },
    {
      "name": "Cube",
      "from": [
        12.2,
        14.1,
        4.1
      ],
      "to": [
        12.399999999999999,
        15.1,
        6.6
      ],
      "faces": {
        "north": {
          "uv": [
            0,
            0,
            0,
            0
          ],
          "texture": "#1"
        },
        "east": {
          "uv": [
            0,
            0,
            0,
            0
          ],
          "texture": "#1"
        },
        "south": {
          "uv": [
            0,
            0,
            0,
            0
          ],
          "texture": "#1"
        },
        "west": {
          "uv": [
            0,
            0,
            0,
            0
          ],
          "texture": "#1"
        },
        "up": {
          "uv": [
            0,
            0,
            0,
            0
          ],
          "texture": "#1"
        },
        "down": {
          "uv": [
            0,
            0,
            0,
            0
          ],
          "texture": "#1"
        }
      },
      "rotation": {
        "origin": [
          7,
          8,
          10
        ],
        "axis": "x",
        "angle": -22.5
      }
    },
    {
      "name": "Cube",
      "from": [
        12,
        12.5,
        9.6
      ],
      "to": [
        12.2,
        13.5,
        12.2
      ],
      "faces": {
        "north": {
          "uv": [
            0,
            0,
            0,
            0
          ],
          "texture": "#1"
        },
        "east": {
          "uv": [
            0,
            0,
            0,
            0
          ],
          "texture": "#1"
        },
        "south": {
          "uv": [
            0,
            0,
            0,
            0
          ],
          "texture": "#1"
        },
        "west": {
          "uv": [
            0,
            0,
            0,
            0
          ],
          "texture": "#1"
        },
        "up": {
          "uv": [
            0,
            0,
            0,
            0
          ],
          "texture": "#1"
        },
        "down": {
          "uv": [
            0,
            0,
            0,
            0
          ],
          "texture": "#1"
        }
      },
      "rotation": {
        "origin": [
          7,
          8,
          10
        ],
        "axis": "x",
        "angle": 22.5
      }
    },
    {
      "name": "Cube",
      "from": [
        2,
        12.5,
        9.7
      ],
      "to": [
        2.2,
        13.5,
        12.299999999999999
      ],
      "faces": {
        "north": {
          "uv": [
            0,
            0,
            0,
            0
          ],
          "texture": "#1"
        },
        "east": {
          "uv": [
            0,
            0,
            0,
            0
          ],
          "texture": "#1"
        },
        "south": {
          "uv": [
            0,
            0,
            0,
            0
          ],
          "texture": "#1"
        },
        "west": {
          "uv": [
            0,
            0,
            0,
            0
          ],
          "texture": "#1"
        },
        "up": {
          "uv": [
            0,
            0,
            0,
            0
          ],
          "texture": "#1"
        },
        "down": {
          "uv": [
            0,
            0,
            0,
            0
          ],
          "texture": "#1"
        }
      },
      "rotation": {
        "origin": [
          7,
          8,
          10
        ],
        "axis": "x",
        "angle": 22.5
      }
    },
    {
      "name": "Cube",
      "from": [
        2,
        14.1,
        3.9
      ],
      "to": [
        2.2,
        15.1,
        6.4
      ],
      "faces": {
        "north": {
          "uv": [
            0,
            0,
            0,
            0
          ],
          "texture": "#1"
        },
        "east": {
          "uv": [
            0,
            0,
            0,
            0
          ],
          "texture": "#1"
        },
        "south": {
          "uv": [
            0,
            0,
            0,
            0
          ],
          "texture": "#1"
        },
        "west": {
          "uv": [
            0,
            0,
            0,
            0
          ],
          "texture": "#1"
        },
        "up": {
          "uv": [
            0,
            0,
            0,
            0
          ],
          "texture": "#1"
        },
        "down": {
          "uv": [
            0,
            0,
            0,
            0
          ],
          "texture": "#1"
        }
      },
      "rotation": {
        "origin": [
          7,
          8,
          10
        ],
        "axis": "x",
        "angle": -22.5
      }
    },
    {
      "name": "Cube",
      "from": [
        2,
        12.5,
        12
      ],
      "to": [
        12,
        13.5,
        12.2
      ],
      "faces": {
        "north": {
          "uv": [
            0,
            0,
            0,
            0
          ],
          "texture": "#1"
        },
        "east": {
          "uv": [
            0,
            0,
            0,
            0
          ],
          "texture": "#1"
        },
        "south": {
          "uv": [
            0,
            0,
            0,
            0
          ],
          "texture": "#0"
        },
        "west": {
          "uv": [
            0,
            0,
            0,
            0
          ],
          "texture": "#1"
        },
        "up": {
          "uv": [
            0,
            0,
            0,
            0
          ],
          "texture": "#1"
        },
        "down": {
          "uv": [
            0,
            0,
            0,
            0
          ],
          "texture": "#1"
        }
      },
      "rotation": {
        "origin": [
          7,
          8,
          10
        ],
        "axis": "x",
        "angle": 22.5
      }
    },
    {
      "name": "Cube",
      "from": [
        2,
        14.1,
        4
      ],
      "to": [
        12.2,
        15.1,
        4.2
      ],
      "faces": {
        "north": {
          "uv": [
            0,
            0,
            0,
            0
          ],
          "texture": "#0"
        },
        "east": {
          "uv": [
            0,
            0,
            0,
            0
          ],
          "texture": "#1"
        },
        "south": {
          "uv": [
            0,
            0,
            0,
            0
          ],
          "texture": "#1"
        },
        "west": {
          "uv": [
            0,
            0,
            0,
            0
          ],
          "texture": "#1"
        },
        "up": {
          "uv": [
            0,
            0,
            0,
            0
          ],
          "texture": "#1"
        },
        "down": {
          "uv": [
            0,
            0,
            0,
            0
          ],
          "texture": "#1"
        }
      },
      "rotation": {
        "origin": [
          7,
          8,
          10
        ],
        "axis": "x",
        "angle": -22.5
      }
    },
    {
      "name": "Cube",
      "from": [
        2,
        10.1,
        13
      ],
      "to": [
        2.1999999999999993,
        12.1,
        14.2
      ],
      "faces": {
        "north": {
          "uv": [
            0,
            0,
            0,
            0
          ],
          "texture": "#1"
        },
        "east": {
          "uv": [
            0,
            0,
            0,
            0
          ],
          "texture": "#1"
        },
        "south": {
          "uv": [
            0,
            0,
            0,
            0
          ],
          "texture": "#1"
        },
        "west": {
          "uv": [
            0,
            0,
            0,
            0
          ],
          "texture": "#1"
        },
        "up": {
          "uv": [
            0,
            0,
            0,
            0
          ],
          "texture": "#1"
        },
        "down": {
          "uv": [
            0,
            0,
            0,
            0
          ],
          "texture": "#1"
        }
      }
    },
    {
      "name": "Cube",
      "from": [
        2,
        10.1,
        1.6
      ],
      "to": [
        2.1999999999999993,
        12.1,
        2.8
      ],
      "faces": {
        "north": {
          "uv": [
            0,
            0,
            0,
            0
          ],
          "texture": "#1"
        },
        "east": {
          "uv": [
            0,
            0,
            0,
            0
          ],
          "texture": "#1"
        },
        "south": {
          "uv": [
            0,
            0,
            0,
            0
          ],
          "texture": "#1"
        },
        "west": {
          "uv": [
            0,
            0,
            0,
            0
          ],
          "texture": "#1"
        },
        "up": {
          "uv": [
            0,
            0,
            0,
            0
          ],
          "texture": "#1"
        },
        "down": {
          "uv": [
            0,
            0,
            0,
            0
          ],
          "texture": "#1"
        }
      }
    },
    {
      "name": "Cube",
      "from": [
        11,
        10.1,
        1.6
      ],
      "to": [
        11.2,
        12.1,
        2.8
      ],
      "faces": {
        "north": {
          "uv": [
            0,
            0,
            0,
            0
          ],
          "texture": "#1"
        },
        "east": {
          "uv": [
            0,
            0,
            0,
            0
          ],
          "texture": "#1"
        },
        "south": {
          "uv": [
            0,
            0,
            0,
            0
          ],
          "texture": "#1"
        },
        "west": {
          "uv": [
            0,
            0,
            0,
            0
          ],
          "texture": "#1"
        },
        "up": {
          "uv": [
            0,
            0,
            0,
            0
          ],
          "texture": "#1"
        },
        "down": {
          "uv": [
            0,
            0,
            0,
            0
          ],
          "texture": "#1"
        }
      }
    },
    {
      "name": "Cube",
      "from": [
        11,
        10.1,
        13
      ],
      "to": [
        11.2,
        12.1,
        14.2
      ],
      "faces": {
        "north": {
          "uv": [
            0,
            0,
            0,
            0
          ],
          "texture": "#1"
        },
        "east": {
          "uv": [
            0,
            0,
            0,
            0
          ],
          "texture": "#1"
        },
        "south": {
          "uv": [
            0,
            0,
            0,
            0
          ],
          "texture": "#1"
        },
        "west": {
          "uv": [
            0,
            0,
            0,
            0
          ],
          "texture": "#1"
        },
        "up": {
          "uv": [
            0,
            0,
            0,
            0
          ],
          "texture": "#1"
        },
        "down": {
          "uv": [
            0,
            0,
            0,
            0
          ],
          "texture": "#1"
        }
      }
    },
    {
      "name": "Cube",
      "from": [
        2,
        10.1,
        13
      ],
      "to": [
        11.2,
        10.299999999999999,
        14.2
      ],
      "faces": {
        "north": {
          "uv": [
            0,
            0,
            0,
            0
          ],
          "texture": "#1"
        },
        "east": {
          "uv": [
            0,
            0,
            0,
            0
          ],
          "texture": "#1"
        },
        "south": {
          "uv": [
            0,
            0,
            0,
            0
          ],
          "texture": "#1"
        },
        "west": {
          "uv": [
            0,
            0,
            0,
            0
          ],
          "texture": "#1"
        },
        "up": {
          "uv": [
            0,
            0,
            0,
            0
          ],
          "texture": "#1"
        },
        "down": {
          "uv": [
            0,
            0,
            0,
            0
          ],
          "texture": "#1"
        }
      }
    },
    {
      "name": "Cube",
      "from": [
        2,
        10.1,
        1.6
      ],
      "to": [
        11.2,
        10.299999999999999,
        2.8
      ],
      "faces": {
        "north": {
          "uv": [
            0,
            0,
            0,
            0
          ],
          "texture": "#1"
        },
        "east": {
          "uv": [
            0,
            0,
            0,
            0
          ],
          "texture": "#1"
        },
        "south": {
          "uv": [
            0,
            0,
            0,
            0
          ],
          "texture": "#1"
        },
        "west": {
          "uv": [
            0,
            0,
            0,
            0
          ],
          "texture": "#1"
        },
        "up": {
          "uv": [
            0,
            0,
            0,
            0
          ],
          "texture": "#1"
        },
        "down": {
          "uv": [
            0,
            0,
            0,
            0
          ],
          "texture": "#1"
        }
      }
    },
    {
      "name": "Cube",
      "from": [
        13.5,
        11,
        7
      ],
      "to": [
        14.5,
        12,
        9
      ],
      "faces": {
        "north": {
          "uv": [
            0,
            0,
            0,
            0
          ],
          "texture": "#3"
        },
        "east": {
          "uv": [
            0,
            0,
            0,
            0
          ],
          "texture": "#1"
        },
        "south": {
          "uv": [
            0,
            0,
            0,
            0
          ],
          "texture": "#3"
        },
        "west": {
          "uv": [
            0,
            0,
            0,
            0
          ],
          "texture": "#3"
        },
        "up": {
          "uv": [
            0,
            0,
            0,
            0
          ],
          "texture": "#3"
        },
        "down": {
          "uv": [
            0,
            0,
            0,
            0
          ],
          "texture": "#3"
        }
      }
    },
    {
      "name": "Cube",
      "from": [
        -7.5,
        11,
        4
      ],
      "to": [
        -0.5,
        12,
        12
      ],
      "faces": {
        "north": {
          "uv": [
            0,
            0,
            0,
            0
          ],
          "texture": "#0"
        },
        "east": {
          "uv": [
            0,
            0,
            0,
            0
          ],
          "texture": "#0"
        },
        "south": {
          "uv": [
            0,
            0,
            0,
            0
          ],
          "texture": "#0"
        },
        "west": {
          "uv": [
            0,
            0,
            0,
            0
          ],
          "texture": "#0"
        },
        "up": {
          "uv": [
            0,
            0,
            0,
            0
          ],
          "texture": "#0"
        },
        "down": {
          "uv": [
            0,
            0,
            0,
            0
          ],
          "texture": "#0"
        }
      }
    },
    {
      "name": "Cube",
      "from": [
        -10.5,
        10,
        4
      ],
      "to": [
        -3.5,
        11,
        12
      ],
      "faces": {
        "north": {
          "uv": [
            0,
            0,
            0,
            0
          ],
          "texture": "#0"
        },
        "east": {
          "uv": [
            0,
            0,
            0,
            0
          ],
          "texture": "#0"
        },
        "south": {
          "uv": [
            0,
            0,
            0,
            0
          ],
          "texture": "#0"
        },
        "west": {
          "uv": [
            0,
            0,
            0,
            0
          ],
          "texture": "#0"
        },
        "up": {
          "uv": [
            8,
            13,
            9,
            14
          ],
          "texture": "#0"
        },
        "down": {
          "uv": [
            0,
            0,
            0,
            0
          ],
          "texture": "#0"
        }
      }
    },
    {
      "name": "Cube",
      "from": [
        -4,
        11,
        -4
      ],
      "to": [
        1,
        12,
        1
      ],
      "faces": {
        "north": {
          "uv": [
            0,
            0,
            0,
            0
          ],
          "texture": "#0"
        },
        "east": {
          "uv": [
            0,
            0,
            0,
            0
          ],
          "texture": "#0"
        },
        "south": {
          "uv": [
            0,
            0,
            0,
            0
          ],
          "texture": "#0"
        },
        "west": {
          "uv": [
            0,
            0,
            0,
            0
          ],
          "texture": "#0"
        },
        "up": {
          "uv": [
            0,
            0,
            0,
            0
          ],
          "texture": "#0"
        },
        "down": {
          "uv": [
            0,
            0,
            0,
            0
          ],
          "texture": "#0"
        }
      },
      "rotation": {
        "origin": [
          7,
          8,
          10
        ],
        "axis": "y",
        "angle": 45
      }
    },
    {
      "name": "Cube",
      "from": [
        -6,
        10,
        -6
      ],
      "to": [
        -1,
        11,
        -1
      ],
      "faces": {
        "north": {
          "uv": [
            0,
            0,
            0,
            0
          ],
          "texture": "#0"
        },
        "east": {
          "uv": [
            8,
            13,
            9,
            14
          ],
          "texture": "#0"
        },
        "south": {
          "uv": [
            8,
            13,
            9,
            14
          ],
          "texture": "#0"
        },
        "west": {
          "uv": [
            0,
            0,
            0,
            0
          ],
          "texture": "#0"
        },
        "up": {
          "uv": [
            8,
            13,
            9,
            14
          ],
          "texture": "#0"
        },
        "down": {
          "uv": [
            0,
            0,
            0,
            0
          ],
          "texture": "#0"
        }
      },
      "rotation": {
        "origin": [
          7,
          8,
          10
        ],
        "axis": "y",
        "angle": 45
      }
    }
  ],
  "display": {
    "thirdperson_righthand": {
      "rotation": [
        270,
        180,
        90
      ],
      "translation": [
        0.5,
        -2,
        2
      ],
      "scale": [
        0.3,
        0.6,
        0.8
      ]
    },
    "thirdperson_lefthand": {
      "rotation": [
        270,
        0,
        270
      ],
      "translation": [
        0.5,
        -2,
        2
      ],
      "scale": [
        0.3,
        0.6,
        0.8
      ]
    },
    "head": {
      "rotation": [
        45,
        0,
        90
      ],
      "translation": [
        0.7,
        0,
        0
      ],
      "scale": [
        1.2,
        1.2,
        1.2
      ]
    },
    "firstperson_righthand": {
      "rotation": [
        270,
        180,
        90
      ],
      "translation": [
        0,
        0,
        2
      ],
      "scale": [
        0.3,
        0.8,
        0.6
      ]
    },
    "firstperson_lefthand": {
      "rotation": [
        270,
        0,
        270
      ],
      "translation": [
        0,
        0,
        2
      ],
      "scale": [
        0.3,
        0.8,
        0.6
      ]
    },
    "gui": {
      "rotation": [
        0,
        0,
        0
      ],
      "translation": [
        3,
        2,
        32
      ],
      "scale": [
        0.5,
        0.5,
        0.5
      ]
    },
    "fixed": {
      "scale": [
        0.55,
        0.575,
        0.6
      ],
      "translation": [
        -4,
        0.5,
        -1
      ],
      "rotation": [
        0,
        180,
        0
      ]
    },
    "ground": {
      "scale": [
        0.22499999999999998,
        0.22499999999999998,
        0.22499999999999998
      ]
    }
  }
}
