id,name,parentId
R80175124,Alojipan,R3279625
R80175154,Bagacay,R3279625
R80175155,Balac-Balac,R3279625
R80175144,Batbatan Island,R3279625
R80175131,Batonan Norte,R3279625
R80175132,Batonan Sur,R3279625
R80175156,Bita,R3279625
R80175145,Bitadton Norte,R3279625
R80175125,Bitadton Sur,R3279625
R80175146,Buenavista,R3279625
R80175147,Buhi,R3279625
R80175126,Camancijan,R3279625
R80175140,Caridad,R3279625
R80175127,Carit-An,R3279625
R80175116,Centro Norte (Pob.),R3279625
R80175141,Centro Poblacion,R3279625
R80175120,Centro Sur (Pob.),R3279625
R80175135,Condes,R3279625
R80175157,Esperanza,R3279625
R80175136,Fe,R3279625
R80175121,Flores,R3279625
R80175150,Jalandoni,R3279625
R80175117,Janlagasi,R3279625
R80175151,Lamputong,R3279625
R80175122,Lipata,R3279625
R80175133,Magsaysay (Balua),R3279625
R80175152,Malacanang,R3279625
R80175142,Malalison Island,R3279625
R80175118,Maniguin,R3279625
R80175134,Naba,R3279625
R80175129,Osorio,R3279625
R80175143,Paningayan,R3279625
R80175123,Salde,R3279625
R80175153,San Antonio,R3279625
R80175148,San Gregorio,R3279625
R80175130,San Juan,R3279625
R80175137,San Luis,R3279625
R80175138,San Pascual,R3279625
R80175158,San Vicente,R3279625
R80175119,Simbola,R3279625
R80175128,Tigbobolo,R3279625
R80175115,Tinabusan,R3279625
R80175139,Tomao,R3279625
R80175149,Valderama,R3279625