id,name,parentId
R80194836,Adcadarao,R3481896
R80194820,Agbobolo,R3481896
R80194845,Badiangan,R3481896
R80194827,Barrido,R3481896
R80194837,Bato Biasong,R3481896
R80194838,Bay-Ang,R3481896
R80194846,Bucana Bunglas,R3481896
R80194828,Central,R3481896
R80194821,Culasi,R3481896
R80194833,Lanjagan,R3481896
R80194851,Luca,R3481896
R80194829,Malayu-An,R3481896
R80194834,Mangorocoro,R3481896
R80194847,Nasidman,R3481896
R80194848,Pantalan Nabaye,R3481896
R80194830,Pantalan Navarro,R3481896
R80194842,Pedada,R3481896
R80194853,Pili,R3481896
R80194839,Pinantan Diel,R3481896
R80194852,Pinantan Elizalde,R3481896
R80194822,Pinay Espinosa,R3481896
R80194823,Poblacion,R3481896
R80194824,Progreso,R3481896
R80194831,Puente Bunglas,R3481896
R80194843,Punta Buri,R3481896
R80194849,Rojas,R3481896
R80194832,San Antonio,R3481896
R80194840,Santo Rosario,R3481896
R80194825,Silagon,R3481896
R80194844,Tagubanhan,R3481896
R80194841,Taguhangin,R3481896
R80194835,Tanduyan,R3481896
R80194850,Tipacla,R3481896
R80194826,Tubogan,R3481896
R80194903,Abang-Abang,R80157253
R80194891,Agsing,R80157253
R80194885,Atabay,R80157253
R80194882,Bagsakan,R80157253
R80194904,Baguingin-Lanot,R80157253
R80194892,Bagumbayan-Ilajas,R80157253
R80194895,Balabago,R80157253
R80194874,Ban-Ag,R80157253
R80194870,Bancal,R80157253
R80194897,Ba-Ong,R80157253
R80194887,Binalud,R80157253
R80194883,Bugang,R80157253
R80194876,Buhay,R80157253
R80194860,Bulod,R80157253
R80194898,Cabacanan Proper,R80157253
R80194861,Cabacanan Rizal,R80157253
R80194877,Cagay,R80157253
R80194886,Coline,R80157253
R80194899,Coline-Dalag,R80157253
R80194888,Cunsad,R80157253
R80194878,Cuyad,R80157253
R80194854,Dalid,R80157253
R80194889,Dao,R80157253
R80194855,Gines,R80157253
R80194879,Ginomoy,R80157253
R80194880,Ingwan,R80157253
R80194900,Laylayan,R80157253
R80194871,Lico,R80157253
R80194896,Luan-Luan,R80157253
R80194856,Malamboy-Bondolan,R80157253
R80194857,Malamhay,R80157253
R80194884,Mambawi,R80157253
R80194866,Manasa,R80157253
R80194901,Manduyog,R80157253
R80194893,Pajo,R80157253
R80194894,Pianda-An Norte,R80157253
R80194875,Pianda-An Sur,R80157253
R80194858,Poblacion,R80157253
R80194859,Punong,R80157253
R80194872,Quinaspan,R80157253
R80194867,Sinamay,R80157253
R80194902,Sulong,R80157253
R80194864,Taban-Manguining,R80157253
R80194868,Tabug,R80157253
R80194890,Tarug,R80157253
R80194881,Tugaslon,R80157253
R80194873,Ubodan,R80157253
R80194865,Ugbo,R80157253
R80194862,Ulay-Bugang,R80157253
R80194869,Ulay-Hinablan,R80157253
R80194863,Umingan,R80157253
R80195333,Agbatuan,R3492689
R80195334,Badiang,R3492689
R80195349,Balabag,R3492689
R80195350,Balunos,R3492689
R80195337,Cag-An,R3492689
R80195344,Camiros,R3492689
R80195351,Dangula-An,R3492689
R80195338,Guipis,R3492689
R80195335,Manganese,R3492689
R80195345,Medina,R3492689
R80195339,Mostro,R3492689
R80195346,Palaypay,R3492689
R80195336,Pantalan,R3492689
R80195352,Poblacion,R3492689
R80195347,Sambag Culob,R3492689
R80195340,San Carlos,R3492689
R80195332,San Juan Crisostomo,R3492689
R80195341,Santa Rita,R3492689
R80195342,Santo Rosario,R3492689
R80195343,Serallo,R3492689
R80195348,Vista Alegre,R3492689
R80194115,Agusipan,R80157242
R80194109,Astorga,R80157242
R80194118,Bingauan,R80157242
R80194122,Bita-Oyan,R80157242
R80194125,Botong,R80157242
R80194107,Budiawe,R80157242
R80194132,Cabanga-An,R80157242
R80194110,Cabayogan,R80157242
R80194119,Calansanan,R80157242
R80194117,Catubig,R80157242
R80194129,Guinawahan,R80157242
R80194123,Ilongbukid,R80157242
R80194116,Indorohan,R80157242
R80194111,Iniligan,R80157242
R80194108,Latawan,R80157242
R80194130,Linayuan,R80157242
R80194120,Mainguit,R80157242
R80194103,Malublub,R80157242
R80194104,Manaolan,R80157242
R80194105,Mapili Grande,R80157242
R80194126,Mapili Sanjo,R80157242
R80194127,Odiongan,R80157242
R80194133,Poblacion (Badiangan),R80157242
R80194112,San Julian,R80157242
R80194113,Sariri,R80157242
R80194114,Sianon,R80157242
R80194128,Sinuagan,R80157242
R80194124,Talaba,R80157242
R80194106,Tamocol,R80157242
R80194121,Teneclan,R80157242
R80194131,Tina,R80157242
R80194474,Aranjuez,R3477883
R80194470,Bacolod,R3477883
R80194471,Balanti-An,R3477883
R80194484,Batuan,R3477883
R80194475,Cabalic,R3477883
R80194464,Camambugan,R3477883
R80194485,Dolores,R3477883
R80194465,Gimamanay,R3477883
R80194472,Ipil,R3477883
R80194466,Kinalkalan,R3477883
R80194486,Lawis,R3477883
R80194476,Malapoc,R3477883
R80194467,Mamhut Norte,R3477883
R80194477,Mamhut Sur,R3477883
R80194478,Maya,R3477883
R80194479,Pani-An,R3477883
R80194480,Poblacion Norte,R3477883
R80194473,Poblacion Sur,R3477883
R80194468,Quiasan,R3477883
R80194469,Salong,R3477883
R80194481,Salvacion,R3477883
R80194482,Tingui-An,R3477883
R80194483,Zaragosa,R3477883
R80195765,Alacaygan,R3492690
R80195763,Bariga,R3492690
R80195773,Belen,R3492690
R80195757,Bobon,R3492690
R80195756,Bularan,R3492690
R80195766,Carmelo,R3492690
R80195767,De La Paz,R3492690
R80195758,Dugwakan,R3492690
R80195768,Fuentes*,R3492690
R80195769,Juanico,R3492690
R80195759,Libertad,R3492690
R80195760,Magdalo,R3492690
R80195761,Managopaya,R3492690
R80195762,Merced,R3492690
R80195770,Poblacion,R3492690
R80195771,San Salvador,R3492690
R80195772,Talokgangan,R3492690
R80195764,Zona Sur,R3492690
R80194505,Acuit,R3492691
R80194488,Agcuyawan Calsada,R3492691
R80194492,Agcuyawan Pulo,R3492691
R80194487,Bagongbong,R3492691
R80194513,Baras,R3492691
R80194501,Bungca,R3492691
R80194489,Cabilauan,R3492691
R80194506,Cruz,R3492691
R80194514,Guintas,R3492691
R80194502,Igbong,R3492691
R80194493,Ilaud Poblacion,R3492691
R80194503,Ilaya Poblacion,R3492691
R80194490,Jalaud,R3492691
R80194494,Lagubang,R3492691
R80194509,Lanas,R3492691
R80194510,Lico-An,R3492691
R80194511,Linao,R3492691
R80194512,Monpon,R3492691
R80194515,Palaciawan,R3492691
R80194504,Patag,R3492691
R80194507,Salihid,R3492691
R80194497,Sohoton,R3492691
R80194495,So-Ol,R3492691
R80194498,Tabucan,R3492691
R80194499,Tabuc-Suba,R3492691
R80194508,Talisay,R3492691
R80194491,Tinorian,R3492691
R80194500,Tiwi,R3492691
R80194496,Tubungan,R3492691
R80194244,Bugnay,R3492692
R80194245,California,R3492692
R80194246,De La Pena,R3492692
R80194247,Del Pilar,R3492692
R80194250,General Luna,R3492692
R80194258,La Fortuna,R3492692
R80194251,Lipata,R3492692
R80194259,Natividad,R3492692
R80194252,Nueva Invencion,R3492692
R80194260,Nueva Sevilla,R3492692
R80194263,Poblacion,R3492692
R80194264,Puerto Princesa,R3492692
R80194265,Rizal,R3492692
R80194248,San Antonio,R3492692
R80194261,San Fernando,R3492692
R80194262,San Francisco,R3492692
R80194253,San Geronimo,R3492692
R80194255,San Juan,R3492692
R80194242,San Lucas,R3492692
R80194254,San Miguel,R3492692
R80194243,San Roque,R3492692
R80194266,Santiago,R3492692
R80194249,Santo Domingo,R3492692
R80194256,Santo Tomas,R3492692
R80194257,Ugasan,R3492692
R80194267,Vista Alegre,R3492692
R80195778,Alapasco,R80157267
R80195779,Alinsolong,R80157267
R80195789,Banban,R80157267
R80195783,Batad Viejo,R80157267
R80195774,Binon-An,R80157267
R80195784,Bolhog,R80157267
R80195790,Bulak Norte,R80157267
R80195785,Bulak Sur,R80157267
R80195791,Cabagohan,R80157267
R80195792,Calangag,R80157267
R80195775,Caw-I,R80157267
R80195793,Drancalan,R80157267
R80195776,Embarcadero,R80157267
R80195794,Hamod,R80157267
R80195795,Malico,R80157267
R80195786,Nangka,R80157267
R80195780,Pasayan,R80157267
R80195796,Poblacion,R80157267
R80195781,Quiazan Florete,R80157267
R80195777,Quiazan Lopez,R80157267
R80195797,Salong,R80157267
R80195787,Santa Ana,R80157267
R80195788,Tanao,R80157267
R80195782,Tapi-An,R80157267
R80195809,Agba-O,R80157268
R80195806,Alabidhan,R80157268
R80195799,Bulabog,R80157268
R80195803,Cairohan,R80157268
R80195800,Guinhulacan,R80157268
R80195804,Inamyungan,R80157268
R80195805,Malitbog Ilawod,R80157268
R80195801,Malitbog Ilaya,R80157268
R80195802,Ngingi-An,R80157268
R80195810,Poblacion,R80157268
R80195811,Quinangyana,R80157268
R80195807,Quinar-Upan,R80157268
R80195798,Tapacon,R80157268
R80195808,Tubod,R80157268
R80195087,Acao,R80157257
R80195091,Amerang,R80157257
R80195042,Amurao,R80157257
R80195061,Anuang,R80157257
R80195031,Ayaman,R80157257
R80195065,Ayong,R80157257
R80195032,Bacan,R80157257
R80195055,Balabag,R80157257
R80195068,Baluyan,R80157257
R80195043,Banguit,R80157257
R80195069,Bulay,R80157257
R80195088,Cadoldolan,R80157257
R80195048,Cagban,R80157257
R80195074,Calawagan,R80157257
R80195066,Calayo,R80157257
R80195056,Duyanduyan,R80157257
R80195062,Gaub,R80157257
R80195037,Gines Interior,R80157257
R80195052,Gines Patag,R80157257
R80195063,Guibuangan Tigbauan,R80157257
R80195070,Inabasan,R80157257
R80195081,Inaca,R80157257
R80195092,Inaladan,R80157257
R80195089,Ingas,R80157257
R80195067,Ito Norte,R80157257
R80195046,Ito Sur,R80157257
R80195044,Janipaan Central,R80157257
R80195033,Janipaan Este,R80157257
R80195057,Janipaan Oeste,R80157257
R80195082,Janipaan Olo,R80157257
R80195034,Jelicuon Lusaya,R80157257
R80195093,Jelicuon Montinola,R80157257
R80195075,Lag-An,R80157257
R80195064,Leong,R80157257
R80195038,Lutac,R80157257
R80195090,Manguna,R80157257
R80195076,Maraguit,R80157257
R80195059,Morubuan,R80157257
R80195027,Pacatin,R80157257
R80195049,Pagotpot,R80157257
R80195085,Pamul-Ogan,R80157257
R80195053,Pamuringao Garrido,R80157257
R80195028,Pamuringao Proper,R80157257
R80195029,Pungtod,R80157257
R80195083,Puyas,R80157257
R80195030,Salacay,R80157257
R80195054,Sulanga,R80157257
R80195035,Tabucan,R80157257
R80195084,Tacdangan,R80157257
R80195045,Talanghauan,R80157257
R80195039,Tigbauan Road,R80157257
R80195078,Tinio-An,R80157257
R80195079,Tiring,R80157257
R80195041,Tupol Central,R80157257
R80195050,Tupol Este,R80157257
R80195086,Tupol Oeste,R80157257
R80195036,Tuy-An,R80157257
R80195071,Zone Iii Pob. (Barangay 3),R80157257
R80195077,Zone Ii Pob. (Barangay 2),R80157257
R80195051,Zone I Pob. (Barangay 1),R80157257
R80195072,Zone Iv Pob. (Barangay 4),R80157257
R80195094,Zone Ix Pob. (Barangay 9),R80157257
R80195040,Zone Viii Pob. (Barangay 8),R80157257
R80195080,Zone Vii Pob. (Barangay 7),R80157257
R80195047,Zone Vi Pob. (Barangay 6 ),R80157257
R80195058,Zone V Pob. (Barangay 5),R80157257
R80195073,Zone Xi Pob. (Barangay 11),R80157257
R80195060,Zone X Pob. (Barangay 10),R80157257
R80195381,Agcalaga,R80157261
R80195405,Aglibacao,R80157261
R80195385,Aglonok,R80157261
R80195391,Alibunan,R80157261
R80195396,Badlan Grande,R80157261
R80195406,Badlan Pequeno,R80157261
R80195392,Badu,R80157261
R80195374,Baje San Julian,R80157261
R80195367,Balaticon,R80157261
R80195397,Banban Grande,R80157261
R80195407,Banban Pequeno,R80157261
R80195361,Barrio Calinog,R80157261
R80195362,Binolosan Grande,R80157261
R80195398,Binolosan Pequeno,R80157261
R80195375,Cabagiao,R80157261
R80195376,Cabugao,R80157261
R80195393,Cahigon,R80157261
R80195377,Camalongo,R80157261
R80195363,Canabajan,R80157261
R80195382,Caratagan,R80157261
R80195353,Carvasana,R80157261
R80195394,Dalid,R80157261
R80195386,Datagan,R80157261
R80195364,Gama Grande,R80157261
R80195358,Gama Pequeno,R80157261
R80195399,Garangan,R80157261
R80195383,Guinbonyugan,R80157261
R80195387,Guiso,R80157261
R80195378,Hilwan,R80157261
R80195384,Impalidan,R80157261
R80195359,Ipil,R80157261
R80195379,Jamin-Ay,R80157261
R80195370,Lampaya,R80157261
R80195368,Libot,R80157261
R80195408,Lonoy,R80157261
R80195354,Malag-It,R80157261
R80195400,Malaguinabot,R80157261
R80195409,Malapawe,R80157261
R80195355,Malitbog Centro,R80157261
R80195401,Mambiranan,R80157261
R80195410,Manaripay,R80157261
R80195356,Marandig,R80157261
R80195371,Masaroy,R80157261
R80195372,Maspasan,R80157261
R80195369,Nalbugan,R80157261
R80195404,Owak,R80157261
R80195402,Poblacion Centro,R80157261
R80195380,Poblacion Delgado,R80157261
R80195365,Poblacion Ilaya,R80157261
R80195395,Poblacion Rizal Ilaud,R80157261
R80195390,San Nicolas,R80157261
R80195411,Simsiman,R80157261
R80195388,Supanga,R80157261
R80195366,Tabucan,R80157261
R80195360,Tahing,R80157261
R80195373,Tibiao,R80157261
R80195389,Tigbayog,R80157261
R80195403,Toyungan,R80157261
R80195357,Ulayan,R80157261
R80195107,Abong,R3475396
R80195108,Alipata,R3475396
R80195120,Asluman,R3475396
R80195097,Bancal,R3475396
R80195109,Barangcalan,R3475396
R80195121,Barosbos,R3475396
R80195110,Binuluangan,R3475396
R80195095,Bito-On,R3475396
R80195122,Bolo,R3475396
R80195098,Buaya,R3475396
R80195101,Buenavista,R3475396
R80195096,Cabilao Grande,R3475396
R80195113,Cabilao Pequeno,R3475396
R80195114,Cabuguana,R3475396
R80195123,Cawayan,R3475396
R80195124,Dayhagan,R3475396
R80195125,Gabi,R3475396
R80195111,Granada,R3475396
R80195104,Guinticgan,R3475396
R80195118,Isla De Cana,R3475396
R80195105,Lantangan,R3475396
R80195102,Manlot,R3475396
R80195115,Nalumsan,R3475396
R80195126,Pantalan,R3475396
R80195119,Poblacion,R3475396
R80195099,Punta (Bolocawe),R3475396
R80195116,Punta Batuanan,R3475396
R80195127,San Fernando,R3475396
R80195103,Tabugon,R3475396
R80195106,Talingting,R3475396
R80195117,Tarong,R3475396
R80195112,Tinigban,R3475396
R80195100,Tupaz,R3475396
R80194534,Aglosong,R80157249
R80194526,Agnaga,R80157249
R80194517,Bacjawan Norte,R80157249
R80194518,Bacjawan Sur,R80157249
R80194535,Bagongon,R80157249
R80194536,Batiti,R80157249
R80194522,Botlog,R80157249
R80194527,Calamigan,R80157249
R80194528,Dungon,R80157249
R80194537,Igbon,R80157249
R80194538,Jamul-Awon,R80157249
R80194523,Lo-Ong,R80157249
R80194529,Macalbang,R80157249
R80194519,Macatunao,R80157249
R80194520,Malangabang,R80157249
R80194521,Maliogliog,R80157249
R80194516,Nino,R80157249
R80194531,Nipa,R80157249
R80194532,Plandico,R80157249
R80194533,Poblacion,R80157249
R80194524,Polopina,R80157249
R80194539,Salvacion,R80157249
R80194540,Talotu-An,R80157249
R80194525,Tambaliza,R80157249
R80194530,Tamis-Ac,R80157249
R80195827,Abangay,R80157269
R80195823,Agsalanan,R80157269
R80195842,Agtatacay,R80157269
R80195828,Alegria,R80157269
R80195835,Bongloy,R80157269
R80195836,Buenavista,R80157269
R80195824,Caguyuman,R80157269
R80195829,Calicuang,R80157269
R80195816,Camambugan,R80157269
R80195843,Dawis,R80157269
R80195837,Ginalinan Nuevo,R80157269
R80195830,Ginalinan Viejo,R80157269
R80195825,Gutao,R80157269
R80195831,Ilajas,R80157269
R80195818,Libo-O,R80157269
R80195817,Licu-An,R80157269
R80195832,Lincud,R80157269
R80195844,Matangharon,R80157269
R80195838,Moroboro,R80157269
R80195819,Namatay,R80157269
R80195814,Nazuni,R80157269
R80195833,Pandan,R80157269
R80195839,Poblacion,R80157269
R80195820,Potolan,R80157269
R80195834,San Jose,R80157269
R80195840,San Matias,R80157269
R80195815,Siniba-An,R80157269
R80195812,Tabugon,R80157269
R80195841,Tambunac,R80157269
R80195813,Tanghawan,R80157269
R80195821,Tiguib,R80157269
R80195826,Tinocuan,R80157269
R80195822,Tulatula-An,R80157269
R80195435,Agutayan,R80157262
R80195426,Angare,R80157262
R80195453,Anjawan,R80157262
R80195415,Baac,R80157262
R80195416,Bagongbong,R80157262
R80195448,Balangigan,R80157262
R80195427,Balingasag,R80157262
R80195436,Banugan,R80157262
R80195449,Batuan,R80157262
R80195454,Bita,R80157262
R80195412,Buenavista,R80157262
R80195420,Bugtongan,R80157262
R80195413,Cabudian,R80157262
R80195429,Calaca-An,R80157262
R80195430,Calang,R80157262
R80195421,Calawinan,R80157262
R80195422,Capaycapay,R80157262
R80195450,Capuling,R80157262
R80195444,Catig,R80157262
R80195457,Dila-An,R80157262
R80195418,Fundacion,R80157262
R80195419,Inadlawan,R80157262
R80195442,Jagdong,R80157262
R80195431,Jaguimit,R80157262
R80195432,Lacadon,R80157262
R80195443,Luag,R80157262
R80195423,Malusgod,R80157262
R80195424,Maribuyong,R80157262
R80195417,Minanga,R80157262
R80195433,Monpon,R80157262
R80195437,Navalas,R80157262
R80195451,Pader,R80157262
R80195425,Pandan,R80157262
R80195458,Poblacion A,R80157262
R80195445,Poblacion B,R80157262
R80195455,Poblacion C,R80157262
R80195438,Poblacion D,R80157262
R80195414,Ponong Grande,R80157262
R80195428,Ponong Pequeno,R80157262
R80195446,Purog,R80157262
R80195447,Romblon,R80157262
R80195456,San Isidro,R80157262
R80195452,Santo Nino,R80157262
R80195439,Sawe,R80157262
R80195434,Taminla,R80157262
R80195440,Tinocuan,R80157262
R80195441,Tipolo,R80157262
R80194924,Aurora-Del Pilar (Pob.),R80157254
R80194946,Bacay,R80157254
R80194939,Bacong,R80157254
R80194917,Balabag,R80157254
R80194940,Balud,R80157254
R80194915,Bantud,R80157254
R80194918,Bantud Fabrica,R80157254
R80194907,Baras,R80157254
R80194919,Barasan,R80157254
R80194908,Basa-Mabini Bonifacio (Pob.),R80157254
R80194941,Bolilao,R80157254
R80194949,Buenaflor Embarkadero (Pob.),R80157254
R80194909,Burgos-Regidor (Pob.),R80157254
R80194910,Calao,R80157254
R80194905,Cali,R80157254
R80194942,Cansilayan,R80157254
R80194911,Capaliz,R80157254
R80194931,Cayos,R80157254
R80194920,Compayan,R80157254
R80194936,Dacutan,R80157254
R80194943,Ermita,R80157254
R80194921,Ilaya 1St,R80157254
R80194944,Ilaya 2Nd,R80157254
R80194906,Ilaya 3Rd,R80157254
R80194927,Jardin,R80157254
R80194912,Lacturan,R80157254
R80194945,Lopez Jaena - Rizal (Pob.),R80157254
R80194932,Managuit,R80157254
R80194913,Maquina,R80157254
R80194947,Nanding Lopez,R80157254
R80194914,Pagdugue,R80157254
R80194922,Paloc Bigque,R80157254
R80194933,Paloc Sool,R80157254
R80194928,Patlad,R80157254
R80194916,Pd Monfort North (Lublub),R80157254
R80194934,Pd Monfort South (Guinsampanan),R80157254
R80194929,Pulao,R80157254
R80194923,Rosario,R80157254
R80194926,Sapao,R80157254
R80194935,Sulangan,R80157254
R80194930,Tabucan,R80157254
R80194938,Talusan,R80157254
R80194925,Tambobo,R80157254
R80194948,Tamboilan,R80157254
R80194937,Victorias,R80157254
R80195852,Bayas (Bayas Island),R80157270
R80195853,Bayuyan,R80157270
R80195847,Botongon,R80157270
R80195860,Bulaquena,R80157270
R80195867,Calapdan,R80157270
R80195848,Cano-An,R80157270
R80195868,Daan Banua,R80157270
R80195861,Daculan,R80157270
R80195862,Gogo,R80157270
R80195854,Jolog,R80157270
R80195869,Loguingot (Loguingot Island),R80157270
R80195855,Lonoy (Roman Mosqueda),R80157270
R80195856,Lumbia (Ana Cuenca),R80157270
R80195850,Malbog,R80157270
R80195851,Manipulon,R80157270
R80195849,Pa-On,R80157270
R80195865,Poblacion Zone 1,R80157270
R80195857,Poblacion Zone Ii,R80157270
R80195866,Poblacion Zone Iii,R80157270
R80195845,San Roque,R80157270
R80195858,Santa Ana,R80157270
R80195859,Tabu-An,R80157270
R80195863,Tacbuyan,R80157270
R80195846,Tanza,R80157270
R80195864,Villa Pani-An,R80157270
R80194278,Anono-O,R80157245
R80194291,Bacong,R80157245
R80194286,Bagumbayan Pob. (Bagumbayan-Granada),R80157245
R80194274,Balantad-Carlos Fruto (Pob.),R80157245
R80194299,Baras,R80157245
R80194294,Binanua-An,R80157245
R80194287,Bongol San Miguel,R80157245
R80194282,Bongol San Vicente,R80157245
R80194279,Bulad,R80157245
R80194292,Buluangan,R80157245
R80194300,Burgos-Gengos (Pob.),R80157245
R80194288,Cabasi,R80157245
R80194269,Cabubugan,R80157245
R80194270,Calampitao,R80157245
R80194295,Camangahan,R80157245
R80194271,Generosa-Cristobal Colon (Pob.),R80157245
R80194275,Gerona-Gimeno (Pob.),R80157245
R80194276,Girado-Magsaysay (Pob.),R80157245
R80194289,Gotera (Pob.),R80157245
R80194272,Igcocolo,R80157245
R80194290,Iyasan,R80157245
R80194296,Libo-On Gonzales (Pob.),R80157245
R80194297,Lubacan,R80157245
R80194283,Nahapay,R80157245
R80194273,Nalundan,R80157245
R80194280,Nanga,R80157245
R80194281,Nito-An Lupsag,R80157245
R80194268,Particion,R80157245
R80194284,Pescadores (Pob.),R80157245
R80194285,Rizal-Tuguisan (Pob.),R80157245
R80194293,Santa Rosa-Laguna,R80157245
R80194298,Sipitan-Badiang,R80157245
R80194277,Torreblanca-Blumentritt (Pob.),R80157245
R80195159,Alameda,R80157258
R80195132,Amorogtong,R80157258
R80195141,Anilawan,R80157258
R80195152,Bagacay,R80157258
R80195128,Bagacayan,R80157258
R80195153,Bagay,R80157258
R80195169,Balibagan,R80157258
R80195137,Barangay 1 Poblacion,R80157258
R80195154,Barangay 2 Poblacion,R80157258
R80195173,Barangay 3 Poblacion,R80157258
R80195163,Barangay 4 Poblacion,R80157258
R80195164,Barangay 5 Poblacion,R80157258
R80195170,Barangay 6 Poblacion,R80157258
R80195155,Barasan,R80157258
R80195151,Binanua-An,R80157258
R80195156,Boclod,R80157258
R80195145,Buenavista,R80157258
R80195157,Buga,R80157258
R80195158,Bugnay,R80157258
R80195146,Calampitao,R80157258
R80195165,Cale,R80157258
R80195133,Catiringan,R80157258
R80195162,Corucuan,R80157258
R80195129,Igcabugao,R80157258
R80195171,Igpigus,R80157258
R80195138,Igtalongon,R80157258
R80195166,Indaluyon,R80157258
R80195142,Jovellar,R80157258
R80195143,Kinagdan,R80157258
R80195130,Lab-On,R80157258
R80195172,Lacay Dol-Dol,R80157258
R80195160,Lumangan,R80157258
R80195131,Lutungan,R80157258
R80195167,Mantangon,R80157258
R80195161,Mulangan,R80157258
R80195147,Pasong,R80157258
R80195148,Passi,R80157258
R80195134,Pinaopawan,R80157258
R80195135,Riro-An,R80157258
R80195144,San Ambrosio,R80157258
R80195136,Santa Barbara,R80157258
R80195149,Signe,R80157258
R80195139,Tabiac,R80157258
R80195150,Talayatay,R80157258
R80195168,Taytay,R80157258
R80195140,Tigbanaba,R80157258
R80194639,Abeto Mirasol Taft South (Quirino Abeto),R3499101
R80194612,Aguinaldo,R3499101
R80194563,Airport (Tabucan Airport),R3499101
R80194549,Alalasan Lapuz,R3499101
R80194585,Arguelles,R3499101
R80194702,Arsenal Aduana,R3499101
R80194600,Bakhaw,R3499101
R80194676,Balabago,R3499101
R80194640,Balantang,R3499101
R80194668,Baldoza,R3499101
R80194586,Bantud,R3499101
R80194681,Banuyao,R3499101
R80194664,Baybay Tanza,R3499101
R80194633,Benedicto (Jaro),R3499101
R80194653,Bito-On,R3499101
R80194654,Bolilao,R3499101
R80194665,Bonifacio (Arevalo),R3499101
R80194687,Bonifacio Tanza,R3499101
R80194673,Buhang,R3499101
R80194589,Buhang Taft North,R3499101
R80194714,Buntatala,R3499101
R80194579,Burgos-Mabini-Plaza,R3499101
R80194703,Caingin,R3499101
R80194715,Calahunan,R3499101
R80194719,Calaparan,R3499101
R80194564,Calubihan,R3499101
R80194696,Calumpang,R3499101
R80194613,Camalig,R3499101
R80194580,Cochero,R3499101
R80194674,Compania,R3499101
R80194608,Concepcion-Montes,R3499101
R80194615,Cuartero,R3499101
R80194708,Cubay,R3499101
R80194656,Danao,R3499101
R80194590,Delgado-Jalandoni-Bagumbayan,R3499101
R80194688,Democracia,R3499101
R80194571,Desamparados,R3499101
R80194573,Divinagracia,R3499101
R80194572,Don Esteban-Lapuz,R3499101
R80194601,Dulonan,R3499101
R80194550,Dungon,R3499101
R80194555,Dungon A,R3499101
R80194647,Dungon B,R3499101
R80194670,East Baluarte,R3499101
R80194658,East Timawa,R3499101
R80194679,Edganzon,R3499101
R80194659,El 98 Castilla (Claudio Lopez),R3499101
R80194574,Fajardo,R3499101
R80194657,Flores,R3499101
R80194616,General Hughes-Montes,R3499101
R80194575,Gloria,R3499101
R80194631,Gustilo,R3499101
R80194606,Guzman-Jesena,R3499101
R80194697,Habog-Habog Salvacion,R3499101
R80194683,Hibao-An Norte,R3499101
R80194720,Hibao-An Sur,R3499101
R80194709,Hinactacan,R3499101
R80194607,Hipodromo,R3499101
R80194632,Inday,R3499101
R80194557,Infante,R3499101
R80194648,Ingore,R3499101
R80194576,Jalandoni Estate-Lapuz,R3499101
R80194660,Jalandoni-Wilson,R3499101
R80194710,Javellana,R3499101
R80194541,Jereos,R3499101
R80194614,Kahirupan,R3499101
R80194624,Kasingkasing,R3499101
R80194684,Katilingban,R3499101
R80194716,Kauswagan,R3499101
R80194661,Laguda,R3499101
R80194592,Lanit,R3499101
R80194641,Lapuz Norte,R3499101
R80194556,Lapuz Sur,R3499101
R80194558,Legaspi Dela Rama,R3499101
R80194577,Liberation,R3499101
R80194559,Libertad-Lapuz,R3499101
R80194671,Libertad Santa Isabel,R3499101
R80194634,Loboc-Lapuz,R3499101
R80194543,Lopez Jaena (Jaro),R3499101
R80194677,Lopez Jaena Norte,R3499101
R80194620,Lopez Jaena Sur,R3499101
R80194694,Luna (Jaro),R3499101
R80194682,Luna (La Paz),R3499101
R80194581,M. V. Hechanova,R3499101
R80194655,Mabolo-Delgado,R3499101
R80194625,Macarthur,R3499101
R80194711,Magdalo,R3499101
R80194578,Magsaysay,R3499101
R80194552,Magsaysay Village,R3499101
R80194698,Malipayon-Delgado,R3499101
R80194650,Mansaya-Lapuz,R3499101
R80194626,Marcelo H. Del Pilar,R3499101
R80194587,Maria Clara,R3499101
R80194560,Maria Cristina,R3499101
R80194565,Mohon,R3499101
R80194712,Molo Boulevard,R3499101
R80194695,Monica Blumentritt,R3499101
R80194602,Montinola,R3499101
R80194566,Muelle Loney-Montes,R3499101
R80194704,Nabitasan,R3499101
R80194544,Navais,R3499101
R80194642,Nonoy,R3499101
R80194705,North Avancena,R3499101
R80194643,North Baluarte,R3499101
R80194627,North Fundidor,R3499101
R80194594,North San Jose,R3499101
R80194717,Obrero-Lapuz,R3499101
R80194680,Onate De Leon,R3499101
R80194689,Ortiz,R3499101
R80194635,Osmena,R3499101
R80194621,Our Lady Of Fatima,R3499101
R80194595,Our Lady Of Lourdes,R3499101
R80194651,Pale Benedicto Rizal (Mandurriao),R3499101
R80194609,Phhc Block 17,R3499101
R80194596,Phhc Block 22 Nha,R3499101
R80194553,Poblacion Molo,R3499101
R80194662,President Roxas,R3499101
R80194669,Progreso-Lapuz,R3499101
R80194545,Punong-Lapuz,R3499101
R80194567,Quezon,R3499101
R80194690,Quintin Salas,R3499101
R80194636,Railway,R3499101
R80194610,Rima-Rizal,R3499101
R80194597,Rizal (La Paz),R3499101
R80194568,Rizal Estanzuela,R3499101
R80194598,Rizal Ibarra,R3499101
R80194546,Rizal Palapala I,R3499101
R80194628,Rizal Palapala Ii,R3499101
R80194569,Roxas Village,R3499101
R80194554,Sambag,R3499101
R80194675,Sampaguita,R3499101
R80194582,San Agustin,R3499101
R80194547,San Antonio,R3499101
R80194603,San Felix,R3499101
R80194604,San Isidro (Jaro),R3499101
R80194588,San Isidro (La Paz),R3499101
R80194593,San Jose (Arevalo),R3499101
R80194548,San Jose (City Proper),R3499101
R80194637,San Jose (Jaro),R3499101
R80194591,San Juan,R3499101
R80194663,San Nicolas,R3499101
R80194622,San Pedro (Jaro),R3499101
R80194691,San Pedro (Molo),R3499101
R80194672,San Rafael,R3499101
R80194623,San Roque,R3499101
R80194699,Santa Cruz,R3499101
R80194561,Santa Filomena,R3499101
R80194700,Santa Rosa,R3499101
R80194652,Santo Domingo,R3499101
R80194644,Santo Nino Norte,R3499101
R80194701,Santo Nino Sur,R3499101
R80194718,Santo Rosario-Duran,R3499101
R80194706,San Vicente,R3499101
R80194645,Seminario (Burgos Jalandoni),R3499101
R80194551,Simon Ledesma,R3499101
R80194667,Sinikway (Bangkerohan Lapuz),R3499101
R80194646,So-Oc,R3499101
R80194678,South Baluarte,R3499101
R80194611,South Fundidor,R3499101
R80194583,South San Jose,R3499101
R80194685,Taal,R3499101
R80194707,Tabucan,R3499101
R80194692,Tabuc Suba (Jaro),R3499101
R80194629,Tabuc Suba (La Paz),R3499101
R80194638,Tacas,R3499101
R80194713,Tagbac,R3499101
R80194570,Tanza-Esperanza,R3499101
R80194599,Tap-Oc,R3499101
R80194617,Taytay Zone Ii,R3499101
R80194584,Ticud (La Paz),R3499101
R80194605,Timawa Tanza I,R3499101
R80194630,Timawa Tanza Ii,R3499101
R80194618,Ungka,R3499101
R80194666,Veterans Village,R3499101
R80194686,Villa Anita,R3499101
R80194542,West Habog-Habog,R3499101
R80194649,West Timawa,R3499101
R80194619,Yulo-Arroyo,R3499101
R80194562,Yulo Drive,R3499101
R80194693,Zamora-Melliza,R3499101
R80194775,Abangay,R80157250
R80194762,Agcarope,R80157250
R80194776,Aglobong,R80157250
R80194723,Aguingay,R80157250
R80194778,Anhawan,R80157250
R80194742,Aquino Nobleza East (Pob.),R80157250
R80194737,Aquino Nobleza West (Pob.),R80157250
R80194768,Atimonan,R80157250
R80194779,Balanac,R80157250
R80194743,Barasalon,R80157250
R80194777,Bongol,R80157250
R80194772,Cabantog,R80157250
R80194744,Calmay,R80157250
R80194746,Canawili,R80157250
R80194763,Canawillian,R80157250
R80194759,Capt. A. Tirador (Pob.),R80157250
R80194747,Caranas,R80157250
R80194751,Caraudan,R80157250
R80194760,Carigangan,R80157250
R80194769,Concepcion Pob. (D.g. Abordo),R80157250
R80194724,Crispin Salazar North (Pob.),R80157250
R80194721,Crispin Salazar South (Pob.),R80157250
R80194752,Cunsad,R80157250
R80194765,Dabong,R80157250
R80194753,Damires,R80157250
R80194728,Damo-Ong,R80157250
R80194738,Danao,R80157250
R80194749,Don T. Lutero Center (Pob.),R80157250
R80194739,Don T. Lutero East (Pob.),R80157250
R80194734,Don T. Lutero West Pob. (Don T. Lutero North),R80157250
R80194756,Gines,R80157250
R80194740,Golgota (Pob.),R80157250
R80194764,Guadalupe,R80157250
R80194729,Jibolo,R80157250
R80194773,Kuyot,R80157250
R80194748,Locsin (Pob.),R80157250
R80194731,Madong,R80157250
R80194730,Manacabac,R80157250
R80194732,Mangil,R80157250
R80194726,Matag-Ub,R80157250
R80194725,Monte-Magapa,R80157250
R80194780,Pangilihan,R80157250
R80194761,Panuran,R80157250
R80194774,Pararinga,R80157250
R80194727,Patong-Patong,R80157250
R80194757,Quipot,R80157250
R80194750,R. Armada (Pob.),R80157250
R80194758,S. M. Villa (Pob.),R80157250
R80194745,San Julian (Pob.),R80157250
R80194733,San Pedro (Pob.),R80157250
R80194771,Santa Rita (Pob.),R80157250
R80194770,Santo Tomas,R80157250
R80194766,Sarawag,R80157250
R80194741,Tambal,R80157250
R80194722,Tamu-An,R80157250
R80194754,Tiringanan,R80157250
R80194735,Tolarucan,R80157250
R80194755,Tuburan,R80157250
R80194767,Ubian,R80157250
R80194736,Yabon,R80157250
R80195179,Agsirab,R80157259
R80195236,Agtuman,R80157259
R80195194,Alugmawa,R80157259
R80195214,Badiangan,R80157259
R80195241,Balagiao,R80157259
R80195210,Banban,R80157259
R80195195,Bansag,R80157259
R80195237,Bayuco,R80157259
R80195182,Binaba-An Armada,R80157259
R80195183,Binaba-An Labayno,R80157259
R80195211,Binaba-An Limoso,R80157259
R80195244,Binaba-An Portigo,R80157259
R80195245,Binaba-An Tirador,R80157259
R80195180,Bogongbong,R80157259
R80195228,Bonbon,R80157259
R80195221,Bontoc,R80157259
R80195231,Buri,R80157259
R80195196,Burirao,R80157259
R80195229,Buwang,R80157259
R80195181,Cabatangan,R80157259
R80195189,Cabugao,R80157259
R80195230,Cabunlawan,R80157259
R80195201,Caguisanan,R80157259
R80195202,Caloy-Ahan,R80157259
R80195222,Caninguan,R80157259
R80195242,Capangyan,R80157259
R80195238,Cayan Este,R80157259
R80195174,Cayan Oeste,R80157259
R80195198,Corot-On,R80157259
R80195192,Coto,R80157259
R80195224,Cubay,R80157259
R80195243,Cunarum,R80157259
R80195184,Daanbanwa,R80157259
R80195217,Gines,R80157259
R80195212,Hipgos,R80157259
R80195234,Jayubo,R80157259
R80195204,Jorog,R80157259
R80195232,Lanot Grande,R80157259
R80195239,Lanot Pequeno,R80157259
R80195190,Legayada,R80157259
R80195191,Lumanay,R80157259
R80195207,Madarag,R80157259
R80195185,Magbato,R80157259
R80195215,Maite Grande,R80157259
R80195199,Maite Pequeno,R80157259
R80195240,Malag-It,R80157259
R80195186,Manaulan,R80157259
R80195208,Maribong,R80157259
R80195223,Marong,R80157259
R80195187,Misi,R80157259
R80195209,Natividad,R80157259
R80195200,Pajo,R80157259
R80195197,Pandan,R80157259
R80195193,Panuran,R80157259
R80195233,Pasig,R80157259
R80195205,Patag,R80157259
R80195175,Poblacion Ilawod,R80157259
R80195225,Poblacion Ilaya,R80157259
R80195216,Poong,R80157259
R80195206,Pughanan,R80157259
R80195219,Pungsod,R80157259
R80195246,Quiling,R80157259
R80195188,Sagcup,R80157259
R80195176,San Gregorio,R80157259
R80195220,Sibacungan,R80157259
R80195203,Sibaguan,R80157259
R80195213,Simsiman,R80157259
R80195177,Supoc,R80157259
R80195218,Tampucao,R80157259
R80195226,Tranghawan,R80157259
R80195178,Tubungan,R80157259
R80195227,Tuburan,R80157259
R80195235,Walang,R80157259
R80194950,Bigke,R3492693
R80194956,Buntatala,R3492693
R80194957,Cagamutan Norte,R3492693
R80194951,Cagamutan Sur,R3492693
R80194961,Calaboa,R3492693
R80194962,Camangay,R3492693
R80194955,Cari Mayor,R3492693
R80194952,Cari Minor,R3492693
R80194958,Gua-An,R3492693
R80194963,Guihaman,R3492693
R80194959,Guinobatan,R3492693
R80194964,Guintas,R3492693
R80194965,Lapayon,R3492693
R80194953,M.v. Hechanova (Balagon),R3492693
R80194966,Nabitasan,R3492693
R80194967,Napnud,R3492693
R80194954,Poblacion,R3492693
R80194960,San Vicente,R3492693
R80195475,Agpipili,R80157263
R80195476,Alcantara,R80157263
R80195469,Almenana,R80157263
R80195477,Anabo,R80157263
R80195483,Bankal,R80157263
R80195465,Buenavista,R80157263
R80195484,Cabantohan,R80157263
R80195478,Capinahan,R80157263
R80195479,Dalipe,R80157263
R80195461,Dapdapan,R80157263
R80195464,Gerongan,R80157263
R80195466,Imbaulan,R80157263
R80195467,Layogbato,R80157263
R80195470,Marapal,R80157263
R80195482,Milan,R80157263
R80195471,Nagsulang,R80157263
R80195480,Nasapahan,R80157263
R80195485,Omio,R80157263
R80195486,Pacuan,R80157263
R80195459,Poblacion Nw Zone,R80157263
R80195472,Poblacion Se Zone,R80157263
R80195462,Pontoc,R80157263
R80195473,San Antonio,R80157263
R80195487,San Diego,R80157263
R80195481,San Jose Moto,R80157263
R80195463,Sepanton,R80157263
R80195460,Sincua,R80157263
R80195474,Tabunan,R80157263
R80195488,Tugas,R80157263
R80195489,Velasco,R80157263
R80195468,Yawyawan,R80157263
R80194380,Agboy Norte,R80157246
R80194354,Agboy Sur,R80157246
R80194319,Agta,R80157246
R80194327,Ambulong,R80157246
R80194347,Anonang,R80157246
R80194304,Apian,R80157246
R80194301,Avanzada,R80157246
R80194348,Awis,R80157246
R80194357,Ayabang,R80157246
R80194341,Ayubo,R80157246
R80194342,Bacolod,R80157246
R80194352,Baje,R80157246
R80194365,Banagan,R80157246
R80194355,Barangbang,R80157246
R80194349,Barasan,R80157246
R80194373,Bayag Norte,R80157246
R80194343,Bayag Sur,R80157246
R80194366,Binolbog,R80157246
R80194305,Biri Norte,R80157246
R80194328,Biri Sur,R80157246
R80194344,Bobon,R80157246
R80194350,Bucari,R80157246
R80194370,Buenavista,R80157246
R80194333,Buga,R80157246
R80194312,Bulad,R80157246
R80194334,Bulwang,R80157246
R80194356,Cabolo-An,R80157246
R80194374,Cabunga-An,R80157246
R80194329,Cabutongan,R80157246
R80194320,Cagay,R80157246
R80194367,Camandag,R80157246
R80194321,Camando,R80157246
R80194335,Cananaman,R80157246
R80194330,Capt. Fernando,R80157246
R80194345,Carara-An,R80157246
R80194322,Carolina,R80157246
R80194313,Cawilihan,R80157246
R80194314,Coyugan Norte,R80157246
R80194381,Coyugan Sur,R80157246
R80194336,Danao,R80157246
R80194371,Dorog,R80157246
R80194323,Dusacan,R80157246
R80194382,Gines,R80157246
R80194375,Gumboc,R80157246
R80194338,Igcadios,R80157246
R80194318,Ingay,R80157246
R80194315,Isian Norte,R80157246
R80194316,Isian Victoria,R80157246
R80194383,Jamog Gines,R80157246
R80194306,Lampaya,R80157246
R80194358,Lanag,R80157246
R80194302,Lang-Og,R80157246
R80194384,Ligtos,R80157246
R80194368,Lonoc,R80157246
R80194362,Magcapay,R80157246
R80194369,Maliao,R80157246
R80194331,Malublub,R80157246
R80194309,Manampunay,R80157246
R80194359,Marirong,R80157246
R80194377,Mina,R80157246
R80194310,Mocol,R80157246
R80194378,Nagbangi,R80157246
R80194379,Nalbang,R80157246
R80194339,Odong-Odong,R80157246
R80194324,Oluangan,R80157246
R80194360,Omambong,R80157246
R80194311,Paga,R80157246
R80194372,Pandan,R80157246
R80194361,Panginman,R80157246
R80194337,Paoy,R80157246
R80194363,Pepe,R80157246
R80194340,Poblacion,R80157246
R80194346,Salngan,R80157246
R80194317,Samlague,R80157246
R80194351,Siol Norte,R80157246
R80194364,Siol Sur,R80157246
R80194325,Tacuyong Norte,R80157246
R80194353,Tacuyong Sur,R80157246
R80194303,Tagsing,R80157246
R80194326,Talacuan,R80157246
R80194307,Ticuan,R80157246
R80194332,Tina-An Norte,R80157246
R80194385,Tina-An Sur,R80157246
R80194376,Tunguan,R80157246
R80194308,Tu-Og,R80157246
R80195914,Abay,R80157271
R80195919,Abilay,R80157271
R80195886,Agrocel Pob. (Aguinaldo-Roxas--Celso Mayor),R80157271
R80195908,Amerang,R80157271
R80195909,Bagacay East,R80157271
R80195900,Bagacay West,R80157271
R80195910,Bolo,R80157271
R80195907,Bug-Ot,R80157271
R80195893,Bulay,R80157271
R80195911,Buntalan,R80157271
R80195894,Burak,R80157271
R80195887,Cabangcalan,R80157271
R80195877,Cabatac,R80157271
R80195888,Caigon,R80157271
R80195881,Cananghan,R80157271
R80195912,Canawili,R80157271
R80195882,Dagami,R80157271
R80195889,Daja,R80157271
R80195870,Dalusan,R80157271
R80195883,Delcar Pob. (Delgado-Cartagena),R80157271
R80195884,Inabasan,R80157271
R80195885,Layog,R80157271
R80195878,Linab,R80157271
R80195871,Linagan Calsada,R80157271
R80195872,Linagan Tacas,R80157271
R80195879,Magsaysay,R80157271
R80195895,Mandog,R80157271
R80195915,Mari Pob. (Mabini-Rizal),R80157271
R80195896,Miapa,R80157271
R80195890,Nagba,R80157271
R80195897,Nasaka,R80157271
R80195901,Naslo-Bucao,R80157271
R80195880,Nasuli,R80157271
R80195873,Panalian,R80157271
R80195902,Piandaan East,R80157271
R80195916,Piandaan West,R80157271
R80195874,Pispis,R80157271
R80195898,Punong,R80157271
R80195917,Santa Rita,R80157271
R80195875,Sinubsuban,R80157271
R80195903,Siwalo,R80157271
R80195891,Subog,R80157271
R80195913,Thtp Pob. (Taft-Thompson--Hughes-Del Pilar),R80157271
R80195899,Tigbauan,R80157271
R80195918,Trangka,R80157271
R80195904,Tubang,R80157271
R80195905,Tulahong,R80157271
R80195906,Tuy-An East,R80157271
R80195876,Tuy-An West,R80157271
R80195892,Ubian,R80157271
R80195551,Agdum,R80157264
R80195577,Aguiauan,R80157264
R80195506,Alimodias,R80157264
R80195510,Awang,R80157264
R80195578,Bacauan,R80157264
R80195522,Bacolod,R80157264
R80195502,Bagumbayan,R80157264
R80195591,Banbanan,R80157264
R80195605,Banga,R80157264
R80195552,Bangladan,R80157264
R80195584,Banuyao,R80157264
R80195553,Baraclayan,R80157264
R80195594,Bariri,R80157264
R80195539,Baybay Norte (Pob.),R80157264
R80195565,Baybay Sur (Pob.),R80157264
R80195601,Belen,R80157264
R80195554,Bolho (Pob.),R80157264
R80195507,Bolocaue,R80157264
R80195573,Buenavista Norte,R80157264
R80195581,Buenavista Sur,R80157264
R80195534,Bugtong Lumangan,R80157264
R80195606,Bugtong Naulid,R80157264
R80195503,Cabalaunan,R80157264
R80195493,Cabangcalan,R80157264
R80195550,Cabunotan,R80157264
R80195566,Cadoldolan,R80157264
R80195585,Cagbang,R80157264
R80195582,Caitib,R80157264
R80195540,Calagtangan,R80157264
R80195517,Calampitao,R80157264
R80195607,Cavite,R80157264
R80195518,Cawayanan,R80157264
R80195558,Cubay,R80157264
R80195546,Cubay Ubos,R80157264
R80195592,Dalije,R80157264
R80195511,Damilisan,R80157264
R80195535,Dawog,R80157264
R80195523,Diday,R80157264
R80195497,Dingle,R80157264
R80195529,Durog,R80157264
R80195586,Frantilla,R80157264
R80195590,Fundacion,R80157264
R80195569,Gines,R80157264
R80195530,Guibongan,R80157264
R80195583,Igbita,R80157264
R80195587,Igbugo,R80157264
R80195494,Igcabidio,R80157264
R80195595,Igcabito-On,R80157264
R80195519,Igcatambor,R80157264
R80195567,Igdalaquit,R80157264
R80195520,Igdulaca,R80157264
R80195521,Igpajo,R80157264
R80195512,Igpandan,R80157264
R80195504,Igpuro,R80157264
R80195570,Igpuro-Bariri,R80157264
R80195505,Igsoligue,R80157264
R80195531,Igtuba,R80157264
R80195532,Ilog-Ilog,R80157264
R80195568,Indag-An,R80157264
R80195561,Kirayan Norte,R80157264
R80195547,Kirayan Sur,R80157264
R80195588,Kirayan Tacas,R80157264
R80195524,Lacadon,R80157264
R80195514,La Consolacion,R80157264
R80195562,Lanutan,R80157264
R80195593,Lumangan,R80157264
R80195513,Mabayan,R80157264
R80195508,Maduyo,R80157264
R80195574,Malagyan,R80157264
R80195495,Mambatad,R80157264
R80195509,Maninila,R80157264
R80195548,Maricolcol,R80157264
R80195549,Maringyan,R80157264
R80195538,Matalngon,R80157264
R80195563,Mat-Y (Pob.),R80157264
R80195536,Naclub,R80157264
R80195537,Nam-O Norte,R80157264
R80195589,Nam-O Sur,R80157264
R80195543,Narat-An,R80157264
R80195544,Narorogan,R80157264
R80195579,Naulid,R80157264
R80195602,Olango,R80157264
R80195597,Ongyod,R80157264
R80195541,Onop,R80157264
R80195575,Oya-Oy,R80157264
R80195608,Oyungan,R80157264
R80195564,Palaca,R80157264
R80195496,Paro-On,R80157264
R80195604,Potrido,R80157264
R80195515,Pudpud,R80157264
R80195571,Pungtod Monteclaro,R80157264
R80195598,Pungtod Naulid,R80157264
R80195555,Sag-On,R80157264
R80195599,San Fernando,R80157264
R80195527,San Jose,R80157264
R80195580,San Rafael,R80157264
R80195498,Sapa (Miagao),R80157264
R80195556,Saring,R80157264
R80195596,Sibucao,R80157264
R80195533,Taal,R80157264
R80195600,Tabunacan,R80157264
R80195490,Tacas (Pob.),R80157264
R80195542,Tambong,R80157264
R80195491,Tan-Agan,R80157264
R80195576,Tatoy,R80157264
R80195545,Ticdalan,R80157264
R80195557,Tig-Amaga,R80157264
R80195559,Tig-Apog-Apog,R80157264
R80195492,Tigbagacay,R80157264
R80195528,Tiglawa,R80157264
R80195516,Tigmalapad,R80157264
R80195499,Tigmarabo,R80157264
R80195525,To-Og,R80157264
R80195560,Tugura-Ao,R80157264
R80195501,Tumagboc,R80157264
R80195500,Ubos Ilawod (Pob.),R80157264
R80195526,Ubos Ilaya (Pob.),R80157264
R80195603,Valencia,R80157264
R80195572,Wayang,R80157264
R80194983,Abat,R80157255
R80194984,Agmanaphao,R80157255
R80194985,Amiroy,R80157255
R80194979,Badiangan,R80157255
R80194975,Bangac,R80157255
R80194986,Cabalabaguan,R80157255
R80194968,Capul-An,R80157255
R80194987,Dala,R80157255
R80194980,Guibuangan,R80157255
R80194969,Janipa-An East,R80157255
R80194970,Janipa-An West,R80157255
R80194981,Mina East (Pob.),R80157255
R80194976,Mina West (Pob.),R80157255
R80194977,Nasirum,R80157255
R80194971,Naumuan,R80157255
R80194988,Singay,R80157255
R80194972,Talibong Grande,R80157255
R80194989,Talibong Pequeno,R80157255
R80194978,Tipolo,R80157255
R80194982,Tolarucan,R80157255
R80194973,Tumay,R80157255
R80194974,Yugot,R80157255
R80194792,Baclayan,R80157251
R80194785,Badiang,R80157251
R80194781,Balabag,R80157251
R80194798,Bilidan,R80157251
R80194782,Bita-Og Gaja,R80157251
R80194793,Bololacao,R80157251
R80194786,Burot,R80157251
R80194799,Cabilauan,R80157251
R80194783,Cabugao,R80157251
R80194800,Cagban,R80157251
R80194794,Calumbuyan,R80157251
R80194795,Damires,R80157251
R80194787,Dawis,R80157251
R80194788,General Delgado,R80157251
R80194789,Guinobatan,R80157251
R80194796,Janipa-An Oeste,R80157251
R80194797,Jelicuon Este,R80157251
R80194790,Jelicuon Oeste,R80157251
R80194791,Pasil,R80157251
R80194784,Poblacion,R80157251
R80194801,Wari-Wari,R80157251
R80194993,Abilay Norte,R80157256
R80195026,Abilay Sur,R80157256
R80195014,Alegre,R80157256
R80195001,Batuan Ilaud,R80157256
R80194994,Batuan Ilaya,R80157256
R80195009,Bita Norte,R80157256
R80195019,Bita Sur,R80157256
R80195017,Botong,R80157256
R80194990,Buray,R80157256
R80195008,Cabanbanan,R80157256
R80195016,Caboloan Norte,R80157256
R80194991,Caboloan Sur,R80157256
R80195010,Cadinglian,R80157256
R80195021,Cagbang,R80157256
R80194995,Calam-Isan,R80157256
R80194996,Galang,R80157256
R80194997,Lambuyao,R80157256
R80195022,Mambog,R80157256
R80195003,Pakiad,R80157256
R80194992,Poblacion East,R80157256
R80195018,Poblacion North,R80157256
R80194998,Poblacion South,R80157256
R80195011,Poblacion West,R80157256
R80195004,Polo Maestra Bita,R80157256
R80195015,Rizal,R80157256
R80195012,Salngan,R80157256
R80195005,Sambaludan,R80157256
R80195020,San Antonio,R80157256
R80194999,San Nicolas,R80157256
R80195006,Santa Clara,R80157256
R80195000,Santa Monica,R80157256
R80195023,Santa Rita,R80157256
R80195002,Tagbac Norte,R80157256
R80195024,Tagbac Sur,R80157256
R80195007,Trapiche,R80157256
R80195013,Tuburan,R80157256
R80195025,Turog-Turog,R80157256
R80194140,Agdahon,R80157243
R80194181,Agdayao,R80157243
R80194182,Aglalana,R80157243
R80194158,Agtabo,R80157243
R80194173,Agtambo,R80157243
R80194175,Alimono,R80157243
R80194165,Arac,R80157243
R80194176,Ayuyan,R80157243
R80194146,Bacuranan,R80157243
R80194159,Bagacay,R80157243
R80194147,Batu,R80157243
R80194153,Bayan,R80157243
R80194174,Bitaogan,R80157243
R80194177,Buenavista,R80157243
R80194178,Buyo,R80157243
R80194179,Cabunga,R80157243
R80194154,Cadilang,R80157243
R80194162,Cairohan,R80157243
R80194141,Dalicanan,R80157243
R80194155,Gegachac,R80157243
R80194163,Gemat-Y,R80157243
R80194160,Gemumua-Agahon,R80157243
R80194134,Gines Viejo,R80157243
R80194151,Imbang Grande,R80157243
R80194180,Jaguimitan,R80157243
R80194183,Libo-O,R80157243
R80194135,Maasin,R80157243
R80194136,Magdungao,R80157243
R80194161,Malag-It Grande,R80157243
R80194137,Malag-It Pequeno,R80157243
R80194138,Mambiranan Grande,R80157243
R80194143,Mambiranan Pequeno,R80157243
R80194166,Man-It,R80157243
R80194139,Mantulang,R80157243
R80194167,Mulapula,R80157243
R80194152,Nueva Union,R80157243
R80194168,Pagaypay,R80157243
R80194169,Pangi,R80157243
R80194144,Poblacion Ilawod,R80157243
R80194148,Poblacion Ilaya,R80157243
R80194156,Punong,R80157243
R80194149,Quinagaringan Grande,R80157243
R80194170,Quinagaringan Pequeno,R80157243
R80194150,Sablogon,R80157243
R80194145,Salngan,R80157243
R80194142,Santo Tomas,R80157243
R80194184,Sarapan,R80157243
R80194171,Tagubong,R80157243
R80194164,Talongonan,R80157243
R80194172,Tubod,R80157243
R80194157,Tuburan,R80157243
R80194814,Aganan,R80157252
R80194808,Amparo,R80157252
R80194809,Anilao,R80157252
R80194815,Balabag,R80157252
R80194802,Cabugao Norte,R80157252
R80194806,Cabugao Sur,R80157252
R80194810,Jibao-An,R80157252
R80194811,Mali-Ao,R80157252
R80194816,Pagsanga-An,R80157252
R80194817,Pal-Agon,R80157252
R80194807,Pandac,R80157252
R80194812,Purok I (Pob.),R80157252
R80194818,Purok Ii (Pob.),R80157252
R80194803,Purok Iii (Pob.),R80157252
R80194804,Purok Iv (Pob.),R80157252
R80194805,Tigum,R80157252
R80194819,Ungka I,R80157252
R80194813,Ungka Ii,R80157252
R80194412,Abangay,R80157247
R80194392,Amamaros,R80157247
R80194431,Bagacay,R80157247
R80194388,Barasan,R80157247
R80194413,Batuan,R80157247
R80194398,Bongco,R80157247
R80194432,Cahaguichican,R80157247
R80194399,Callan,R80157247
R80194393,Cansilayan,R80157247
R80194433,Casalsagan,R80157247
R80194423,Cato-Ogan,R80157247
R80194414,Cau-Ayan,R80157247
R80194394,Culob,R80157247
R80194420,Danao,R80157247
R80194407,Dapitan,R80157247
R80194408,Dawis,R80157247
R80194409,Dongsol,R80157247
R80194421,Fernando Parcon Ward (Pob.),R80157247
R80194404,Fundacion,R80157247
R80194400,Guibuangan,R80157247
R80194395,Guinacas,R80157247
R80194405,Igang,R80157247
R80194410,Intaluan,R80157247
R80194389,Iwa Ilaud,R80157247
R80194396,Iwa Ilaya,R80157247
R80194391,Jamabalud,R80157247
R80194426,Jebioc,R80157247
R80194406,Lay-Ahan,R80157247
R80194424,Lopez Jaena Ward (Pob.),R80157247
R80194401,Lumbo,R80157247
R80194427,Macatol,R80157247
R80194411,Malusgod,R80157247
R80194422,Nabitasan,R80157247
R80194428,Naga,R80157247
R80194416,Nanga,R80157247
R80194429,Naslo,R80157247
R80194417,Pajo,R80157247
R80194418,Palanguia,R80157247
R80194430,Pitogo,R80157247
R80194402,Polot-An,R80157247
R80194434,Primitivo Ledesma Ward (Pob.),R80157247
R80194390,Purog,R80157247
R80194415,Rumbang,R80157247
R80194386,San Jose Ward (Pob.),R80157247
R80194435,Sinuagan,R80157247
R80194403,Tuburan,R80157247
R80194419,Tumcon Ilaud,R80157247
R80194397,Tumcon Ilaya,R80157247
R80194387,Ubang,R80157247
R80194425,Zarrague,R80157247
R80195622,Agdaliran,R3479548
R80195629,Amayong,R3479548
R80195616,Bagacay,R3479548
R80195609,Batuan,R3479548
R80195623,Bondulan,R3479548
R80195624,Borongon,R3479548
R80195634,Canas,R3479548
R80195610,Capinang,R3479548
R80195617,Cubay,R3479548
R80195630,Cudionan,R3479548
R80195633,Dugman,R3479548
R80195618,Hacienda Conchita,R3479548
R80195611,Madanlog,R3479548
R80195635,Mandu-Awak,R3479548
R80195627,Moto,R3479548
R80195619,Naborot,R3479548
R80195628,Nipa,R3479548
R80195620,Odiongan,R3479548
R80195631,Pangi,R3479548
R80195636,Pase,R3479548
R80195625,Poblacion,R3479548
R80195626,San Nicolas,R3479548
R80195612,Santol,R3479548
R80195613,Siempreviva,R3479548
R80195632,Sua,R3479548
R80195621,Talo-Ato,R3479548
R80195637,Tamangi,R3479548
R80195614,Tiabas,R3479548
R80195615,Tuble,R3479548
R80194459,Abaca,R80157248
R80194437,Asisig,R80157248
R80194450,Bagonawa,R80157248
R80194451,Baliwagan,R80157248
R80194453,Bantayan,R80157248
R80194442,Batuan,R80157248
R80194455,Braulan,R80157248
R80194460,Cabugao Nuevo,R80157248
R80194443,Cabugao Viejo,R80157248
R80194461,Camiri,R80157248
R80194439,Catan-Agan,R80157248
R80194440,Compo,R80157248
R80194456,Cubay,R80157248
R80194438,Dacal,R80157248
R80194444,Dumiles,R80157248
R80194457,Garita,R80157248
R80194445,Gines Nuevo,R80157248
R80194446,Guintorilan,R80157248
R80194452,Imbang Pequeno,R80157248
R80194454,Imbesad-An,R80157248
R80194448,Iprog,R80157248
R80194447,Lip-Ac,R80157248
R80194462,Madarag,R80157248
R80194441,Mapili,R80157248
R80194436,Nayon,R80157248
R80194449,Paga,R80157248
R80194463,Palje,R80157248
R80194458,Poblacion Ilawod,R80157248
R80195273,Amboyu-An,R80157260
R80195323,Andres Bonifacio,R80157260
R80195292,Antalon,R80157260
R80195287,Bad-As,R80157260
R80195247,Bagumbayan,R80157260
R80195257,Balabago,R80157260
R80195324,Baybay,R80157260
R80195267,Bayunan (Panday Oro),R80157260
R80195258,Bolbogan,R80157260
R80195304,Bonga,R80157260
R80195293,Bucaya,R80157260
R80195288,Bulho,R80157260
R80195268,Cadluman,R80157260
R80195259,Cadoldolan,R80157260
R80195281,Camaba-An,R80157260
R80195294,Camia,R80157260
R80195263,Cata-An,R80157260
R80195248,Crossing Dapuyan,R80157260
R80195282,Cubay,R80157260
R80195310,Cumarascas,R80157260
R80195249,Dacdacanan,R80157260
R80195289,Danawan,R80157260
R80195250,Doldol,R80157260
R80195311,Dongoc,R80157260
R80195295,Escalantera,R80157260
R80195298,Ginot-An,R80157260
R80195296,Guibongan Bayunan,R80157260
R80195305,Huna,R80157260
R80195274,Igbaje,R80157260
R80195306,Igbangcal,R80157260
R80195279,Igbinangon,R80157260
R80195251,Igburi,R80157260
R80195252,Igcabutong,R80157260
R80195325,Igcadlum,R80157260
R80195269,Igcaphang,R80157260
R80195299,Igcaratong,R80157260
R80195260,Igcondao,R80157260
R80195261,Igcores,R80157260
R80195270,Igdagmay,R80157260
R80195254,Igdomingding,R80157260
R80195312,Iglilico,R80157260
R80195321,Igpayong,R80157260
R80195322,Jawod,R80157260
R80195290,Langca,R80157260
R80195264,Languanan,R80157260
R80195326,Lawigan,R80157260
R80195313,Lomboy,R80157260
R80195283,Lomboyan (Santa Ana),R80157260
R80195275,Lopez Vito,R80157260
R80195262,Mabini Norte,R80157260
R80195297,Mabini Sur,R80157260
R80195300,Manhara,R80157260
R80195284,Maninila,R80157260
R80195327,Masagud,R80157260
R80195253,Matambog,R80157260
R80195276,Mayunoc,R80157260
R80195307,Montinola,R80157260
R80195301,Nadsadan,R80157260
R80195314,Nagquirisan,R80157260
R80195277,Nagsipit,R80157260
R80195315,New Gumawan,R80157260
R80195271,Panatan,R80157260
R80195278,Pitogo,R80157260
R80195302,Purok 1 (Pob.),R80157260
R80195328,Purok 2 (Pob.),R80157260
R80195316,Purok 3 (Pob.),R80157260
R80195329,Purok 4 (Pob.),R80157260
R80195285,Purok 5 (Pob.),R80157260
R80195265,Qui-Anan,R80157260
R80195330,Roma,R80157260
R80195303,San Luis,R80157260
R80195280,San Mateo Norte,R80157260
R80195331,San Mateo Sur,R80157260
R80195291,Santa Rita,R80157260
R80195317,Santiago,R80157260
R80195318,Sinogbuhan,R80157260
R80195308,Siwaragan,R80157260
R80195319,Talagutac,R80157260
R80195272,Tapikan,R80157260
R80195266,Taslan,R80157260
R80195255,Tiglawa,R80157260
R80195286,Tiolas,R80157260
R80195309,To-Og,R80157260
R80195320,Torocadan,R80157260
R80195256,Ulay,R80157260
R80195930,Bgy. 10 (Pob. R.v.sanchez St. South),R80157272
R80195941,Bgy. 11 Pob. (R.v.sanchez St. North),R80157272
R80195937,Bgy. 12 Pob. (Sales Malaga Saliedo),R80157272
R80195931,Bgy. 13 Pob. (Sta.rita-Saclauso St.),R80157272
R80195923,Bgy. 14 Pob. (San Miguel North),R80157272
R80195932,Bgy. 15 Pob. (San Miguel South),R80157272
R80195942,Bgy. 16 Pob. (San Agustin St.),R80157272
R80195922,Bgy. 1 Pob. (Roxas St.),R80157272
R80195938,Bgy. 2 Pob. (Savilla Sto. Rosario),R80157272
R80195939,Bgy. 3 Pob. (A.s.suarez St. Zone 1),R80157272
R80195925,Bgy. 4 Pob. (A.s.suarez East),R80157272
R80195934,Bgy. 5 Pob. (Santiago St.north),R80157272
R80195924,Bgy. 6 Pob. (Santiago St.south),R80157272
R80195943,Bgy. 7 Pob. (San Roque St.south),R80157272
R80195940,Bgy. 8 Pob. (Montano - San Roque),R80157272
R80195926,Bgy. 9 Pob. (Salazar San Jose),R80157272
R80195927,Consolacion,R80157272
R80195928,Igtambo,R80157272
R80195920,San Antonio,R80157272
R80195929,San Jose,R80157272
R80195935,Santa Cruz,R80157272
R80195933,Santa Teresa,R80157272
R80195921,Santo Angel,R80157272
R80195936,Santo Nino,R80157272
R80194188,Aripdip,R4035792
R80194189,Bagacay,R4035792
R80194185,Calaigang,R4035792
R80194190,Ilongbukid,R4035792
R80194186,Poblacion,R4035792
R80194191,Poscolon,R4035792
R80194187,San Andres,R4035792
R80194192,San Dionisio,R4035792
R80194193,San Florentino,R4035792
R80195944,Agusipan,R80157273
R80195953,Agutayan,R80157273
R80195998,Bagumbayan,R80157273
R80195982,Balabag,R80157273
R80195992,Balibagan Este,R80157273
R80195986,Balibagan Oeste,R80157273
R80195957,Ban-Ag,R80157273
R80195993,Bantay,R80157273
R80195999,Barangay Zone I (Pob.),R80157273
R80195972,Barangay Zone Ii (Pob.),R80157273
R80195954,Barangay Zone Iii (Pob.),R80157273
R80195961,Barangay Zone Iv (Pob.),R80157273
R80195947,Barangay Zone V (Pob.),R80157273
R80195973,Barangay Zone VII (Pob.),R80157273
R80196000,Barasan Este,R80157273
R80196002,Barasan Oeste,R80157273
R80195965,Binangkilan,R80157273
R80195974,Bitaog-Taytay,R80157273
R80195966,Bolong Este,R80157273
R80195967,Bolong Oeste,R80157273
R80195994,Buayahon,R80157273
R80195977,Buyo,R80157273
R80195948,Cabugao Norte,R80157273
R80195983,Cabugao Sur,R80157273
R80195978,Cadagmayan Norte,R80157273
R80195962,Cadagmayan Sur,R80157273
R80195949,Cafe,R80157273
R80195968,Calaboa Este,R80157273
R80196001,Calaboa Oeste,R80157273
R80195979,Camambugan,R80157273
R80196003,Canipayan,R80157273
R80195950,Conaynay,R80157273
R80195955,Daga,R80157273
R80195980,Dalid,R80157273
R80195958,Duyanduyan,R80157273
R80195956,Gen. Martin T. Delgado,R80157273
R80195995,Guno,R80157273
R80195984,Inangayan,R80157273
R80195996,Jibao-An,R80157273
R80195989,Lacadon,R80157273
R80195951,Lanag,R80157273
R80195976,Lupa,R80157273
R80195987,Magancina,R80157273
R80195963,Malawog,R80157273
R80195988,Mambuyo,R80157273
R80195990,Manhayang,R80157273
R80195975,Miraga-Guibuangan,R80157273
R80195991,Nasugban,R80157273
R80195945,Omambog,R80157273
R80195952,Pal-Agon,R80157273
R80195970,Pungsod,R80157273
R80195964,Sangcate,R80157273
R80195969,San Sebastian,R80157273
R80195959,Tagsing,R80157273
R80195971,Talanghauan,R80157273
R80195997,Talongadian,R80157273
R80195960,Tigtig,R80157273
R80195985,Tuburan,R80157273
R80195946,Tugas,R80157273
R80195981,Tungay,R80157273
R80195659,Aguirre,R80157265
R80195666,Aldeguer,R80157265
R80195660,Alibayog,R80157265
R80195671,Anoring,R80157265
R80195650,Apelo,R80157265
R80195638,Apologista,R80157265
R80195651,Aposaga,R80157265
R80195675,Arante,R80157265
R80195672,Ardemil,R80157265
R80195643,Aspera,R80157265
R80195644,Aswe-Pabriaga,R80157265
R80195653,Bagaygay,R80157265
R80195645,Bakabak,R80157265
R80195646,Batitao,R80157265
R80195652,Bato,R80157265
R80195676,Castor,R80157265
R80195661,Crespo,R80157265
R80195639,Del Castillo,R80157265
R80195662,Devera,R80157265
R80195677,Domingo,R80157265
R80195663,Ferraris,R80157265
R80195654,Gildore,R80157265
R80195667,Improgo,R80157265
R80195668,Juaneza,R80157265
R80195655,Labigan,R80157265
R80195664,Lanciola,R80157265
R80195647,Latawan,R80157265
R80195648,Malapaya,R80157265
R80195656,Muyco,R80157265
R80195665,Padios,R80157265
R80195649,Pasig,R80157265
R80195657,Poblacion Ilawod,R80157265
R80195640,Poblacion Ilaya,R80157265
R80195641,Poblacion Market,R80157265
R80195669,Posadas,R80157265
R80195678,Preciosa,R80157265
R80195673,Salcedo,R80157265
R80195658,San Luis,R80157265
R80195642,Tady,R80157265
R80195670,Tentay,R80157265
R80195674,Villahermosa,R80157265
R80195679,Zerrudo,R80157265
R80195689,Alupidian,R80157266
R80195701,Atabayan,R80157266
R80195680,Bagacay,R80157266
R80195710,Baguingin,R80157266
R80195690,Bagumbayan,R80157266
R80195702,Bangkal,R80157266
R80195703,Bantud,R80157266
R80195727,Barangay 1 (Pob.),R80157266
R80195719,Barangay 2 (Pob.),R80157266
R80195681,Barangay 3 (Pob.),R80157266
R80195720,Barangay 4 (Pob.),R80157266
R80195711,Barangay 5 (Pob.),R80157266
R80195712,Barangay 6 (Pob.),R80157266
R80195704,Barangay 7 (Pob.),R80157266
R80195705,Barangay 8 (Pob.),R80157266
R80195713,Barangay 9 (Pob.),R80157266
R80195721,Barosong,R80157266
R80195682,Barroc,R80157266
R80195686,Bayuco,R80157266
R80195714,Binaliuan Mayor,R80157266
R80195715,Binaliuan Menor,R80157266
R80195708,Bitas,R80157266
R80195687,Buenavista,R80157266
R80195728,Bugasongan,R80157266
R80195691,Buyu-An,R80157266
R80195692,Canabuan,R80157266
R80195722,Cansilayan,R80157266
R80195729,Cordova Norte,R80157266
R80195683,Cordova Sur,R80157266
R80195723,Danao,R80157266
R80195709,Dapdap,R80157266
R80195695,Dorong-An,R80157266
R80195696,Guisian,R80157266
R80195724,Isauan,R80157266
R80195717,Isian,R80157266
R80195706,Jamog,R80157266
R80195718,Lanag,R80157266
R80195684,Linobayan,R80157266
R80195725,Lubog,R80157266
R80195699,Nagba,R80157266
R80195697,Namocon,R80157266
R80195693,Napnapan Norte,R80157266
R80195685,Napnapan Sur,R80157266
R80195716,Olo Barroc,R80157266
R80195694,Parara Norte,R80157266
R80195730,Parara Sur,R80157266
R80195700,San Rafael,R80157266
R80195726,Sermon,R80157266
R80195707,Sipitan,R80157266
R80195688,Supa,R80157266
R80195731,Tan Pael,R80157266
R80195698,Taro,R80157266
R80194235,Adgao,R80157244
R80194207,Ago,R80157244
R80194236,Ambarihon,R80157244
R80194213,Ayubo,R80157244
R80194223,Bacan,R80157244
R80194224,Badiang,R80157244
R80194229,Bagunanay,R80157244
R80194195,Balicua,R80157244
R80194208,Bantayanan,R80157244
R80194214,Batga,R80157244
R80194209,Bato,R80157244
R80194225,Bikil,R80157244
R80194237,Boloc,R80157244
R80194196,Bondoc,R80157244
R80194226,Borong,R80157244
R80194227,Buenavista,R80157244
R80194210,Cadabdab,R80157244
R80194197,Daga-Ay,R80157244
R80194198,Desposorio,R80157244
R80194211,Igdampog Norte,R80157244
R80194230,Igdampog Sur,R80157244
R80194201,Igpaho,R80157244
R80194199,Igtuble,R80157244
R80194215,Ingay,R80157244
R80194202,Isauan,R80157244
R80194219,Jolason,R80157244
R80194231,Jona,R80157244
R80194203,La-Ag,R80157244
R80194204,Lanag Norte,R80157244
R80194228,Lanag Sur,R80157244
R80194216,Male,R80157244
R80194217,Mayang,R80157244
R80194205,Molina,R80157244
R80194238,Morcillas,R80157244
R80194239,Nagba,R80157244
R80194240,Navillan,R80157244
R80194232,Pinamacalan,R80157244
R80194212,San Jose,R80157244
R80194233,Sibucauan,R80157244
R80194221,Singon,R80157244
R80194206,Tabat,R80157244
R80194234,Tagpu-An,R80157244
R80194241,Talento,R80157244
R80194200,Teniente Benito,R80157244
R80194194,Victoria,R80157244
R80194218,Zone I (Pob.),R80157244
R80194222,Zone Ii (Pob.),R80157244
R80194220,Zone Iii (Pob.),R80157244
R80195732,Balud I,R3492694
R80195746,Balud Ii,R3492694
R80195738,Balud Lilo-An,R3492694
R80195753,Dawis Centro,R3492694
R80195747,Dawis Norte,R3492694
R80195748,Dawis Sur,R3492694
R80195754,Gines,R3492694
R80195741,Ilawod Poblacion,R3492694
R80195733,Ilaya Poblacion,R3492694
R80195755,Inagdangan Centro,R3492694
R80195742,Inagdangan Norte,R3492694
R80195739,Inagdangan Sur,R3492694
R80195734,Jalaud Norte,R3492694
R80195743,Jalaud Sur,R3492694
R80195740,Libongcogon,R3492694
R80195744,Malunang,R3492694
R80195735,Pajo,R3492694
R80195751,Sambag,R3492694
R80195752,Sigangao,R3492694
R80195745,Talauguis,R3492694
R80195749,Talibong,R3492694
R80195736,Tubigan,R3492694
R80195750,Tuburan,R3492694
R80195737,Tuburan Sulbod,R3492694