id,name,parentId
R80175395,Bayo Grande,R3279590
R80175390,Bayo Pequeno,R3279590
R80175391,Butuan,R3279590
R80175392,Casay,R3279590
R80175384,Casay Viejo,R3279590
R80175393,Iba,R3279590
R80175402,Igbarabatuan,R3279590
R80175380,Igpalge,R3279590
R80175385,Igtumarom,R3279590
R80175386,Lisub A,R3279590
R80175387,Lisub B,R3279590
R80175396,Mabuyong,R3279590
R80175381,Magdalena,R3279590
R80175382,Nasuli C,R3279590
R80175397,Nato,R3279590
R80175388,Poblacion,R3279590
R80175389,Sagua,R3279590
R80175394,Salvacion,R3279590
R80175383,San Francisco,R3279590
R80175398,San Ramon,R3279590
R80175399,San Roque,R3279590
R80175400,Tagaytay,R3279590
R80175401,Talisayan,R3279590
R80175514,Baghari,R3279591
R80175515,Bahuyan,R3279591
R80175522,Beri,R3279591
R80175505,Biga-A,R3279591
R80175495,Binangbang,R3279591
R80175510,Binangbang Centro,R3279591
R80175500,Binanu-An,R3279591
R80175501,Cadiao,R3279591
R80175517,Calapadan,R3279591
R80175518,Capoyuan,R3279591
R80175511,Cubay,R3279591
R80175519,Embrangga-An,R3279591
R80175527,Esparar,R3279591
R80175528,Gua,R3279591
R80175512,Idao,R3279591
R80175506,Igpalge,R3279591
R80175529,Igtunarum,R3279591
R80175523,Integasan,R3279591
R80175524,Ipil,R3279591
R80175530,Jinalinan,R3279591
R80175507,Lanas,R3279591
R80175502,Langcaon (Evelio Javier),R3279591
R80175496,Lisub,R3279591
R80175520,Lombuyan,R3279591
R80175497,Mablad,R3279591
R80175503,Magtulis,R3279591
R80175525,Marigne,R3279591
R80175498,Mayabay,R3279591
R80175526,Mayos,R3279591
R80175499,Nalusdan,R3279591
R80175521,Narirong,R3279591
R80175493,Palma,R3279591
R80175508,Poblacion,R3279591
R80175531,San Antonio,R3279591
R80175509,San Ramon,R3279591
R80175513,Soligao,R3279591
R80175494,Tabongtabong,R3279591
R80175504,Tig-Alaran,R3279591
R80175516,Yapo,R3279591
R80175110,Borocboroc,R3279592
R80175104,Buenavista,R3279592
R80175111,Concepcion,R3279592
R80175112,Delima,R3279592
R80175113,Ipil,R3279592
R80175105,Maradiona,R3279592
R80175114,Mojon,R3279592
R80175106,Poblacion,R3279592
R80175107,Rombang,R3279592
R80175108,Salvacion,R3279592
R80175109,Sinaja,R3279592
R80175280,Anilawan,R3279593
R80175262,Arangote,R3279593
R80175257,Bagtason,R3279593
R80175268,Camangahan,R3279593
R80175274,Centro Ilawod (Pob.),R3279593
R80175258,Centro Ilaya (Pob.),R3279593
R80175277,Centro Pojo (Pob.),R3279593
R80175260,Cubay North,R3279593
R80175278,Cubay South,R3279593
R80175270,Guija,R3279593
R80175281,Igbalangao,R3279593
R80175269,Igsoro,R3279593
R80175264,Ilaures,R3279593
R80175265,Jinalinan,R3279593
R80175263,Lacayon,R3279593
R80175266,Maray,R3279593
R80175255,Paliwan,R3279593
R80175261,Pangalcagan,R3279593
R80175256,Sabang East,R3279593
R80175275,Sabang West,R3279593
R80175272,Tagudtud North,R3279593
R80175273,Tagudtud South,R3279593
R80175276,Talisay,R3279593
R80175279,Tica,R3279593
R80175259,Tono-An,R3279593
R80175271,Yapu,R3279593
R80175267,Zaragoza,R3279593
R80175124,Alojipan,R3279625
R80175154,Bagacay,R3279625
R80175155,Balac-Balac,R3279625
R80175144,Batbatan Island,R3279625
R80175131,Batonan Norte,R3279625
R80175132,Batonan Sur,R3279625
R80175156,Bita,R3279625
R80175145,Bitadton Norte,R3279625
R80175125,Bitadton Sur,R3279625
R80175146,Buenavista,R3279625
R80175147,Buhi,R3279625
R80175126,Camancijan,R3279625
R80175140,Caridad,R3279625
R80175127,Carit-An,R3279625
R80175116,Centro Norte (Pob.),R3279625
R80175141,Centro Poblacion,R3279625
R80175120,Centro Sur (Pob.),R3279625
R80175135,Condes,R3279625
R80175157,Esperanza,R3279625
R80175136,Fe,R3279625
R80175121,Flores,R3279625
R80175150,Jalandoni,R3279625
R80175117,Janlagasi,R3279625
R80175151,Lamputong,R3279625
R80175122,Lipata,R3279625
R80175133,Magsaysay (Balua),R3279625
R80175152,Malacanang,R3279625
R80175142,Malalison Island,R3279625
R80175118,Maniguin,R3279625
R80175134,Naba,R3279625
R80175129,Osorio,R3279625
R80175143,Paningayan,R3279625
R80175123,Salde,R3279625
R80175153,San Antonio,R3279625
R80175148,San Gregorio,R3279625
R80175130,San Juan,R3279625
R80175137,San Luis,R3279625
R80175138,San Pascual,R3279625
R80175158,San Vicente,R3279625
R80175119,Simbola,R3279625
R80175128,Tigbobolo,R3279625
R80175115,Tinabusan,R3279625
R80175139,Tomao,R3279625
R80175149,Valderama,R3279625
R80175189,Apdo,R3279595
R80175194,Asluman,R3279595
R80175162,Banawon,R3279595
R80175184,Bia-An,R3279595
R80175185,Bongbongan Iii,R3279595
R80175202,Bongbongan I-II,R3279595
R80175186,Botbot,R3279595
R80175199,Budbudan,R3279595
R80175170,Buhang,R3279595
R80175163,Calacja I,R3279595
R80175200,Calacja Ii,R3279595
R80175195,Calala,R3279595
R80175164,Cantulan,R3279595
R80175187,Caridad,R3279595
R80175196,Caromangay,R3279595
R80175188,Casalngan,R3279595
R80175165,Dangcalan,R3279595
R80175178,Del Pilar,R3279595
R80175166,Fabrica,R3279595
R80175179,Funda,R3279595
R80175180,General Fullon (Tina),R3279595
R80175190,Gov. Evelio B. Javier (Lanag),R3279595
R80175159,Guintas,R3279595
R80175171,Igbical,R3279595
R80175183,Igbucagay,R3279595
R80175181,Inabasan,R3279595
R80175182,Ingwan-Batangan,R3279595
R80175160,La Paz,R3279595
R80175175,Linaban,R3279595
R80175191,Malandog,R3279595
R80175176,Mapatag,R3279595
R80175177,Masanag,R3279595
R80175203,Nalihawan,R3279595
R80175204,Pamandayan (Botbot),R3279595
R80175172,Pasu-Jungao,R3279595
R80175197,Piape I,R3279595
R80175192,Piape Ii,R3279595
R80175198,Piape Iii,R3279595
R80175161,Pili 1 2 3,R3279595
R80175167,Poblacion 1,R3279595
R80175201,Poblacion 2,R3279595
R80175205,Poblacion 3,R3279595
R80175168,Poblacion 4,R3279595
R80175169,Poblacion 5,R3279595
R80175173,Pu-Ao,R3279595
R80175174,Suloc,R3279595
R80175193,Villavert-Jimenez,R3279595
R80175562,Bagongbayan,R3279596
R80175563,Banban,R3279596
R80175547,Bongbongan,R3279596
R80175533,Cabariwan,R3279596
R80175556,Cadajug,R3279596
R80175548,Canituan,R3279596
R80175557,Capnayan,R3279596
R80175546,Casit-An,R3279596
R80175570,Guiamon,R3279596
R80175541,Guinbanga-An,R3279596
R80175558,Guisijan,R3279596
R80175571,Igtadiao,R3279596
R80175542,Intao,R3279596
R80175535,Jaguikican,R3279596
R80175550,Jinalinan,R3279596
R80175568,Lactudan,R3279596
R80175559,Latazon,R3279596
R80175536,Laua-An,R3279596
R80175554,Liberato,R3279596
R80175551,Lindero,R3279596
R80175569,Liya-Liya,R3279596
R80175537,Loon,R3279596
R80175560,Lugta,R3279596
R80175561,Lupa-An,R3279596
R80175555,Magyapo,R3279596
R80175564,Maria,R3279596
R80175534,Mauno,R3279596
R80175538,Maybunga,R3279596
R80175539,Necesito (Paniatan),R3279596
R80175540,Oloc,R3279596
R80175552,Omlot,R3279596
R80175565,Pandanan,R3279596
R80175544,Paningayan,R3279596
R80175545,Pascuala,R3279596
R80175566,Poblacion (Centro),R3279596
R80175553,San Ramon,R3279596
R80175549,Santiago,R3279596
R80175567,Tibacan,R3279596
R80175532,Tigunhao,R3279596
R80175543,Virginia,R3279596
R80175291,Barusbus,R3484402
R80175286,Bulanao,R3484402
R80175287,Centro Este (Pob.),R3484402
R80175292,Centro Weste (Pob.),R3484402
R80175293,Codiong,R3484402
R80175282,Cubay,R3484402
R80175283,Igcagay,R3484402
R80175297,Inyawan,R3484402
R80175298,Lindero,R3484402
R80175294,Maramig,R3484402
R80175284,Pajo,R3484402
R80175288,Panangkilon,R3484402
R80175295,Paz,R3484402
R80175296,Pucio,R3484402
R80175289,San Roque,R3484402
R80175299,Taboc,R3484402
R80175285,Tinigbas,R3484402
R80175300,Tinindugan,R3484402
R80175290,Union,R3484402
R80175316,Aracay,R3279626
R80175317,Badiangan,R3279626
R80175302,Bagumbayan,R3279626
R80175318,Baybay,R3279626
R80175306,Botbot,R3279626
R80175319,Buang,R3279626
R80175326,Cabugao,R3279626
R80175312,Candari,R3279626
R80175303,Carmen,R3279626
R80175329,Centro Norte (Pob.),R3279626
R80175304,Centro Sur (Pob.),R3279626
R80175305,Dionela,R3279626
R80175324,Dumrog,R3279626
R80175333,Duyong,R3279626
R80175313,Fragante,R3279626
R80175330,Guia,R3279626
R80175314,Idiacacan,R3279626
R80175315,Jinalinan,R3279626
R80175331,Luhod-Bayang,R3279626
R80175309,Maadios,R3279626
R80175327,Mag-Aba,R3279626
R80175325,Napuid,R3279626
R80175301,Nauring,R3279626
R80175310,Patria,R3279626
R80175311,Perfecta,R3279626
R80175328,San Andres,R3279626
R80175320,San Joaquin,R3279626
R80175334,Santa Ana,R3279626
R80175321,Santa Cruz,R3279626
R80175322,Santa Fe,R3279626
R80175332,Santo Rosario,R3279626
R80175323,Talisay,R3279626
R80175307,Tingib,R3279626
R80175308,Zaldivar,R3279626
R80175591,Alvaniz,R3279597
R80175582,Amparo,R3279597
R80175592,Apgahan,R3279597
R80175572,Aureliana,R3279597
R80175577,Badiangan,R3279597
R80175593,Bernaldo A. Julagting (Bitas),R3279597
R80175605,Carit-An,R3279597
R80175573,Cuyapiao,R3279597
R80175594,Gella,R3279597
R80175599,Igbarawan,R3279597
R80175584,Igbobon,R3279597
R80175595,Igburi,R3279597
R80175596,La Rioja,R3279597
R80175578,Mabasa,R3279597
R80175600,Macarina,R3279597
R80175601,Magarang,R3279597
R80175574,Magsaysay,R3279597
R80175589,Padang,R3279597
R80175590,Pandanan,R3279597
R80175585,Patlabawon,R3279597
R80175604,Poblacion,R3279597
R80175581,Quezon,R3279597
R80175602,Salaguiawan,R3279597
R80175606,Samalague,R3279597
R80175583,San Rafael,R3279597
R80175586,Tamayoc,R3279597
R80175579,Tigbalogo,R3279597
R80175603,Tobias Fornier,R3279597
R80175575,Villa Crespo,R3279597
R80175597,Villa Cruz,R3279597
R80175587,Villa Elio,R3279597
R80175576,Villa Flores,R3279597
R80175588,Villa Laua-An,R3279597
R80175598,Villa Sal,R3279597
R80175580,Villa Salomon,R3279597
R80175607,Vista Alegre,R3279597
R80175214,Atabay,R3279598
R80175217,Badiang,R3279598
R80175215,Barangay 1 (Pob.),R3279598
R80175225,Barangay 2 (Pob.),R3279598
R80175231,Barangay 3 (Pob.),R3279598
R80175222,Barangay 4 (Pob.),R3279598
R80175208,Barangay 5 (Pob.),R3279598
R80175209,Barangay 6 (Pob.),R3279598
R80175223,Barangay 7 (Pob.),R3279598
R80175218,Barangay 8 (Pob.),R3279598
R80175210,Bariri,R3279598
R80175224,Bugarot (Catungan-Bugarot),R3279598
R80175220,Cansadan (Cansadan-Tubudan),R3279598
R80175221,Durog,R3279598
R80175212,Funda-Dalipe,R3279598
R80175226,Igbonglo,R3279598
R80175233,Inabasan,R3279598
R80175213,Madrangca,R3279598
R80175228,Magcalon,R3279598
R80175211,Malaiba,R3279598
R80175206,Maybato Norte,R3279598
R80175229,Maybato Sur,R3279598
R80175230,Mojon,R3279598
R80175207,Pantao,R3279598
R80175227,San Angel,R3279598
R80175232,San Fernando,R3279598
R80175219,San Pedro,R3279598
R80175216,Supa,R3279598
R80175340,Agricula,R3279627
R80175353,Alegria,R3279627
R80175361,Aningalan,R3279627
R80175347,Atabay,R3279627
R80175362,Bagumbayan,R3279627
R80175363,Baladjay,R3279627
R80175364,Banbanan,R3279627
R80175365,Barangbang,R3279627
R80175368,Bawang,R3279627
R80175337,Bugo,R3279627
R80175374,Bulan-Bulan,R3279627
R80175375,Cabiawan,R3279627
R80175376,Cabunga-An,R3279627
R80175338,Cadolonan,R3279627
R80175354,Carawisan I,R3279627
R80175348,Carawisan Ii,R3279627
R80175349,Carmelo I,R3279627
R80175341,Carmelo Ii,R3279627
R80175369,General Fullon,R3279627
R80175366,General Luna,R3279627
R80175359,Iguirindon,R3279627
R80175377,Insubuan,R3279627
R80175370,Lapak,R3279627
R80175342,La Union,R3279627
R80175350,Lumpatan,R3279627
R80175360,Magdalena,R3279627
R80175355,Maragubdub,R3279627
R80175351,Nagbangi I (Amatong),R3279627
R80175356,Nagbangi Ii,R3279627
R80175352,Nasuli,R3279627
R80175335,Orquia (Igcatumbal),R3279627
R80175357,Osorio I,R3279627
R80175339,Osorio Ii,R3279627
R80175345,Panpanan I,R3279627
R80175367,Panpanan Ii,R3279627
R80175358,Poblacion (Calag-Itan),R3279627
R80175378,Ramon Magsaysay,R3279627
R80175371,Rizal,R3279627
R80175343,San Rafael,R3279627
R80175379,Sinundolan,R3279627
R80175372,Sumaray,R3279627
R80175373,Trinidad,R3279627
R80175336,Tubudan,R3279627
R80175344,Vilvar,R3279627
R80175346,Walker,R3279627
R80175616,Abiera,R3279628
R80175609,Aguila,R3279628
R80175617,Alegre,R3279628
R80175611,Aras-Asan,R3279628
R80175612,Bacalan,R3279628
R80175610,Callan,R3279628
R80175613,Idio,R3279628
R80175608,Nauhon,R3279628
R80175614,P. Javier,R3279628
R80175615,Poblacion,R3279628
R80175684,Alangan,R3279599
R80175636,Bari,R3279599
R80175685,Biga-A,R3279599
R80175686,Bongbongan I,R3279599
R80175670,Bongbongan Ii,R3279599
R80175659,Bongsod,R3279599
R80175660,Bontol,R3279599
R80175677,Bugnay,R3279599
R80175633,Bulalacao,R3279599
R80175690,Cabanbanan,R3279599
R80175691,Cabariuan,R3279599
R80175692,Cabladan,R3279599
R80175661,Cadoldolan,R3279599
R80175634,Calog,R3279599
R80175642,Calo-Oy,R3279599
R80175665,Catmon,R3279599
R80175643,Catungan I,R3279599
R80175673,Catungan Ii,R3279599
R80175635,Catungan Iii,R3279599
R80175678,Catungan Iv,R3279599
R80175651,Cubay-Napultan,R3279599
R80175652,Cubay-Sermon,R3279599
R80175679,District I (Pob.),R3279599
R80175674,District Ii (Pob.),R3279599
R80175656,District Iii (Pob.),R3279599
R80175630,District Iv (Pob.),R3279599
R80175620,Egana,R3279599
R80175644,Esperanza I,R3279599
R80175680,Esperanza Ii,R3279599
R80175653,Esperanza Iii,R3279599
R80175621,Igcococ,R3279599
R80175666,Igdagmay,R3279599
R80175625,Igdalaquit,R3279599
R80175671,Iglanot,R3279599
R80175646,Igpanolong,R3279599
R80175675,Igparas,R3279599
R80175622,Igsuming,R3279599
R80175672,Ilabas,R3279599
R80175638,Imparayan,R3279599
R80175687,Inabasan,R3279599
R80175681,Indag-An,R3279599
R80175626,Initan,R3279599
R80175627,Insarayan,R3279599
R80175645,Lacaron,R3279599
R80175618,Lagdo,R3279599
R80175657,Lambayagan,R3279599
R80175647,Luna,R3279599
R80175623,Luyang,R3279599
R80175667,Maasin,R3279599
R80175648,Mabini,R3279599
R80175631,Millamena,R3279599
R80175649,Mojon,R3279599
R80175624,Nagdayao,R3279599
R80175632,Nazareth,R3279599
R80175639,Odiong,R3279599
R80175640,Olaga,R3279599
R80175628,Pangpang,R3279599
R80175676,Panlagangan,R3279599
R80175662,Pantao,R3279599
R80175650,Pasong,R3279599
R80175688,Pis-Anan,R3279599
R80175668,Rombang,R3279599
R80175619,Salvacion,R3279599
R80175669,San Juan,R3279599
R80175658,Sido,R3279599
R80175682,Solong,R3279599
R80175629,Tabongtabong,R3279599
R80175654,Tigbalua I,R3279599
R80175663,Tigbalua Ii,R3279599
R80175664,Tig-Ohot,R3279599
R80175683,Tordesillas,R3279599
R80175637,Tulatula,R3279599
R80175689,Valentin Grasparil (Bad-As),R3279599
R80175693,Villafont,R3279599
R80175641,Villahermosa,R3279599
R80175655,Villar,R3279599
R80175254,Alegre,R3279600
R80175247,Amar,R3279600
R80175239,Bandoja (Lupa-An),R3279600
R80175240,Castillo,R3279600
R80175251,Esparagoza,R3279600
R80175241,Importante,R3279600
R80175234,La Paz,R3279600
R80175242,Malabor,R3279600
R80175235,Martinez,R3279600
R80175236,Natividad,R3279600
R80175252,Pitac,R3279600
R80175237,Poblacion,R3279600
R80175253,Salazar,R3279600
R80175250,San Francisco Norte,R3279600
R80175243,San Francisco Sur,R3279600
R80175238,San Isidro,R3279600
R80175244,Santa Ana,R3279600
R80175248,Santa Justa,R3279600
R80175249,Santo Rosario,R3279600
R80175245,Tigbaboy,R3279600
R80175246,Tuno,R3279600
R80175444,Abaca,R3279594
R80175465,Aras-Asan,R3279594
R80175445,Arobo,R3279594
R80175423,Atabay,R3279594
R80175466,Atiotes,R3279594
R80175470,Bagumbayan,R3279594
R80175468,Balloscas,R3279594
R80175424,Balud,R3279594
R80175469,Barasanan A,R3279594
R80175446,Barasanan B,R3279594
R80175456,Barasanan C,R3279594
R80175448,Bariri,R3279594
R80175438,Camandagan,R3279594
R80175447,Cato-Ogan,R3279594
R80175440,Danawan,R3279594
R80175429,Diclum,R3279594
R80175451,Fatima,R3279594
R80175467,Gamad (Igdamacio),R3279594
R80175425,Igbalogo,R3279594
R80175460,Igbangcal-A,R3279594
R80175457,Igbangcal-B,R3279594
R80175437,Igbangcal-C,R3279594
R80175421,Igcabuad,R3279594
R80175452,Igcadac,R3279594
R80175461,Igcado,R3279594
R80175430,Igcalawagan,R3279594
R80175426,Igcapuyas,R3279594
R80175431,Igcasicad (San Pedro),R3279594
R80175462,Igdalaguit,R3279594
R80175463,Igdanlog,R3279594
R80175459,Igdurarog,R3279594
R80175432,Igtugas,R3279594
R80175453,Lawigan,R3279594
R80175441,Lindero,R3279594
R80175442,Manaling (Cata-An),R3279594
R80175427,Masayo,R3279594
R80175422,Nagsubuan,R3279594
R80175454,Nasuli-A (San Ramon),R3279594
R80175433,Opsan (San Jose),R3279594
R80175434,Paciencia,R3279594
R80175464,Poblacion Norte,R3279594
R80175435,Poblacion Sur,R3279594
R80175436,Portillo,R3279594
R80175449,Quezon,R3279594
R80175428,Salamague (Santa Maria),R3279594
R80175455,Santo Tomas,R3279594
R80175439,Tacbuyan,R3279594
R80175450,Tene,R3279594
R80175443,Villaflor,R3279594
R80175458,Ysulat,R3279594
R80175480,Alon,R3646143
R80175486,Bakiang,R3646143
R80175474,Binanogan,R3646143
R80175475,Borocboroc,R3646143
R80175481,Bugnay,R3646143
R80175482,Buluangan I,R3646143
R80175483,Buluangan Ii,R3646143
R80175487,Bunsod,R3646143
R80175488,Busog,R3646143
R80175484,Cananghan,R3646143
R80175476,Canipayan,R3646143
R80175485,Cansilayan,R3646143
R80175477,Culyat,R3646143
R80175489,Iglinab,R3646143
R80175490,Igmasandig,R3646143
R80175478,Lublub,R3646143
R80175491,Manlacbo,R3646143
R80175471,Pandanan,R3646143
R80175492,San Agustin,R3646143
R80175479,Takas (Pob.),R3646143
R80175472,Tigmamale,R3646143
R80175473,Ubos (Pob.),R3646143