{
  "type": "object",
  "properties": {
    "id": { "type": "string" },
    "title": { "type": "string" },
    "chart": {
      "type": "object", 
      "properties": {
        "type": { "type": "string" },
        "series": {
          "type": "array",
          "items": [
            {
              "type": "object",
              "properties": {
                "id": { "type": "string" },
                "title": { "type": "string" }
              },
              "additionalProperties": false
            }
          ]
        }
      },
      "additionalProperties": false
    }
  },
  "additionalProperties": false
}
