{
  "version": 1,
  "notes": "",
  "documentation": "\"This file is a QMK Configurator export. You can import this at <https://config.qmk.fm>. It can also be used directly with QMK's source code.\n\nTo setup your QMK environment check out the tutorial: <https://docs.qmk.fm/#/newbs>\n\nYou can convert this file to a keymap.c using this command: `qmk json2c {keymap}`\n\nYou can compile this keymap using this command: `qmk compile {keymap}`\"\n",
  "keyboard": "sofle/rev1",
  "keymap": "keno",
  "layout": "LAYOUT",
  "layers": [
    [
      "KC_F12",
      "KC_F1",
      "KC_F2",
      "KC_F3",
      "KC_F4",
      "KC_F5",
      "KC_F6",
      "KC_F7",
      "KC_F8",
      "KC_F9",
      "KC_F10",
      "KC_F11",
      "KC_ESC",
      "KC_Q",
      "KC_W",
      "KC_E",
      "KC_R",
      "KC_T",
      "KC_Y",
      "KC_U",
      "KC_I",
      "KC_O",
      "KC_P",
      "KC_BSPC",
      "KC_TAB",
      "KC_A",
      "KC_S",
      "KC_D",
      "KC_F",
      "KC_G",
      "KC_H",
      "KC_J",
      "KC_K",
      "KC_L",
      "KC_SCLN",
      "KC_QUOT",
      "KC_LSFT",
      "KC_Z",
      "KC_X",
      "KC_C",
      "KC_V",
      "KC_B",
      "KC_MUTE",
      "KC_NO",
      "KC_N",
      "KC_M",
      "KC_COMM",
      "KC_DOT",
      "KC_SLSH",
      "KC_RSFT",
      "KC_LALT",
      "KC_LGUI",
      "KC_LCTL",
      "MO(2)",
      "KC_ENT",
      "KC_SPC",
      "MO(3)",
      "RCTL(KC_RALT)",
      "KC_RALT",
      "KC_RCTL"
    ],
    [
      "KC_F12",
      "KC_F1",
      "KC_F2",
      "KC_F3",
      "KC_F4",
      "KC_F5",
      "KC_F6",
      "KC_F7",
      "KC_F8",
      "KC_F9",
      "KC_F10",
      "KC_F11",
      "KC_ESC",
      "KC_Q",
      "KC_W",
      "KC_F",
      "KC_P",
      "KC_G",
      "KC_J",
      "KC_L",
      "KC_U",
      "KC_Y",
      "KC_SCLN",
      "KC_BSPC",
      "KC_TAB",
      "KC_A",
      "KC_R",
      "KC_S",
      "KC_T",
      "KC_D",
      "KC_H",
      "KC_N",
      "KC_E",
      "KC_I",
      "KC_O",
      "KC_QUOT",
      "KC_LSFT",
      "KC_Z",
      "KC_X",
      "KC_C",
      "KC_V",
      "KC_B",
      "KC_MUTE",
      "KC_NO",
      "KC_K",
      "KC_M",
      "KC_COMM",
      "KC_DOT",
      "KC_SLSH",
      "KC_RSFT",
      "KC_LALT",
      "KC_LGUI",
      "KC_LCTL",
      "MO(2)",
      "KC_ENT",
      "KC_SPC",
      "MO(3)",
      "RCTL(KC_RALT)",
      "KC_RALT",
      "KC_RCTL"
    ],
    [
      "KC_F12",
      "KC_F1",
      "KC_F2",
      "KC_F3",
      "KC_F4",
      "KC_F5",
      "KC_F6",
      "KC_F7",
      "KC_F8",
      "KC_F9",
      "KC_F10",
      "KC_F11",
      "KC_GRV",
      "KC_1",
      "KC_2",
      "KC_3",
      "KC_4",
      "KC_5",
      "KC_6",
      "KC_7",
      "KC_8",
      "KC_9",
      "KC_0",
      "KC_BSPC",
      "KC_CIRC",
      "KC_UNDS",
      "KC_MINS",
      "KC_PLUS",
      "KC_EQL",
      "KC_PERC",
      "KC_EXLM",
      "KC_AMPR",
      "KC_ASTR",
      "KC_LPRN",
      "KC_RPRN",
      "KC_PIPE",
      "KC_LSFT",
      "KC_DLR",
      "KC_AT",
      "KC_HASH",
      "KC_LCBR",
      "KC_LBRC",
      "KC_TRNS",
      "KC_TRNS",
      "KC_RBRC",
      "KC_RCBR",
      "KC_LT",
      "KC_GT",
      "KC_BSLS",
      "KC_RSFT",
      "KC_LALT",
      "KC_LGUI",
      "KC_LCTL",
      "KC_TRNS",
      "KC_ENT",
      "KC_SPC",
      "KC_TRNS",
      "RCTL(KC_RALT)",
      "KC_RALT",
      "KC_RCTL"
    ],
    [
      "KC_F12",
      "KC_F1",
      "KC_F2",
      "KC_F3",
      "KC_F4",
      "KC_F5",
      "KC_F6",
      "KC_F7",
      "KC_F8",
      "KC_F9",
      "KC_F10",
      "KC_F11",
      "KC_ESC",
      "KC_INS",
      "KC_PSCR",
      "KC_APP",
      "KC_NO",
      "KC_NO",
      "KC_PGUP",
      "LCTL(KC_LEFT)",
      "KC_UP",
      "LCTL(KC_RGHT)",
      "LCTL(KC_BSPC)",
      "KC_BSPC",
      "KC_ESC",
      "KC_LALT",
      "KC_LCTL",
      "KC_LSFT",
      "KC_NO",
      "KC_NO",
      "KC_PGDN",
      "KC_LEFT",
      "KC_DOWN",
      "KC_RGHT",
      "KC_DEL",
      "LCTL(KC_DEL)",
      "KC_LSFT",
      "LCTL(KC_Z)",
      "LCTL(KC_X)",
      "LCTL(KC_C)",
      "LCTL(KC_V)",
      "LCTL(KC_Y)",
      "KC_TRNS",
      "KC_TRNS",
      "KC_NO",
      "KC_HOME",
      "KC_NO",
      "KC_END",
      "KC_NO",
      "KC_RSFT",
      "KC_LALT",
      "KC_LGUI",
      "KC_LCTL",
      "KC_TRNS",
      "KC_ENT",
      "KC_SPC",
      "KC_TRNS",
      "RCTL(KC_RALT)",
      "KC_RALT",
      "KC_RCTL"
    ],
    [
      "KC_NO",
      "KC_NO",
      "KC_NO",
      "KC_NO",
      "KC_NO",
      "KC_NO",
      "KC_NO",
      "KC_NO",
      "KC_NO",
      "KC_NO",
      "KC_NO",
      "KC_NO",
      "QK_BOOT",
      "KC_NO",
      "DF(0)",
      "DF(1)",
      "ANY(CG_TOGG)",
      "KC_NO",
      "KC_NO",
      "KC_NO",
      "KC_UP",
      "KC_NO",
      "KC_NO",
      "KC_NO",
      "KC_NO",
      "KC_NO",
      "ANY(CG_TOGG)",
      "KC_NO",
      "KC_NO",
      "KC_NO",
      "KC_NO",
      "KC_NO",
      "KC_DOWN",
      "KC_NO",
      "KC_NO",
      "KC_NO",
      "KC_NO",
      "KC_NO",
      "KC_NO",
      "KC_NO",
      "KC_NO",
      "KC_NO",
      "KC_NO",
      "KC_NO",
      "KC_NO",
      "KC_MPRV",
      "KC_MPLY",
      "KC_MNXT",
      "KC_NO",
      "KC_NO",
      "KC_TRNS",
      "KC_TRNS",
      "KC_TRNS",
      "KC_TRNS",
      "KC_TRNS",
      "KC_TRNS",
      "KC_TRNS",
      "KC_TRNS",
      "KC_TRNS",
      "KC_TRNS"
    ]
  ],
  "author": ""
}