@startuml

[*] --> HungUp

HungUp : No tone
HungUp --> PickedUp : Cradle up
HungUp --> GettingCall : Received number

PickedUp : Play free tone
PickedUp --> HungUp : Cradle down
PickedUp --> GotNumber : Number dialed

GotNumber : Read Number
GotNumber : Play number tone
GotNumber --> Dialing : after 100ms

Dialing : No tone
Dialing --> GotNumber : Number dialed
Dialing --> SendNumber : Dailing finished

GettingCall --> Ring : Number correct

Ring : Ring bell
Ring --> Speaking : Cradle up

SendNumber --> Speaking : Number correct received

Speaking : Capture and send audio
Speaking : Receive and play audio
Speaking --> HungUp : Cradle down

@enduml