{
  "formatVersion": 1,
  "database": {
    "version": 7,
    "identityHash": "859a8fd653758c424ba2cabd6c60b0fa",
    "entities": [
      {
        "tableName": "contacts",
        "createSql": "CREATE TABLE IF NOT EXISTS `${TABLE_NAME}` (`id` INTEGER PRIMARY KEY AUTOINCREMENT, `name` TEXT NOT NULL, `mode` REAL NOT NULL)",
        "fields": [
          {
            "fieldPath": "id",
            "columnName": "id",
            "affinity": "INTEGER",
            "notNull": false
          },
          {
            "fieldPath": "name",
            "columnName": "name",
            "affinity": "TEXT",
            "notNull": true
          },
          {
            "fieldPath": "mode",
            "columnName": "mode",
            "affinity": "REAL",
            "notNull": true
          }
        ],
        "primaryKey": {
          "columnNames": [
            "id"
          ],
          "autoGenerate": true
        },
        "indices": [],
        "foreignKeys": []
      },
      {
        "tableName": "messages",
        "createSql": "CREATE TABLE IF NOT EXISTS `${TABLE_NAME}` (`id` INTEGER PRIMARY KEY AUTOINCREMENT, `content` TEXT NOT NULL, `date` INTEGER NOT NULL, `contactId` INTEGER NOT NULL, `isItMe` INTEGER NOT NULL)",
        "fields": [
          {
            "fieldPath": "id",
            "columnName": "id",
            "affinity": "INTEGER",
            "notNull": false
          },
          {
            "fieldPath": "content",
            "columnName": "content",
            "affinity": "TEXT",
            "notNull": true
          },
          {
            "fieldPath": "date",
            "columnName": "date",
            "affinity": "INTEGER",
            "notNull": true
          },
          {
            "fieldPath": "contactId",
            "columnName": "contactId",
            "affinity": "INTEGER",
            "notNull": true
          },
          {
            "fieldPath": "isItMe",
            "columnName": "isItMe",
            "affinity": "INTEGER",
            "notNull": true
          }
        ],
        "primaryKey": {
          "columnNames": [
            "id"
          ],
          "autoGenerate": true
        },
        "indices": [],
        "foreignKeys": []
      },
      {
        "tableName": "recommendations",
        "createSql": "CREATE TABLE IF NOT EXISTS `${TABLE_NAME}` (`id` INTEGER PRIMARY KEY AUTOINCREMENT NOT NULL, `mot1` TEXT NOT NULL, `mot2` TEXT, `mot3` TEXT, `counter` INTEGER, `is_idiomatic` INTEGER, `mode` REAL, `is_starter` INTEGER NOT NULL)",
        "fields": [
          {
            "fieldPath": "id",
            "columnName": "id",
            "affinity": "INTEGER",
            "notNull": true
          },
          {
            "fieldPath": "word1",
            "columnName": "mot1",
            "affinity": "TEXT",
            "notNull": true
          },
          {
            "fieldPath": "word2",
            "columnName": "mot2",
            "affinity": "TEXT",
            "notNull": false
          },
          {
            "fieldPath": "word3",
            "columnName": "mot3",
            "affinity": "TEXT",
            "notNull": false
          },
          {
            "fieldPath": "counter",
            "columnName": "counter",
            "affinity": "INTEGER",
            "notNull": false
          },
          {
            "fieldPath": "isIdiomatic",
            "columnName": "is_idiomatic",
            "affinity": "INTEGER",
            "notNull": false
          },
          {
            "fieldPath": "mode",
            "columnName": "mode",
            "affinity": "REAL",
            "notNull": false
          },
          {
            "fieldPath": "isStarter",
            "columnName": "is_starter",
            "affinity": "INTEGER",
            "notNull": true
          }
        ],
        "primaryKey": {
          "columnNames": [
            "id"
          ],
          "autoGenerate": true
        },
        "indices": [],
        "foreignKeys": []
      }
    ],
    "views": [],
    "setupQueries": [
      "CREATE TABLE IF NOT EXISTS room_master_table (id INTEGER PRIMARY KEY,identity_hash TEXT)",
      "INSERT OR REPLACE INTO room_master_table (id,identity_hash) VALUES(42, \"859a8fd653758c424ba2cabd6c60b0fa\")"
    ]
  }
}