<svg width="133" height="45" viewBox="0 0 133 45" fill="none" xmlns="http://www.w3.org/2000/svg">
<g clip-path="url(#clip0_990_5197)">
<path d="M51.2016 22.5C51.2016 34.9016 39.9016 44.9115 25.9016 44.9115C11.9016 44.9115 0.601562 34.9016 0.601562 22.5C0.601562 10.0985 11.9016 0.088623 25.9016 0.088623C39.9016 0.088623 51.2016 10.0985 51.2016 22.5Z" fill="#0071CE"/>
<path d="M60.8018 32.687H64.3018V12.9331H60.8018V10.9843H79.7018V15.8563H77.3018V12.9331H67.0018V21.6142H77.1018V23.6516H67.0018V32.5098H78.0018V29.4095H80.4018V34.4587H60.8018V32.687Z" fill="#333E48"/>
<path d="M83.002 32.687H85.702L94.702 10.9843H97.602L106.602 32.687H109.302V34.6358H100.802V32.687H103.902L101.402 26.5748H91.002L88.502 32.687H91.502V34.6358H83.002V32.687ZM100.702 24.5374L96.702 14.8819C96.4019 14.0846 96.302 13.376 96.302 13.376H96.202C96.202 13.376 96.102 14.0846 95.802 14.8819L91.702 24.5374H100.702Z" fill="#333E48"/>
<path d="M111.901 32.687H115.401V12.9331H111.901V10.9843H123.901C125.801 10.9843 127.201 11.25 128.501 11.7815C130.401 12.5787 131.801 14.5276 131.801 17.0079C131.801 19.3996 130.401 21.1713 128.401 22.1457C131.101 22.8543 132.901 25.1575 132.901 27.9921C132.901 30.9154 131.001 33.3071 128.401 34.1929C127.201 34.6358 125.901 34.7244 124.401 34.7244H111.901V32.687ZM124.501 21.1713C127.201 21.1713 129.001 19.4882 129.001 17.0079C129.001 15.502 128.301 14.1732 127.101 13.4646C126.301 13.0217 125.201 12.8445 123.901 12.8445H118.001V21.0827H124.501V21.1713ZM124.401 32.5984C125.201 32.5984 126.301 32.5098 127.201 32.2441C129.001 31.5354 130.101 29.9409 130.101 27.9035C130.101 25.0689 127.901 23.2087 124.801 23.2087H118.001V32.5984H124.401Z" fill="#333E48"/>
<path d="M25.9021 8.85828C31.2021 8.85828 36.3021 12.1358 38.0021 16.4764L35.0021 15.3248C33.4021 13.0217 30.2021 10.7185 25.8021 10.7185C22.1021 10.7185 18.7021 12.4016 16.7021 15.2362L13.7021 16.3878C15.5021 12.0473 20.6021 8.85828 25.9021 8.85828Z" fill="white"/>
<path d="M25.9018 15.8563L13.8018 20.6398V18.6909L25.9018 13.9075L38.0018 18.6909V20.6398L25.9018 15.8563Z" fill="white"/>
<path d="M38.0018 32.9528H13.8018V34.7244H38.0018V32.9528Z" fill="white"/>
<path d="M30.7018 22.5H28.3018V30.6496H30.7018V22.5Z" fill="white"/>
<path d="M23.402 22.5H21.002V30.6496H23.402V22.5Z" fill="white"/>
<path d="M16.2018 22.5H13.8018V30.6496H16.2018V22.5Z" fill="white"/>
<path d="M38.0025 22.5H35.6025V30.6496H38.0025V22.5Z" fill="white"/>
</g>
<defs>
<clipPath id="clip0_990_5197">
<rect width="132.4" height="45" fill="white" transform="translate(0.501953)"/>
</clipPath>
</defs>
</svg>
