{
  "gridConfigs": [
    {
      "id": "GRID_10_10_5",
      "name": "10x10 (5 ships)",
      "size": {
        "x": 10,
        "y": 10
      },
      "ships": [
        {
          "name": "Carrier",
          "length": 5
        },
        {
          "name": "Battleship",
          "length": 4
        },
        {
          "name": "Cruiser",
          "length": 3
        },
        {
          "name": "Submarine",
          "length": 3
        },
        {
          "name": "Destroyer",
          "length": 2
        }
      ]
    },
    {
      "id": "GRID_9_9_4",
      "name": "9x9 (4 ships)",
      "size": {
        "x": 9,
        "y": 9
      },
      "ships": [
        {
          "name": "Carrier",
          "length": 5
        },
        {
          "name": "Battleship",
          "length": 4
        },
        {
          "name": "Submarine",
          "length": 3
        },
        {
          "name": "Patrol Boat",
          "length": 2
        }
      ]
    },
    {
      "id": "GRID_6_6_3",
      "name": "6x6 (3 ships)",
      "size": {
        "x": 6,
        "y": 6
      },
      "ships": [
        {
          "name": "Battleship",
          "length": 3
        },
        {
          "name": "Destroyer",
          "length": 2
        },
        {
          "name": "Submarine",
          "length": 1
        }
      ]
    }
  ]
}
