[gd_scene load_steps=3 format=2]

[ext_resource path="res://Sprites/Intro/5.png" type="Texture" id=1]
[ext_resource path="res://Scripts/intro5.gd" type="Script" id=2]

[node name="intro5" type="Node" index="0"]

[node name="hud" type="CanvasLayer" parent="." index="0"]

layer = 1
offset = Vector2( 0, 0 )
rotation = 0.0
scale = Vector2( 1, 1 )
transform = Transform2D( 1, 0, 0, 1, 0, 0 )

[node name="intro5" type="TextureButton" parent="hud" index="0"]

anchor_left = 0.0
anchor_top = 0.0
anchor_right = 0.0
anchor_bottom = 0.0
margin_left = -2.0
margin_right = 508.0
margin_bottom = 298.0
rect_scale = Vector2( 2, 2 )
rect_pivot_offset = Vector2( 0, 0 )
rect_clip_content = false
focus_mode = 2
mouse_filter = 0
mouse_default_cursor_shape = 0
size_flags_horizontal = 1
size_flags_vertical = 1
toggle_mode = false
enabled_focus_mode = 2
shortcut = null
group = null
texture_normal = ExtResource( 1 )
expand = true
script = ExtResource( 2 )
_sections_unfolded = [ "Anchor", "Hint", "Rect", "Textures" ]


