[gd_scene load_steps=4 format=2]

[ext_resource path="res://Scripts/Obstacles.gd" type="Script" id=1]
[ext_resource path="res://Sprites/Obstacle dan Coins/Obstacle atas.png" type="Texture" id=2]

[sub_resource type="RectangleShape2D" id=1]

custom_solver_bias = 0.0
extents = Vector2( 10, 10 )

[node name="Obstacles" type="StaticBody2D"]

position = Vector2( 1077.15, 368.717 )
input_pickable = false
collision_layer = 1
collision_mask = 1
constant_linear_velocity = Vector2( 0, 0 )
constant_angular_velocity = 0.0
friction = 1.0
bounce = 0.0
script = ExtResource( 1 )
_sections_unfolded = [ "Collision", "Pickable" ]
speed = 400

[node name="Sprite" type="Sprite" parent="." index="0"]

scale = Vector2( 0.1, 0.1 )
texture = ExtResource( 2 )
_sections_unfolded = [ "Transform" ]

[node name="CollisionShape2D" type="CollisionShape2D" parent="." index="1"]

position = Vector2( 0.00239497, 0.617811 )
scale = Vector2( 3.50409, 0.677118 )
shape = SubResource( 1 )


