<?xml version="1.0" encoding="utf-8"?>
<!-- Generator: Adobe Illustrator 21.0.0, SVG Export Plug-In . SVG Version: 6.00 Build 0)  -->
<svg version="1.1" id="Layer_1" xmlns="http://www.w3.org/2000/svg" xmlns:xlink="http://www.w3.org/1999/xlink" x="0px" y="0px"
	 viewBox="0 0 111 47" style="enable-background:new 0 0 111 47;" xml:space="preserve">
<style type="text/css">
	.st0{fill:#FFECC5;}
	.st1{fill:#1D1D1B;}
</style>
<g>
	<path class="st0" d="M89.2,44.6l-73.8,0.7C9.5,45.3,1,43.6,1.9,23.8l0.7-12c0.7-3.9,2.1-8.2,14.9-8.3l52.9-0.2
		c5.8,0,37.9-2.6,36.3,9.1l0.1,19.5C106.4,41.9,110.1,45.8,89.2,44.6z"/>
	<g>
		<path class="st1" d="M110.5,13.7c-0.1-1.7,0-3.6-0.6-5.3C109.4,7,108,6,106.4,5.3c-1.6-0.7-3.3-1.2-5.1-1.5
			c-3.1-0.8-6.7-0.8-9.8-1C80.3,2.1,69.1,1.6,57.9,1.5C52.9,1.4,48,1.4,43,1.4c-0.3,0-0.6,0-0.9-0.1c-5.4-0.5-10.7-1-16.1-0.6
			c-5.2,0.4-10.5,1-15.6,1.7C6.6,2.9,3.2,3.9,1.6,6.5c-1.8,3-1.6,6.8-1.6,10c0,3.9,0.4,7.8,0.5,11.8c0.1,3.6-0.7,7.3,0.1,10.9
			c0.6,2.7,2.6,5.4,6.4,6.5c2.1,0.6,4.5,0.7,6.7,0.7c2.8,0,5.5,0,8.2,0c5.7,0,11.4-0.1,17.2-0.1c11.3-0.1,22.7-0.1,34-0.2
			c2.5,0,5.1-0.1,7.6-0.1c0,0,0,0,0,0c0.3,0,0.7,0,1.1,0c0.2,0,0.5,0,0.7,0c0-0.2,0-0.4,0-0.7c0.2-0.1,0.2-0.3,0-0.4
			c0.1-0.1,0.1-0.4-0.2-0.4c-1.8-0.1-3.7-0.2-5.5-0.2c1.2-0.8,2.4-1.6,3.6-2.5c0.1-0.1-0.1-0.3-0.2-0.2c-1.2,0.9-2.5,1.8-3.8,2.6
			c-1,0-2,0-2.9-0.1c0.9-0.5,1.7-1,2.4-1.6c0.1-0.1-0.1-0.3-0.3-0.2c-0.9,0.6-1.9,1.3-2.9,1.8c-1,0-2,0-2.9,0
			c1.2-0.7,2.4-1.4,3.6-2.2c0.1-0.1-0.1-0.2-0.2-0.1c-1.3,0.7-2.6,1.5-3.9,2.3c-0.9,0-1.8,0-2.7,0c1.1-0.7,2.2-1.3,3.3-2
			c0.1-0.1-0.1-0.2-0.2-0.2c-1.2,0.7-2.4,1.4-3.5,2.2c-0.9,0-1.8,0-2.7,0c1.1-0.7,2.2-1.4,3.3-2c0.1-0.1-0.1-0.2-0.2-0.2
			c-1.2,0.7-2.4,1.4-3.6,2.2c-0.9,0-1.9,0-2.8,0c1.2-0.8,2.4-1.7,3.4-2.6c0.1-0.1-0.1-0.2-0.2-0.1c-1.2,0.9-2.4,1.8-3.7,2.7
			c-1.2,0-2.3,0-3.5,0.1c1.3-1,2.7-1.9,4.2-2.7c0.1-0.1-0.1-0.2-0.2-0.1c-1.6,0.9-3.1,1.9-4.5,2.9c-1.2,0-2.4,0-3.6,0.1
			c1.2-0.8,2.4-1.6,3.6-2.4c0.1-0.1-0.1-0.2-0.2-0.1c-1.3,0.8-2.6,1.6-3.9,2.5c-0.6,0-1.1,0-1.7,0c-0.7,0-1.4,0-2.1,0
			c1.6-1,3.2-2,4.8-3.1c0.1-0.1-0.1-0.2-0.2-0.1c-1.7,1.1-3.3,2.1-5,3.2c-1,0-2.1,0-3.1,0.1c1.2-0.6,2.2-1.3,3.2-2
			c0.1-0.1-0.1-0.2-0.2-0.1c-1.1,0.8-2.3,1.5-3.5,2.2c-0.5,0-1.1,0-1.6,0c-0.7,0-1.3,0-2,0c1.6-1.1,3.2-2.1,4.8-3.2
			c0.1-0.1-0.1-0.2-0.2-0.1c-1.7,1.1-3.3,2.2-4.9,3.4c-1.1,0-2.3,0-3.4,0.1c1.7-1.1,3.4-2.3,5.1-3.4c0.1-0.1-0.1-0.2-0.2-0.1
			c-1.8,1.1-3.6,2.3-5.3,3.6c0,0,0,0-0.1,0c-0.9,0-1.7,0-2.6,0c1.2-0.8,2.3-1.7,3.5-2.5c0.1-0.1-0.1-0.2-0.2-0.1
			c-1.2,0.9-2.5,1.7-3.7,2.6c-1,0-2,0-2.9,0c2.3-1.5,4.6-3,7-4.4c0.1-0.1-0.1-0.2-0.2-0.2c-2.6,1.4-5.1,2.9-7.4,4.5
			c-1.1,0-2.2,0-3.2,0c1.9-1.2,3.8-2.4,5.6-3.6c0.1-0.1-0.1-0.3-0.2-0.2c-2,1.2-3.9,2.5-5.9,3.8c-1.3,0-2.7,0-4,0
			c2.5-1.5,4.9-3.1,7.3-4.6c0.1-0.1-0.1-0.2-0.2-0.2c-2.5,1.6-5.1,3.2-7.5,4.8c-1.2,0-2.4,0-3.6,0c1.8-1.1,3.6-2.2,5.3-3.3
			c0.1-0.1,0-0.2-0.1-0.1c-1.8,1.2-3.6,2.3-5.5,3.4c-1.2,0-2.4,0-3.6-0.1c2.6-1.7,5.2-3.4,7.7-5.2c0.1-0.1-0.1-0.2-0.2-0.1
			c-2.7,1.7-5.3,3.5-7.9,5.3c-0.9-0.1-1.7-0.2-2.6-0.4c2-1.4,3.9-2.7,6.1-3.9c0.1-0.1,0-0.2-0.2-0.1c-2.2,1.2-4.3,2.5-6.2,4
			c-0.3-0.1-0.7-0.2-1-0.3c-0.5-0.2-1-0.5-1.5-0.7c2-1.3,3.8-2.7,5.6-4.2c0.1-0.1-0.1-0.2-0.2-0.1c-1.8,1.5-3.7,2.8-5.6,4.2
			c-0.5-0.3-0.9-0.6-1.3-1c1.5-1.2,3.1-2.3,4.8-3.4c0.1-0.1-0.1-0.2-0.2-0.1c-1.7,1.1-3.3,2.2-4.8,3.4c-0.5-0.5-0.9-0.9-1.3-1.4
			c1.6-1,3.1-2.1,4.5-3.2c0.1-0.1-0.1-0.2-0.2-0.1c-1.4,1.1-2.9,2.2-4.5,3.2c0,0-0.1-0.1-0.1-0.1c-0.3-0.4-0.5-0.8-0.7-1.2
			c1.6-1.1,3.2-2.2,4.8-3.4c0.1-0.1,0-0.2-0.1-0.1c-1.6,1.1-3.3,2.1-4.8,3.3c-0.2-0.4-0.3-0.7-0.5-1.1c1.8-1.4,3.7-2.8,5.7-4.1
			c0.1-0.1-0.1-0.2-0.2-0.1c-2,1.3-3.8,2.6-5.5,4.1c-0.2-0.6-0.4-1.1-0.5-1.7c2.1-1.5,4.2-3,6.3-4.6c0.1-0.1-0.1-0.2-0.2-0.1
			c-2.1,1.5-4.1,3-6.1,4.5c-0.1-0.7-0.2-1.3-0.3-2c2.2-1.8,4.6-3.5,7.2-5c0.1-0.1-0.1-0.2-0.2-0.1c-2.6,1.5-4.9,3.1-7,4.9
			c-0.1-0.6-0.1-1.2-0.1-1.8c1.8-1.4,3.6-2.8,5.5-4.1c0.1-0.1-0.1-0.2-0.2-0.1c-1.8,1.3-3.6,2.6-5.3,4c0-0.7-0.1-1.4-0.1-2.1
			c0,0,0-0.1,0-0.1c1.5-1.2,3-2.4,4.6-3.5c0.1-0.1-0.1-0.2-0.2-0.1c-1.6,1-3.1,2.2-4.4,3.3c0-0.6-0.1-1.1-0.1-1.7
			c1.7-1.2,3.1-2.5,4.6-3.8c0.1-0.1-0.1-0.2-0.2-0.1c-1.4,1.3-3,2.5-4.4,3.7c0-0.4,0-0.8,0-1.2c1.9-1.7,3.7-3.4,5.7-5.1
			c0.1-0.1-0.1-0.2-0.2-0.1c-1.9,1.6-3.8,3.2-5.5,4.9c0-0.8,0-1.6,0-2.4c1.9-1.5,3.8-2.9,5.8-4.3c0.1-0.1-0.1-0.2-0.2-0.1
			c-2,1.4-3.8,2.8-5.6,4.3c0-0.7,0-1.4,0-2c1.4-1.1,2.8-2.1,4.2-3.2c0.1-0.1,0-0.2-0.1-0.1c-1.4,1-2.7,2.1-4.1,3.1
			c0-0.6,0-1.3,0.1-1.9c2.3-1.6,4.5-3.2,6.6-4.8C9.1,14,9,13.9,8.9,14c-2.1,1.6-4.3,3.2-6.4,4.7c0-0.1,0-0.3,0-0.4
			c0-0.6,0.1-1.3,0.1-1.9c1.5-1.3,3-2.4,4.8-3.4c0.1-0.1,0-0.2-0.2-0.1c-1.7,1-3.3,2.1-4.6,3.3c0-0.6,0.1-1.2,0.1-1.8
			c1.9-1.4,3.7-2.9,5.5-4.4c0.1-0.1-0.1-0.2-0.1-0.1c-1.8,1.4-3.6,2.8-5.4,4.2c0.1-0.5,0.1-1.1,0.2-1.6c1.7-1.3,3.3-2.6,5.2-3.8
			c0.1-0.1,0-0.2-0.2-0.1c-1.7,1-3.5,2.1-4.9,3.4c0.2-0.9,0.5-1.9,0.9-2.8c0.6-1.3,1.6-2.6,3.1-3.5C9,4.5,11.5,4.2,14,4.1
			c5.4-0.4,10.9-0.4,16.3-0.4c10.8,0,21.6,0,32.4,0c10.5,0,21.2-0.3,31.7,0.7c2.4,0.2,4.9,0.5,7.1,1.3c2.4,0.9,3.5,2.4,4.1,4.2
			c1.2,3.6,1.2,7.5,1.1,11.2c-0.1,3.7-0.3,7.3-0.5,11c-0.1,1.8-0.2,3.7-0.3,5.5c-0.1,1.7,0.4,4.1-1.2,5.4c-1.7,1.3-4.5,1.3-6.9,1.3
			c-1.3,0-16.6-0.5-17.4,0.5c-0.4,0.4,0.5,0.6,0.3,1.1c0,0.1,11.6,0.6,11.6,0.7c0.7,0,1.4,0.1,2.1,0.1c0.2,0,0.3,0,0.4,0.1
			c2.3,0.2,4.5,0.3,6.8,0.2c1.8-0.1,3.7-0.3,5-1.3c0.5-0.4,0.9-0.9,1.2-1.5c0.6-0.7,0.8-1.5,0.8-2.2c0-0.1,0-0.1,0.1-0.2
			c0.6-1.7,1-3.5,1.3-5.2C111.4,29,111.1,21.3,110.5,13.7z M80.7,45.6c-0.3,0-0.6,0-0.9,0C80.1,45.5,80.4,45.5,80.7,45.6
			C80.8,45.5,80.7,45.5,80.7,45.6z M62.2,44.9c3.8,0,7.5,0,11.3,0c0.6,0,1.2,0,1.8,0c-0.1,0-0.1,0.1-0.2,0.1
			c-0.1,0.1,0.1,0.2,0.2,0.1c0.1-0.1,0.3-0.2,0.4-0.2c1.5,0,3,0,4.5,0.1c-6.1,0.4-12.1,0.2-18.2,0C62.1,44.9,62.2,44.9,62.2,44.9z
			 M61.7,44.9c0,0-0.1,0-0.1,0.1c-0.5,0-1,0-1.6-0.1C60.6,44.9,61.2,44.9,61.7,44.9z M24.7,45.7c5.6-0.2,11.3-0.4,16.9-0.5
			c1.5,0,2.9,0,4.4,0c0,0.1,0.1,0.2,0.2,0.1c0,0,0.1-0.1,0.1-0.1c1.3,0,2.6,0,3.9,0c-0.1,0-0.1,0.1-0.2,0.1
			c-0.1,0.1,0.1,0.2,0.2,0.2c0.1-0.1,0.3-0.2,0.4-0.3c2.5,0,5.1,0.1,7.6,0.2c1,0,1.9,0.1,2.9,0.1c-12.3,0-24.6,0.1-37,0.2
			C24.4,45.8,24.6,45.7,24.7,45.7z M32.7,1.2c1.4,0,2.7,0.1,4.1,0.2c-4.2,0.1-8.4,0.1-12.6,0.3c-0.9,0-1.8,0.1-2.7,0.1
			C25.2,1.4,28.9,1.1,32.7,1.2z M0.9,13.3c0.2-3,0.2-6.8,3.8-8.8c1.4-0.8,3.2-1.2,5.1-1.4c0,0-0.1,0-0.1,0C7.8,3.5,5.8,4,4.4,5.1
			C3.2,6,2.5,7.2,2.2,8.4c-1,3.4-0.8,7.1-0.9,10.5c-0.1,3.6,0,7.2,0.3,10.8c0,0,0,0,0,0c0,0,0,0.1,0,0.1c0,0.3,0,0.6,0.1,0.9
			c0,0.5,0.1,0.9,0.1,1.4c-0.2,0.1-0.3,0.3-0.5,0.4C1.4,26.2,0.5,19.8,0.9,13.3z M14.9,45.5c-0.5,0-1,0-1.4,0c-0.2,0-0.5,0-0.7,0
			c0,0,0,0,0.1,0c0.1-0.1,0.2-0.1,0.3-0.2C13.7,45.4,14.3,45.4,14.9,45.5z M3.8,39.6c0.5,1,1.3,2,2.3,2.9c-0.1,0.1-0.3,0.2-0.4,0.3
			c-0.1,0.1,0.1,0.2,0.2,0.1c0.1-0.1,0.3-0.2,0.4-0.3c0.3,0.3,0.6,0.5,1,0.7c0.9,0.6,2,1.1,3,1.4c0,0-0.1,0-0.1,0.1
			c-0.1,0.1,0,0.2,0.1,0.1c0.1,0,0.1-0.1,0.2-0.1c0.8,0.2,1.6,0.4,2.4,0.5c-0.1,0-0.1,0.1-0.2,0.1c-0.1,0,0,0.1,0.1,0.1
			c-2.3,0-4.5-0.2-6.2-1.4c-1.7-1.2-2.5-2.8-2.9-4.5C3.7,39.6,3.7,39.6,3.8,39.6z M3.7,39.5C3.7,39.5,3.7,39.5,3.7,39.5
			c-0.1-0.1-0.2-0.3-0.2-0.4C3.6,39.2,3.6,39.3,3.7,39.5z M3.1,40.6c0.6,1.5,1.6,3.1,3.2,4.2c-0.6-0.2-1.1-0.5-1.6-0.8
			c-3.6-2.5-3.7-6.2-3.5-9.3c0-0.6,0-1.2,0.1-1.7c0.2-0.1,0.3-0.3,0.5-0.4c0,0.6,0.1,1.3,0.1,1.9c0,0-0.1,0.1-0.1,0.1
			c-0.1,0.1,0,0.1,0.1,0.1C2.1,36.6,2.4,38.7,3.1,40.6z M38.3,3C32.5,3,26.7,3,20.8,3.1c-2.7,0.1-5.3,0.2-8,0.4
			C10.7,3.7,8.5,4,6.8,4.9c-2.5,1.3-3.6,3.5-4.2,5.6c0.2-1.6,0.7-3.2,1.9-4.4c1.4-1.4,3.7-2,6-2.5c2.3-0.5,4.7-0.8,7.1-0.9
			c4.8-0.4,9.7-0.4,14.5-0.5C35.8,2.1,39.6,2,43.4,2c1.4,0.1,2.9,0.2,4.3,0.3c6.8,0.4,13.5,0.5,20.3,0.7C58.2,3.1,48.2,3,38.3,3z
			 M61.3,2.2c4.2,0.1,8.3,0.2,12.5,0.4C69.7,2.4,65.5,2.3,61.3,2.2z M96.7,45c0.4,0,0.9,0,1.3,0c-1.1,0-2.1,0-3.2,0.1
			c0,0-0.1-0.1-0.1-0.1C95.3,44.9,96.1,45,96.7,45z M102.4,46.2c-2.6,0.2-5.3,0.1-7.9-0.1c0-0.1,0.1-0.2,0.1-0.2
			c2.7-0.1,5.3-0.1,8-0.2c1,0,2-0.1,2.9-0.3C104.7,45.9,103.6,46.1,102.4,46.2z M107.7,41.3c0,0.1,0,0.3,0,0.4
			c-0.1,0.4-0.2,0.7-0.4,1.1c-0.1,0.4-0.3,0.8-0.5,1.2c-0.9,0.9-2.4,0.9-3.8,1c-0.6,0-1.2,0-1.8,0c1.6-0.2,3.3-0.6,4.4-1.4
			c1.5-1.1,1.3-2.7,1.4-4.2c0.2-4,0.4-8.1,0.6-12.1c0.2-3.9,0.4-7.8,0.1-11.8c-0.3-3-0.3-7.1-3.7-9.4c-2-1.3-4.7-1.9-7.5-2.2
			c1.3,0.1,2.7,0.2,4.1,0.4c1.9,0.4,3.6,1,4.9,2.1c3.3,2.8,2.6,7.3,2.7,10.6c0.2,4.1,0.2,8.1,0.1,12.1
			C108.2,33.2,108.1,37.3,107.7,41.3z M109.8,30.9c-0.2,2.1-0.5,4.1-0.9,6.1c0-0.7,0.1-1.3,0.1-2c0.4-7.7,0.6-15.5-0.2-23.2
			c-0.2-2.3-1-4.6-3.3-6.3c0.9,0.4,1.7,0.9,2.4,1.5c1.8,1.6,1.4,4.3,1.6,6.2c0.2,2,0.3,3.9,0.4,5.9C110.1,23.1,110.2,27,109.8,30.9z
			"/>
	</g>
</g>
</svg>
