{
  "project_info": {
    "project_number": "647626890869",
    "firebase_url": "https://tokomanamana-merchant.firebaseio.com",
    "project_id": "tokomanamana-merchant",
    "storage_bucket": "tokomanamana-merchant.appspot.com"
  },
  "client": [
    {
      "client_info": {
        "mobilesdk_app_id": "1:647626890869:android:76c688c8ed75f5b176e23c",
        "android_client_info": {
          "package_name": "com.tmm_merchant"
        }
      },
      "oauth_client": [
        {
          "client_id": "647626890869-umtl7877nufhb1vtptbs9gb4s0abcler.apps.googleusercontent.com",
          "client_type": 3
        }
      ],
      "api_key": [
        {
          "current_key": "AIzaSyAXLH5gxZnCM8Oe4EI2llM-DSNenf61924"
        }
      ],
      "services": {
        "appinvite_service": {
          "other_platform_oauth_client": [
            {
              "client_id": "647626890869-umtl7877nufhb1vtptbs9gb4s0abcler.apps.googleusercontent.com",
              "client_type": 3
            }
          ]
        }
      }
    }
  ],
  "configuration_version": "1"
}