%YAML 1.1
%TAG !u! tag:unity3d.com,2011:
--- !u!114 &11400000
MonoBehaviour:
  m_ObjectHideFlags: 0
  m_CorrespondingSourceObject: {fileID: 0}
  m_PrefabInstance: {fileID: 0}
  m_PrefabAsset: {fileID: 0}
  m_GameObject: {fileID: 0}
  m_Enabled: 1
  m_EditorHideFlags: 0
  m_Script: {fileID: 11500000, guid: abceffe1b95676b498800ef3d2feba6f, type: 3}
  m_Name: rossa
  m_EditorClassIdentifier: Assembly-CSharp:Interactions.Items:Potions
  name: rossa
  icon: {fileID: 21300000, guid: 96c78744f2b26344896f6db2e9b1820a, type: 3}
  Effect_duration: 0
  cd: 3
  healthreg: -10
