%YAML 1.1
%TAG !u! tag:unity3d.com,2011:
--- !u!74 &7400000
AnimationClip:
  m_ObjectHideFlags: 0
  m_CorrespondingSourceObject: {fileID: 0}
  m_PrefabInstance: {fileID: 0}
  m_PrefabAsset: {fileID: 0}
  m_Name: Attack
  serializedVersion: 6
  m_Legacy: 0
  m_Compressed: 0
  m_UseHighQualityCurve: 1
  m_RotationCurves:
  - curve:
      serializedVersion: 2
      m_Curve:
      - serializedVersion: 3
        time: 0
        value: {x: 0.7071068, y: 0, z: 0, w: 0.7071067}
        inSlope: {x: 0, y: 0, z: 0, w: 0}
        outSlope: {x: 0, y: 0, z: 0, w: 0}
        tangentMode: 0
        weightedMode: 0
        inWeight: {x: 0.33333334, y: 0.33333334, z: 0.33333334, w: 0.33333334}
        outWeight: {x: 0.33333334, y: 0.33333334, z: 0.33333334, w: 0.33333334}
      - serializedVersion: 3
        time: 0.33333334
        value: {x: 0.7071068, y: 0, z: 0, w: 0.7071067}
        inSlope: {x: 0, y: -0.0000002076215, z: 0.00000020762151, w: 0}
        outSlope: {x: 0, y: -0.0000002076215, z: 0.00000020762151, w: 0}
        tangentMode: 0
        weightedMode: 0
        inWeight: {x: 0.33333334, y: 0.33333334, z: 0.33333334, w: 0.33333334}
        outWeight: {x: 0.33333334, y: 0.33333334, z: 0.33333334, w: 0.33333334}
      - serializedVersion: 3
        time: 0.37500003
        value: {x: 0.7071068, y: -0.000000017301799, z: 0.0000000173018, w: 0.7071067}
        inSlope: {x: -0.011184457, y: -0.43552512, z: 0.4355252, w: -0.011184457}
        outSlope: {x: -0.011184457, y: -0.43552512, z: 0.4355252, w: -0.011184457}
        tangentMode: 0
        weightedMode: 0
        inWeight: {x: 0.33333334, y: 0.33333334, z: 0.33333334, w: 0.33333334}
        outWeight: {x: 0.33333334, y: 0.33333334, z: 0.33333334, w: 0.33333334}
      - serializedVersion: 3
        time: 0.4166667
        value: {x: 0.7061748, y: -0.036293752, z: 0.03629376, w: 0.7061747}
        inSlope: {x: -0.1337507, y: -1.5006467, z: 1.5006468, w: -0.1337507}
        outSlope: {x: -0.1337507, y: -1.5006467, z: 1.5006468, w: -0.1337507}
        tangentMode: 0
        weightedMode: 0
        inWeight: {x: 0.33333334, y: 0.33333334, z: 0.33333334, w: 0.33333334}
        outWeight: {x: 0.33333334, y: 0.33333334, z: 0.33333334, w: 0.33333334}
      - serializedVersion: 3
        time: 0.45833334
        value: {x: 0.69596094, y: -0.12505388, z: 0.1250539, w: 0.6959608}
        inSlope: {x: -0.45111167, y: -2.3270297, z: 2.3270302, w: -0.45111167}
        outSlope: {x: -0.45111167, y: -2.3270297, z: 2.3270302, w: -0.45111167}
        tangentMode: 0
        weightedMode: 0
        inWeight: {x: 0.33333334, y: 0.33333334, z: 0.33333334, w: 0.33333334}
        outWeight: {x: 0.33333334, y: 0.33333334, z: 0.33333334, w: 0.33333334}
      - serializedVersion: 3
        time: 0.5
        value: {x: 0.66858214, y: -0.23021294, z: 0.23021297, w: 0.668582}
        inSlope: {x: -0.7409531, y: -2.2515671, z: 2.2515676, w: -0.7409531}
        outSlope: {x: -0.7409531, y: -2.2515671, z: 2.2515676, w: -0.7409531}
        tangentMode: 0
        weightedMode: 0
        inWeight: {x: 0.33333334, y: 0.33333334, z: 0.33333334, w: 0.33333334}
        outWeight: {x: 0.33333334, y: 0.33333334, z: 0.33333334, w: 0.33333334}
      - serializedVersion: 3
        time: 0.5416667
        value: {x: 0.6342148, y: -0.31268457, z: 0.31268463, w: 0.6342147}
        inSlope: {x: -0.6150298, y: -1.3753424, z: 1.3753424, w: -0.6150298}
        outSlope: {x: -0.6150298, y: -1.3753424, z: 1.3753424, w: -0.6150298}
        tangentMode: 0
        weightedMode: 0
        inWeight: {x: 0.33333334, y: 0.33333334, z: 0.33333334, w: 0.33333334}
        outWeight: {x: 0.33333334, y: 0.33333334, z: 0.33333334, w: 0.33333334}
      - serializedVersion: 3
        time: 0.5833333
        value: {x: 0.61732966, y: -0.34482482, z: 0.34482485, w: 0.61732954}
        inSlope: {x: -0.20262213, y: -0.38568342, z: 0.38568306, w: -0.20262213}
        outSlope: {x: -0.20262213, y: -0.38568342, z: 0.38568306, w: -0.20262213}
        tangentMode: 0
        weightedMode: 0
        inWeight: {x: 0.33333334, y: 0.33333334, z: 0.33333334, w: 0.33333334}
        outWeight: {x: 0.33333334, y: 0.33333334, z: 0.33333334, w: 0.33333334}
      - serializedVersion: 3
        time: 0.625
        value: {x: 0.61732966, y: -0.34482482, z: 0.34482485, w: 0.61732954}
        inSlope: {x: 0, y: 0, z: 0, w: 0}
        outSlope: {x: 0, y: 0, z: 0, w: 0}
        tangentMode: 0
        weightedMode: 0
        inWeight: {x: 0.33333334, y: 0.33333334, z: 0.33333334, w: 0.33333334}
        outWeight: {x: 0.33333334, y: 0.33333334, z: 0.33333334, w: 0.33333334}
      - serializedVersion: 3
        time: 0.75
        value: {x: 0.61732966, y: -0.34482482, z: 0.34482485, w: 0.61732954}
        inSlope: {x: 0, y: 0.0000003576277, z: -0.0000003576277, w: 0.0000007152554}
        outSlope: {x: 0, y: 0.0000003576277, z: -0.0000003576277, w: 0.0000007152554}
        tangentMode: 0
        weightedMode: 0
        inWeight: {x: 0.33333334, y: 0.33333334, z: 0.33333334, w: 0.33333334}
        outWeight: {x: 0.33333334, y: 0.33333334, z: 0.33333334, w: 0.33333334}
      - serializedVersion: 3
        time: 0.7916667
        value: {x: 0.61732966, y: -0.3448248, z: 0.34482482, w: 0.6173296}
        inSlope: {x: 0.20262213, y: 0.38568342, z: -0.38568306, w: 0.20262213}
        outSlope: {x: 0.20262213, y: 0.38568342, z: -0.38568306, w: 0.20262213}
        tangentMode: 0
        weightedMode: 0
        inWeight: {x: 0.33333334, y: 0.33333334, z: 0.33333334, w: 0.33333334}
        outWeight: {x: 0.33333334, y: 0.33333334, z: 0.33333334, w: 0.33333334}
      - serializedVersion: 3
        time: 0.8333333
        value: {x: 0.6342148, y: -0.31268457, z: 0.31268463, w: 0.6342147}
        inSlope: {x: 0.6150298, y: 1.3753431, z: -1.3753431, w: 0.6150298}
        outSlope: {x: 0.6150298, y: 1.3753431, z: -1.3753431, w: 0.6150298}
        tangentMode: 0
        weightedMode: 0
        inWeight: {x: 0.33333334, y: 0.33333334, z: 0.33333334, w: 0.33333334}
        outWeight: {x: 0.33333334, y: 0.33333334, z: 0.33333334, w: 0.33333334}
      - serializedVersion: 3
        time: 0.875
        value: {x: 0.66858214, y: -0.23021285, z: 0.23021288, w: 0.6685821}
        inSlope: {x: 0.7409531, y: 2.2515676, z: -2.251568, w: 0.7409531}
        outSlope: {x: 0.7409531, y: 2.2515676, z: -2.251568, w: 0.7409531}
        tangentMode: 0
        weightedMode: 0
        inWeight: {x: 0.33333334, y: 0.33333334, z: 0.33333334, w: 0.33333334}
        outWeight: {x: 0.33333334, y: 0.33333334, z: 0.33333334, w: 0.33333334}
      - serializedVersion: 3
        time: 0.9166667
        value: {x: 0.69596094, y: -0.12505384, z: 0.12505385, w: 0.6959608}
        inSlope: {x: 0.45111176, y: 2.3270297, z: -2.32703, w: 0.45111105}
        outSlope: {x: 0.45111176, y: 2.3270297, z: -2.32703, w: 0.45111105}
        tangentMode: 0
        weightedMode: 0
        inWeight: {x: 0.33333334, y: 0.33333334, z: 0.33333334, w: 0.33333334}
        outWeight: {x: 0.33333334, y: 0.33333334, z: 0.33333334, w: 0.33333334}
      - serializedVersion: 3
        time: 0.9583333
        value: {x: 0.7061748, y: -0.03629375, z: 0.036293752, w: 0.7061747}
        inSlope: {x: 0.13375078, y: 1.5006464, z: -1.5006465, w: 0.13375078}
        outSlope: {x: 0.13375078, y: 1.5006464, z: -1.5006465, w: 0.13375078}
        tangentMode: 0
        weightedMode: 0
        inWeight: {x: 0.33333334, y: 0.33333334, z: 0.33333334, w: 0.33333334}
        outWeight: {x: 0.33333334, y: 0.33333334, z: 0.33333334, w: 0.33333334}
      - serializedVersion: 3
        time: 1.0000001
        value: {x: 0.7071068, y: 0, z: 0, w: 0.7071067}
        inSlope: {x: 0.011184433, y: 0.43552417, z: -0.4355242, w: 0.011184433}
        outSlope: {x: 0.011184433, y: 0.43552417, z: -0.4355242, w: 0.011184433}
        tangentMode: 0
        weightedMode: 0
        inWeight: {x: 0.33333334, y: 0.33333334, z: 0.33333334, w: 0.33333334}
        outWeight: {x: 0.33333334, y: 0.33333334, z: 0.33333334, w: 0.33333334}
      - serializedVersion: 3
        time: 1.0416667
        value: {x: 0.7071068, y: 0, z: 0, w: 0.7071067}
        inSlope: {x: 0, y: 0, z: 0, w: 0}
        outSlope: {x: 0, y: 0, z: 0, w: 0}
        tangentMode: 0
        weightedMode: 0
        inWeight: {x: 0.33333334, y: 0.33333334, z: 0.33333334, w: 0.33333334}
        outWeight: {x: 0.33333334, y: 0.33333334, z: 0.33333334, w: 0.33333334}
      - serializedVersion: 3
        time: 1.4166667
        value: {x: 0.7071068, y: 0, z: -0, w: 0.7071067}
        inSlope: {x: 0, y: 0, z: -0, w: 0}
        outSlope: {x: 0, y: 0, z: -0, w: 0}
        tangentMode: 0
        weightedMode: 0
        inWeight: {x: 0.33333334, y: 0.33333334, z: 0.33333334, w: 0.33333334}
        outWeight: {x: 0.33333334, y: 0.33333334, z: 0.33333334, w: 0.33333334}
      m_PreInfinity: 2
      m_PostInfinity: 2
      m_RotationOrder: 4
    path: Armature/Bone
  m_CompressedRotationCurves: []
  m_EulerCurves: []
  m_PositionCurves:
  - curve:
      serializedVersion: 2
      m_Curve:
      - serializedVersion: 3
        time: 0
        value: {x: -0, y: 0, z: 0}
        inSlope: {x: -0, y: -0, z: -0}
        outSlope: {x: -0, y: -0, z: -0}
        tangentMode: 0
        weightedMode: 0
        inWeight: {x: 0.33333334, y: 0.33333334, z: 0.33333334}
        outWeight: {x: 0.33333334, y: 0.33333334, z: 0.33333334}
      - serializedVersion: 3
        time: 0.375
        value: {x: -0, y: 0, z: 0}
        inSlope: {x: -0, y: -0, z: -0}
        outSlope: {x: 1.1135451, y: -0, z: 0.7676498}
        tangentMode: 0
        weightedMode: 0
        inWeight: {x: 0.33333334, y: 0.33333334, z: 0.33333334}
        outWeight: {x: 0.33333334, y: 0.33333334, z: 0.33333334}
      - serializedVersion: 3
        time: 0.4166667
        value: {x: 0.046397734, y: 0, z: 0.031985424}
        inSlope: {x: 1.1135451, y: -0, z: 0.7676498}
        outSlope: {x: 2.6553786, y: -0, z: 1.9740338}
        tangentMode: 0
        weightedMode: 0
        inWeight: {x: 0.33333334, y: 0.33333334, z: 0.33333334}
        outWeight: {x: 0.33333334, y: 0.33333334, z: 0.33333334}
      - serializedVersion: 3
        time: 0.45833334
        value: {x: 0.15703848, y: 0, z: 0.11423682}
        inSlope: {x: 2.6553786, y: -0, z: 1.9740338}
        outSlope: {x: 3.1693218, y: -0, z: 2.68704}
        tangentMode: 0
        weightedMode: 0
        inWeight: {x: 0.33333334, y: 0.33333334, z: 0.33333334}
        outWeight: {x: 0.33333334, y: 0.33333334, z: 0.33333334}
      - serializedVersion: 3
        time: 0.5
        value: {x: 0.2890936, y: 0, z: 0.22619687}
        inSlope: {x: 3.1693218, y: -0, z: 2.68704}
        outSlope: {x: 2.6553817, y: -0, z: 2.906675}
        tangentMode: 0
        weightedMode: 0
        inWeight: {x: 0.33333334, y: 0.33333334, z: 0.33333334}
        outWeight: {x: 0.33333334, y: 0.33333334, z: 0.33333334}
      - serializedVersion: 3
        time: 0.5416666
        value: {x: 0.3997344, y: 0, z: 0.34730822}
        inSlope: {x: 2.6553817, y: -0, z: 2.906675}
        outSlope: {x: 1.1135447, y: -0, z: 2.6329246}
        tangentMode: 0
        weightedMode: 0
        inWeight: {x: 0.33333334, y: 0.33333334, z: 0.33333334}
        outWeight: {x: 0.33333334, y: 0.33333334, z: 0.33333334}
      - serializedVersion: 3
        time: 0.5833333
        value: {x: 0.44613212, y: 0, z: 0.45701346}
        inSlope: {x: 1.1135447, y: -0, z: 2.6329246}
        outSlope: {x: -0.5157306, y: -0, z: 1.9680874}
        tangentMode: 0
        weightedMode: 0
        inWeight: {x: 0.33333334, y: 0.33333334, z: 0.33333334}
        outWeight: {x: 0.33333334, y: 0.33333334, z: 0.33333334}
      - serializedVersion: 3
        time: 0.625
        value: {x: 0.42464334, y: 0, z: 0.53901714}
        inSlope: {x: -0.5157306, y: -0, z: 1.9680874}
        outSlope: {x: -1.3286554, y: -0, z: 1.321289}
        tangentMode: 0
        weightedMode: 0
        inWeight: {x: 0.33333334, y: 0.33333334, z: 0.33333334}
        outWeight: {x: 0.33333334, y: 0.33333334, z: 0.33333334}
      - serializedVersion: 3
        time: 0.6666666
        value: {x: 0.36928275, y: 0, z: 0.5940708}
        inSlope: {x: -1.3286554, y: -0, z: 1.321289}
        outSlope: {x: -1.8137718, y: -0, z: 0.794809}
        tangentMode: 0
        weightedMode: 0
        inWeight: {x: 0.33333334, y: 0.33333334, z: 0.33333334}
        outWeight: {x: 0.33333334, y: 0.33333334, z: 0.33333334}
      - serializedVersion: 3
        time: 0.7083333
        value: {x: 0.2937089, y: 0, z: 0.62718785}
        inSlope: {x: -1.8137718, y: -0, z: 0.794809}
        outSlope: {x: -1.971084, y: -0, z: 0.38864833}
        tangentMode: 0
        weightedMode: 0
        inWeight: {x: 0.33333334, y: 0.33333334, z: 0.33333334}
        outWeight: {x: 0.33333334, y: 0.33333334, z: 0.33333334}
      - serializedVersion: 3
        time: 0.75
        value: {x: 0.21158035, y: 0, z: 0.64338154}
        inSlope: {x: -1.971084, y: -0, z: 0.38864833}
        outSlope: {x: -1.8005925, y: -0, z: 0.10281239}
        tangentMode: 0
        weightedMode: 0
        inWeight: {x: 0.33333334, y: 0.33333334, z: 0.33333334}
        outWeight: {x: 0.33333334, y: 0.33333334, z: 0.33333334}
      - serializedVersion: 3
        time: 0.7916666
        value: {x: 0.13655573, y: 0, z: 0.6476654}
        inSlope: {x: -1.8005925, y: -0, z: 0.10281239}
        outSlope: {x: -1.3687308, y: -0, z: -1.6165731}
        tangentMode: 0
        weightedMode: 0
        inWeight: {x: 0.33333334, y: 0.33333334, z: 0.33333334}
        outWeight: {x: 0.33333334, y: 0.33333334, z: 0.33333334}
      - serializedVersion: 3
        time: 0.8333333
        value: {x: 0.079525255, y: 0, z: 0.58030814}
        inSlope: {x: -1.3687308, y: -0, z: -1.6165731}
        outSlope: {x: -0.94126517, y: -0, z: -3.8549018}
        tangentMode: 0
        weightedMode: 0
        inWeight: {x: 0.33333334, y: 0.33333334, z: 0.33333334}
        outWeight: {x: 0.33333334, y: 0.33333334, z: 0.33333334}
      - serializedVersion: 3
        time: 0.875
        value: {x: 0.040305853, y: 0, z: 0.41968715}
        inSlope: {x: -0.94126517, y: -0, z: -3.8549018}
        outSlope: {x: -0.5846345, y: -0, z: -4.601018}
        tangentMode: 0
        weightedMode: 0
        inWeight: {x: 0.33333334, y: 0.33333334, z: 0.33333334}
        outWeight: {x: 0.33333334, y: 0.33333334, z: 0.33333334}
      - serializedVersion: 3
        time: 0.9166666
        value: {x: 0.015946107, y: 0, z: 0.22797826}
        inSlope: {x: -0.5846345, y: -0, z: -4.601018}
        outSlope: {x: -0.29883537, y: -0, z: -3.854904}
        tangentMode: 0
        weightedMode: 0
        inWeight: {x: 0.33333334, y: 0.33333334, z: 0.33333334}
        outWeight: {x: 0.33333334, y: 0.33333334, z: 0.33333334}
      - serializedVersion: 3
        time: 0.9583333
        value: {x: 0.0034946278, y: 0, z: 0.06735718}
        inSlope: {x: -0.29883537, y: -0, z: -3.854904}
        outSlope: {x: -0.08387115, y: -0, z: -1.6165739}
        tangentMode: 0
        weightedMode: 0
        inWeight: {x: 0.33333334, y: 0.33333334, z: 0.33333334}
        outWeight: {x: 0.33333334, y: 0.33333334, z: 0.33333334}
      - serializedVersion: 3
        time: 0.99999994
        value: {x: -0, y: 0, z: 0}
        inSlope: {x: -0.08387115, y: -0, z: -1.6165739}
        outSlope: {x: -0, y: -0, z: -0}
        tangentMode: 0
        weightedMode: 0
        inWeight: {x: 0.33333334, y: 0.33333334, z: 0.33333334}
        outWeight: {x: 0.33333334, y: 0.33333334, z: 0.33333334}
      - serializedVersion: 3
        time: 1.4166667
        value: {x: -0, y: 0, z: 0}
        inSlope: {x: -0, y: -0, z: -0}
        outSlope: {x: -0, y: -0, z: -0}
        tangentMode: 0
        weightedMode: 0
        inWeight: {x: 0.33333334, y: 0.33333334, z: 0.33333334}
        outWeight: {x: 0.33333334, y: 0.33333334, z: 0.33333334}
      m_PreInfinity: 2
      m_PostInfinity: 2
      m_RotationOrder: 4
    path: Armature/Bone
  m_ScaleCurves:
  - curve:
      serializedVersion: 2
      m_Curve:
      - serializedVersion: 3
        time: 0
        value: {x: 1, y: 0.989418, z: 1}
        inSlope: {x: 0, y: -0.6893406, z: 0}
        outSlope: {x: 0, y: -0.6893406, z: 0}
        tangentMode: 0
        weightedMode: 0
        inWeight: {x: 0.33333334, y: 0.33333334, z: 0.33333334}
        outWeight: {x: 0.33333334, y: 0.33333334, z: 0.33333334}
      - serializedVersion: 3
        time: 0.125
        value: {x: 1, y: 0.86696935, z: 1}
        inSlope: {x: 0, y: -1.2879788, z: 0}
        outSlope: {x: 0, y: -1.2879788, z: 0}
        tangentMode: 0
        weightedMode: 0
        inWeight: {x: 0.33333334, y: 0.33333334, z: 0.33333334}
        outWeight: {x: 0.33333334, y: 0.33333334, z: 0.33333334}
      - serializedVersion: 3
        time: 0.33333334
        value: {x: 1, y: 0.632654, z: 1}
        inSlope: {x: 0, y: -0.47165325, z: 0}
        outSlope: {x: 0, y: -0.47165325, z: 0}
        tangentMode: 0
        weightedMode: 0
        inWeight: {x: 0.33333334, y: 0.33333334, z: 0.33333334}
        outWeight: {x: 0.33333334, y: 0.33333334, z: 0.33333334}
      - serializedVersion: 3
        time: 0.37500003
        value: {x: 1, y: 0.6220721, z: 1}
        inSlope: {x: 0, y: 1.3521736, z: 0}
        outSlope: {x: 0, y: 1.3521736, z: 0}
        tangentMode: 0
        weightedMode: 0
        inWeight: {x: 0.33333334, y: 0.33333334, z: 0.33333334}
        outWeight: {x: 0.33333334, y: 0.33333334, z: 0.33333334}
      - serializedVersion: 3
        time: 0.4166667
        value: {x: 1, y: 0.7453351, z: 1}
        inSlope: {x: 0, y: 5.0063753, z: 0}
        outSlope: {x: 0, y: 5.0063753, z: 0}
        tangentMode: 0
        weightedMode: 0
        inWeight: {x: 0.33333334, y: 0.33333334, z: 0.33333334}
        outWeight: {x: 0.33333334, y: 0.33333334, z: 0.33333334}
      - serializedVersion: 3
        time: 0.5
        value: {x: 1, y: 1.3900957, z: 1}
        inSlope: {x: 0, y: 7.7371206, z: 0}
        outSlope: {x: 0, y: 7.7371206, z: 0}
        tangentMode: 0
        weightedMode: 0
        inWeight: {x: 0.33333334, y: 0.33333334, z: 0.33333334}
        outWeight: {x: 0.33333334, y: 0.33333334, z: 0.33333334}
      - serializedVersion: 3
        time: 0.5833333
        value: {x: 1, y: 1.8072933, z: 1}
        inSlope: {x: 0, y: 0.02991271, z: 0}
        outSlope: {x: 0, y: 0.02991271, z: 0}
        tangentMode: 0
        weightedMode: 0
        inWeight: {x: 0.33333334, y: 0.33333334, z: 0.33333334}
        outWeight: {x: 0.33333334, y: 0.33333334, z: 0.33333334}
      - serializedVersion: 3
        time: 0.6666667
        value: {x: 1, y: 1.3980714, z: 1}
        inSlope: {x: 0, y: -7.6055183, z: 0}
        outSlope: {x: 0, y: -7.6055183, z: 0}
        tangentMode: 0
        weightedMode: 0
        inWeight: {x: 0.33333334, y: 0.33333334, z: 0.33333334}
        outWeight: {x: 0.33333334, y: 0.33333334, z: 0.33333334}
      - serializedVersion: 3
        time: 0.75
        value: {x: 1, y: 0.7612876, z: 1}
        inSlope: {x: 0, y: -5.0183363, z: 0}
        outSlope: {x: 0, y: -5.0183363, z: 0}
        tangentMode: 0
        weightedMode: 0
        inWeight: {x: 0.33333334, y: 0.33333334, z: 0.33333334}
        outWeight: {x: 0.33333334, y: 0.33333334, z: 0.33333334}
      - serializedVersion: 3
        time: 0.7916667
        value: {x: 1, y: 0.63453496, z: 1}
        inSlope: {x: 0, y: -1.594014, z: 0}
        outSlope: {x: 0, y: -1.594014, z: 0}
        tangentMode: 0
        weightedMode: 0
        inWeight: {x: 0.33333334, y: 0.33333334, z: 0.33333334}
        outWeight: {x: 0.33333334, y: 0.33333334, z: 0.33333334}
      - serializedVersion: 3
        time: 0.8333333
        value: {x: 1, y: 0.6284531, z: 1}
        inSlope: {x: 0, y: -0.11725049, z: 0}
        outSlope: {x: 0, y: -0.11725049, z: 0}
        tangentMode: 0
        weightedMode: 0
        inWeight: {x: 0.33333334, y: 0.33333334, z: 0.33333334}
        outWeight: {x: 0.33333334, y: 0.33333334, z: 0.33333334}
      - serializedVersion: 3
        time: 0.9583333
        value: {x: 1, y: 0.62247086, z: 1}
        inSlope: {x: 0, y: -0.009571548, z: 0}
        outSlope: {x: 0, y: -0.009571548, z: 0}
        tangentMode: 0
        weightedMode: 0
        inWeight: {x: 0.33333334, y: 0.33333334, z: 0.33333334}
        outWeight: {x: 0.33333334, y: 0.33333334, z: 0.33333334}
      - serializedVersion: 3
        time: 1.0833334
        value: {x: 1, y: 0.66137654, z: 1}
        inSlope: {x: 0, y: 0.8526064, z: 0}
        outSlope: {x: 0, y: 0.8526064, z: 0}
        tangentMode: 0
        weightedMode: 0
        inWeight: {x: 0.33333334, y: 0.33333334, z: 0.33333334}
        outWeight: {x: 0.33333334, y: 0.33333334, z: 0.33333334}
      - serializedVersion: 3
        time: 1.3750001
        value: {x: 1, y: 0.98941797, z: 1}
        inSlope: {x: 0, y: 0.4716534, z: 0}
        outSlope: {x: 0, y: 0.4716534, z: 0}
        tangentMode: 0
        weightedMode: 0
        inWeight: {x: 0.33333334, y: 0.33333334, z: 0.33333334}
        outWeight: {x: 0.33333334, y: 0.33333334, z: 0.33333334}
      - serializedVersion: 3
        time: 1.4166667
        value: {x: 1, y: 1, z: 1}
        inSlope: {x: 0, y: 0.25396895, z: 0}
        outSlope: {x: 0, y: 0.25396895, z: 0}
        tangentMode: 0
        weightedMode: 0
        inWeight: {x: 0.33333334, y: 0.33333334, z: 0.33333334}
        outWeight: {x: 0.33333334, y: 0.33333334, z: 0.33333334}
      m_PreInfinity: 2
      m_PostInfinity: 2
      m_RotationOrder: 4
    path: Armature/Bone
  m_FloatCurves: []
  m_PPtrCurves: []
  m_SampleRate: 24
  m_WrapMode: 0
  m_Bounds:
    m_Center: {x: 0, y: 0, z: 0}
    m_Extent: {x: 0, y: 0, z: 0}
  m_ClipBindingConstant:
    genericBindings:
    - serializedVersion: 2
      path: 2683011312
      attribute: 1
      script: {fileID: 0}
      typeID: 4
      customType: 0
      isPPtrCurve: 0
    - serializedVersion: 2
      path: 2683011312
      attribute: 2
      script: {fileID: 0}
      typeID: 4
      customType: 0
      isPPtrCurve: 0
    - serializedVersion: 2
      path: 2683011312
      attribute: 3
      script: {fileID: 0}
      typeID: 4
      customType: 0
      isPPtrCurve: 0
    pptrCurveMapping: []
  m_AnimationClipSettings:
    serializedVersion: 2
    m_AdditiveReferencePoseClip: {fileID: 0}
    m_AdditiveReferencePoseTime: 0
    m_StartTime: 0
    m_StopTime: 1.4166667
    m_OrientationOffsetY: 0
    m_Level: 0
    m_CycleOffset: 0
    m_HasAdditiveReferencePose: 0
    m_LoopTime: 0
    m_LoopBlend: 0
    m_LoopBlendOrientation: 0
    m_LoopBlendPositionY: 0
    m_LoopBlendPositionXZ: 0
    m_KeepOriginalOrientation: 0
    m_KeepOriginalPositionY: 1
    m_KeepOriginalPositionXZ: 0
    m_HeightFromFeet: 0
    m_Mirror: 0
  m_EditorCurves: []
  m_EulerEditorCurves: []
  m_HasGenericRootTransform: 0
  m_HasMotionFloatCurves: 0
  m_Events: []
