<?xml version="1.0" encoding="utf-8"?>
<!-- Generator: Adobe Illustrator 17.0.0, SVG Export Plug-In . SVG Version: 6.00 Build 0)  -->
<!DOCTYPE svg PUBLIC "-//W3C//DTD SVG 1.1//EN" "http://www.w3.org/Graphics/SVG/1.1/DTD/svg11.dtd">
<svg version="1.1" id="Layer_1" xmlns="http://www.w3.org/2000/svg" xmlns:xlink="http://www.w3.org/1999/xlink" x="0px" y="0px"
	 width="101.25px" height="101px" viewBox="0 0 101.25 101" enable-background="new 0 0 101.25 101" xml:space="preserve">
<g>
	<circle fill="#18C0D9" cx="50.625" cy="50.5" r="50"/>
	<g>
		<path fill="#FFFFFF" d="M53.829,22.94c-8.87,0-16.721,4.428-21.473,11.186c0.983,0.642,1.942,1.521,2.869,2.653
			c3.545-5.301,9.277-9.02,15.91-9.819l2.694,4.559l2.694-4.559c10.195,1.229,18.298,9.332,19.527,19.526l-4.559,2.694l4.56,2.694
			c-0.822,6.816-4.725,12.684-10.263,16.201c0.353,0.804,0.552,1.626,0.587,2.474c0.026,0.62-0.038,1.205-0.167,1.76
			C74.45,67.88,80.069,59.175,80.069,49.18C80.069,34.711,68.298,22.94,53.829,22.94z M60.525,66.154
			c-6.049-4.861-7.74-2.472-10.485,0.272c-1.916,1.917-6.765-2.086-10.952-6.273c-4.187-4.188-8.189-9.036-6.273-10.952
			c2.745-2.744,5.134-4.437,0.271-10.484c-4.861-6.05-8.102-1.405-10.76,1.254c-3.069,3.068-0.162,14.503,11.139,25.806
			c11.303,11.301,22.737,14.207,25.805,11.14C61.928,74.258,66.574,71.018,60.525,66.154z M42.102,53.286
			c0-5.377,6.295-6.335,6.295-8.433c0-1.018-0.815-1.446-1.569-1.446c-1.385,0-2.159,1.548-2.159,1.548l-2.648-1.772
			c0,0,1.344-3.137,5.133-3.137c2.383,0,4.97,1.365,4.97,4.461c0,4.542-5.866,5.419-5.968,7.292h6.193v3.055H42.266
			C42.164,54.285,42.102,53.776,42.102,53.286z M53.838,49.172l5.623-8.882h4.359v8.087h1.731v2.953h-1.731v3.524h-3.524v-3.524
			h-6.457L53.838,49.172L53.838,49.172z M60.295,48.377v-3.259c0-0.795,0.122-1.63,0.122-1.63h-0.041c0,0-0.305,0.897-0.713,1.508
			l-2.199,3.341v0.041L60.295,48.377L60.295,48.377z"/>
	</g>
</g>
</svg>
