MessageId|Subject|Content|RecipientId|RecipientDisplayName|MessageType|CreatorId|CreatorDisplayName|CreatedDate|ConversationId|Branch
6971809|Planned Maintenance|434d4241205265766572736520506f7274666f6c696f20546573743c703e3c62723e3c2f703e|0600623|JOHN PAUL ANTONCICH|notification|anonymous|anonymous|09/01/2014 10:36:00|6971808|1
6632276|CMBA Reverse Portfolio Test|434d4241205265766572736520506f7274666f6c696f20546573743c703e3c62723e3c2f703e|0101128|MEDITERRANEAN BANK PLC - RETAIL TEST|notification|CustomerServices|CustomerServices|20/05/2017 04:26:19|6632275|1
