2020-10-06_11-15-33AM - Starting upload process
2020-10-06_11-15-33AM - batched_tickets/batched_tickets_0 - Starting
2020-10-06_11-15-33AM - Uploading batched_1.log 	_ 1/2
2020-10-06_11-15-34AM - Uploading batched_2.log 	_ 2/2
