2020-10-12_2-14-28PM-Starting mapping process
2020-10-12_2-14-28PM-1 file(s) detected.
2020-10-12_2-14-28PM-Starting tickets/Messages26941983.log
2020-10-12_2-14-29PM-Creating 145 batch files within batched_tickets/batched_tickets_0
2020-10-12_2-14-29PM-14438 total tickets || 100 tickets per file
2020-10-12_2-14-36PM-
Ticket 1420, Comment 1, ConvID 30060741 - Uploading 1 attachment(s)
2020-10-12_2-14-37PM-Uploaded '/attachments/30060741/Reverse Stock Split  Frontier Communications C.pdf'
2020-10-12_2-14-37PM-with token cex3mcT0wtDjpYBvoIG7YP6mI
2020-10-12_2-14-37PM-
Ticket 1421, Comment 1, ConvID 30060751 - Uploading 1 attachment(s)
2020-10-12_2-14-37PM-Uploaded '/attachments/30060751/Reverse Stock Split  Frontier Communications C.pdf'
2020-10-12_2-14-37PM-with token GbpAEcUXFlt0P9qUPZ38c5F3F
2020-10-12_2-14-37PM-
Ticket 1422, Comment 1, ConvID 30060757 - Uploading 1 attachment(s)
2020-10-12_2-14-38PM-Uploaded '/attachments/30060757/Reverse Stock Split  Frontier Communications C.pdf'
2020-10-12_2-14-38PM-with token 0dUE7JU0lBJyUY88o1CGUBPq1
2020-10-12_2-14-38PM-
Ticket 1451, Comment 1, ConvID 30126207 - Uploading 1 attachment(s)
2020-10-12_2-14-39PM-Uploaded '/attachments/30126207/notification preferences.jpg'
2020-10-12_2-14-39PM-with token m1KgoaiakPm5Jefp0ulOe6tYa
2020-10-12_2-14-40PM-
Ticket 1688, Comment 1, ConvID 30641280 - Uploading 1 attachment(s)
2020-10-12_2-14-41PM-Uploaded '/attachments/30641280/Rights Issue  Banco Santander.pdf'
2020-10-12_2-14-41PM-with token PMRZ7oQqAyLMCm9rketihDmof
2020-10-12_2-14-41PM-
Ticket 1689, Comment 1, ConvID 30641287 - Uploading 1 attachment(s)
2020-10-12_2-14-42PM-Uploaded '/attachments/30641287/Rights Issue  Banco Santander.pdf'
2020-10-12_2-14-42PM-with token nPG1f4duqG5IRHnDjMVUbMCds
2020-10-12_2-14-42PM-
Ticket 1690, Comment 1, ConvID 30641306 - Uploading 1 attachment(s)
2020-10-12_2-14-43PM-Uploaded '/attachments/30641306/Rights Issue  Banco Santander.pdf'
2020-10-12_2-14-43PM-with token UZ2vngV3jOKIQtNDmmMfrKw4K
2020-10-12_2-14-43PM-
Ticket 1691, Comment 1, ConvID 30641313 - Uploading 1 attachment(s)
