2020-10-12_2-00-40PM - Starting Process
2020-10-12_2-00-40PM - Reading from Messages26941983 - Copy (2).csv ...
2020-10-12_2-00-43PM - Messages26941983 - Copy (2).csv finished processing. 15000 comments found. Generated 14438 tickets to file ...
2020-10-12_2-00-43PM - Saving tickets from Messages26941983 - Copy (2).csv to Messages26941983 - Copy (2).log

2020-10-12_2-00-43PM - Reading from Messages26941983 - Copy.csv ...
2020-10-12_2-00-45PM - Messages26941983 - Copy.csv finished processing. 15000 comments found. Generated 14438 tickets to file ...
2020-10-12_2-00-45PM - Saving tickets from Messages26941983 - Copy.csv to Messages26941983 - Copy.log

2020-10-12_2-00-46PM - Reading from Messages26941983.csv ...
2020-10-12_2-00-48PM - Messages26941983.csv finished processing. 15000 comments found. Generated 14438 tickets to file ...
2020-10-12_2-00-48PM - Saving tickets from Messages26941983.csv to Messages26941983.log

2020-10-12_2-00-49PM - Generated attachments/30060741/Reverse Stock Split  Frontier Communications C.pdf
2020-10-12_2-00-49PM - Generated attachments/30060751/Reverse Stock Split  Frontier Communications C.pdf
2020-10-12_2-00-49PM - Generated attachments/30060757/Reverse Stock Split  Frontier Communications C.pdf
2020-10-12_2-00-49PM - Generated attachments/30126207/notification preferences.jpg
2020-10-12_2-00-49PM - Generated attachments/30641280/Rights Issue  Banco Santander.pdf
2020-10-12_2-00-49PM - Generated attachments/30641287/Rights Issue  Banco Santander.pdf
2020-10-12_2-00-49PM - Generated attachments/30641306/Rights Issue  Banco Santander.pdf
2020-10-12_2-00-49PM - Generated attachments/30641313/Rights Issue  Banco Santander.pdf
2020-10-12_2-00-49PM - Generated attachments/30641319/Rights Issue  Banco Santander.pdf
2020-10-12_2-00-49PM - Generated attachments/30641331/Rights Issue  Banco Santander.pdf
2020-10-12_2-00-49PM - Generated attachments/30641337/Rights Issue  Banco Santander.pdf
2020-10-12_2-00-49PM - Generated attachments/30641349/Rights Issue  Banco Santander.pdf
2020-10-12_2-00-49PM - Generated attachments/30641359/Rights Issue  Banco Santander.pdf
2020-10-12_2-00-49PM - Generated attachments/30641369/Rights Issue  Banco Santander.pdf
2020-10-12_2-00-49PM - Generated attachments/30641375/Rights Issue  Banco Santander.pdf
2020-10-12_2-00-49PM - Generated attachments/30641381/Rights Issue  Banco Santander.pdf
2020-10-12_2-00-49PM - Generated attachments/30641391/Rights Issue  Banco Santander.pdf
2020-10-12_2-00-50PM - Generated attachments/30641397/Rights Issue  Banco Santander.pdf
2020-10-12_2-00-50PM - Generated attachments/30641405/Rights Issue  Banco Santander.pdf
2020-10-12_2-00-50PM - Generated attachments/30641413/Rights Issue  Banco Santander.pdf
2020-10-12_2-00-50PM - Generated attachments/30641420/Rights Issue  Banco Santander.pdf
2020-10-12_2-00-50PM - Generated attachments/30641430/Rights Issue  Banco Santander.pdf
2020-10-12_2-00-50PM - Generated attachments/30641436/Rights Issue  Banco Santander.pdf
2020-10-12_2-00-50PM - Generated attachments/30641449/Rights Issue  Banco Santander.pdf
2020-10-12_2-00-50PM - Generated attachments/30641457/Rights Issue  Banco Santander.pdf
2020-10-12_2-00-50PM - Generated attachments/30641465/Rights Issue  Banco Santander.pdf
2020-10-12_2-00-50PM - Generated attachments/30641475/Rights Issue  Banco Santander.pdf
2020-10-12_2-00-50PM - Generated attachments/30641482/Rights Issue  Banco Santander.pdf
2020-10-12_2-00-50PM - Generated attachments/30641492/Rights Issue  Banco Santander.pdf
2020-10-12_2-00-50PM - Generated attachments/30641498/Rights Issue  Banco Santander.pdf
2020-10-12_2-00-50PM - Generated attachments/30641508/Rights Issue  Banco Santander.pdf
2020-10-12_2-00-50PM - Generated attachments/30641517/Rights Issue  Banco Santander.pdf
2020-10-12_2-00-50PM - Generated attachments/30641528/Rights Issue  Banco Santander.pdf
2020-10-12_2-00-50PM - Generated attachments/30641534/Rights Issue  Banco Santander.pdf
2020-10-12_2-00-50PM - Generated attachments/30641542/Rights Issue  Banco Santander.pdf
2020-10-12_2-00-50PM - Generated attachments/30641550/Rights Issue  Banco Santander.pdf
2020-10-12_2-00-51PM - Generated attachments/30641556/Rights Issue  Banco Santander.pdf
2020-10-12_2-00-51PM - Generated attachments/30641562/Rights Issue  Banco Santander.pdf
2020-10-12_2-00-51PM - Generated attachments/30643523/GHM139.pdf
2020-10-12_2-00-51PM - Generated attachments/30643523/Subscription Offer  Grand Harbour Marina plc Ord Shares.pdf
2020-10-12_2-00-51PM - Generated attachments/30643530/Subscription Offer  Grand Harbour Marina plc Ord Shares.pdf
2020-10-12_2-00-51PM - Generated attachments/30643530/GHM139.pdf
2020-10-12_2-00-51PM - Generated attachments/30643539/GHM139.pdf
2020-10-12_2-00-51PM - Generated attachments/30643539/Subscription Offer  Grand Harbour Marina plc Ord Shares.pdf
2020-10-12_2-00-51PM - Generated attachments/30643551/GHM139.pdf
2020-10-12_2-00-51PM - Generated attachments/30643551/Subscription Offer  Grand Harbour Marina plc Ord Shares.pdf
2020-10-12_2-00-51PM - Generated attachments/30643558/Subscription Offer  Grand Harbour Marina plc Ord Shares.pdf
2020-10-12_2-00-51PM - Generated attachments/30643558/GHM139.pdf
2020-10-12_2-00-51PM - Generated attachments/30643565/GHM139.pdf
2020-10-12_2-00-51PM - Generated attachments/30643565/Subscription Offer  Grand Harbour Marina plc Ord Shares.pdf
2020-10-12_2-00-51PM - Generated attachments/30643583/Subscription Offer  Grand Harbour Marina plc Ord Shares.pdf
2020-10-12_2-00-51PM - Generated attachments/30643583/GHM139.pdf
2020-10-12_2-00-51PM - Generated attachments/30643590/Subscription Offer  Grand Harbour Marina plc Ord Shares.pdf
2020-10-12_2-00-51PM - Generated attachments/30643590/GHM139.pdf
2020-10-12_2-00-51PM - Generated attachments/30643601/GHM139.pdf
2020-10-12_2-00-51PM - Generated attachments/30643601/Subscription Offer  Grand Harbour Marina plc Ord Shares.pdf
2020-10-12_2-00-51PM - Generated attachments/30643608/GHM139.pdf
2020-10-12_2-00-51PM - Generated attachments/30643608/Subscription Offer  Grand Harbour Marina plc Ord Shares.pdf
2020-10-12_2-00-51PM - Generated attachments/30643618/Subscription Offer  Grand Harbour Marina plc Ord Shares.pdf
2020-10-12_2-00-51PM - Generated attachments/30643618/GHM139.pdf
2020-10-12_2-00-51PM - Generated attachments/30643626/GHM139.pdf
2020-10-12_2-00-51PM - Generated attachments/30643626/Subscription Offer  Grand Harbour Marina plc Ord Shares.pdf
2020-10-12_2-00-51PM - Generated attachments/30643633/GHM139.pdf
2020-10-12_2-00-51PM - Generated attachments/30643633/Subscription Offer  Grand Harbour Marina plc Ord Shares.pdf
2020-10-12_2-00-51PM - Generated attachments/30643643/Subscription Offer  Grand Harbour Marina plc Ord Shares.pdf
2020-10-12_2-00-52PM - Generated attachments/30643643/GHM139.pdf
2020-10-12_2-00-52PM - Generated attachments/30643659/GHM139.pdf
2020-10-12_2-00-52PM - Generated attachments/30643659/Subscription Offer  Grand Harbour Marina plc Ord Shares.pdf
2020-10-12_2-00-52PM - Generated attachments/30643666/Subscription Offer  Grand Harbour Marina plc Ord Shares.pdf
2020-10-12_2-00-52PM - Generated attachments/30643666/GHM139.pdf
2020-10-12_2-00-52PM - Generated attachments/30653519/Exchange  Subscription Offer  7 Grand Harbour Marina 20172020.pdf
2020-10-12_2-00-52PM - Generated attachments/30653519/GHM139.pdf
2020-10-12_2-00-52PM - Generated attachments/30653526/Exchange  Subscription Offer  7 Grand Harbour Marina 20172020.pdf
2020-10-12_2-00-52PM - Generated attachments/30653526/GHM139.pdf
2020-10-12_2-00-52PM - Generated attachments/30653541/Exchange  Subscription Offer  7 Grand Harbour Marina 20172020.pdf
2020-10-12_2-00-52PM - Generated attachments/30653541/GHM139.pdf
2020-10-12_2-00-52PM - Generated attachments/30653551/GHM139.pdf
2020-10-12_2-00-52PM - Generated attachments/30653551/Exchange  Subscription Offer  7 Grand Harbour Marina 20172020.pdf
2020-10-12_2-00-52PM - Generated attachments/30653561/Exchange  Subscription Offer  7 Grand Harbour Marina 20172020.pdf
2020-10-12_2-00-52PM - Generated attachments/30653561/GHM139.pdf
2020-10-12_2-00-52PM - Generated attachments/30653571/Exchange  Subscription Offer  7 Grand Harbour Marina 20172020.pdf
2020-10-12_2-00-52PM - Generated attachments/30653571/GHM139.pdf
2020-10-12_2-00-52PM - Generated attachments/30653578/Exchange  Subscription Offer  7 Grand Harbour Marina 20172020.pdf
2020-10-12_2-00-52PM - Generated attachments/30653578/GHM139.pdf
2020-10-12_2-00-52PM - Generated attachments/30653585/GHM139.pdf
2020-10-12_2-00-52PM - Generated attachments/30653585/Exchange  Subscription Offer  7 Grand Harbour Marina 20172020.pdf
2020-10-12_2-00-52PM - Generated attachments/30653596/Exchange  Subscription Offer  7 Grand Harbour Marina 20172020.pdf
2020-10-12_2-00-52PM - Generated attachments/30653596/GHM139.pdf
2020-10-12_2-00-52PM - Generated attachments/30653603/GHM139.pdf
2020-10-12_2-00-52PM - Generated attachments/30653603/Exchange  Subscription Offer  7 Grand Harbour Marina 20172020.pdf
2020-10-12_2-00-52PM - Generated attachments/30653610/GHM139.pdf
2020-10-12_2-00-52PM - Generated attachments/30653610/Exchange  Subscription Offer  7 Grand Harbour Marina 20172020.pdf
2020-10-12_2-00-52PM - Generated attachments/30653617/GHM139.pdf
2020-10-12_2-00-53PM - Generated attachments/30653617/Exchange  Subscription Offer  7 Grand Harbour Marina 20172020.pdf
2020-10-12_2-00-53PM - Generated attachments/30653635/GHM139.pdf
2020-10-12_2-00-53PM - Generated attachments/30653635/Exchange  Subscription Offer  7 Grand Harbour Marina 20172020.pdf
2020-10-12_2-00-53PM - Generated attachments/30653642/Exchange  Subscription Offer  7 Grand Harbour Marina 20172020.pdf
2020-10-12_2-00-53PM - Generated attachments/30653642/GHM139.pdf
2020-10-12_2-00-53PM - Generated attachments/30653653/Exchange  Subscription Offer  7 Grand Harbour Marina 20172020.pdf
2020-10-12_2-00-53PM - Generated attachments/30653653/GHM139.pdf
2020-10-12_2-00-53PM - Generated attachments/30653660/GHM139.pdf
2020-10-12_2-00-53PM - Generated attachments/30653660/Exchange  Subscription Offer  7 Grand Harbour Marina 20172020.pdf
2020-10-12_2-00-53PM - Generated attachments/30653667/GHM139.pdf
2020-10-12_2-00-53PM - Generated attachments/30653667/Exchange  Subscription Offer  7 Grand Harbour Marina 20172020.pdf
2020-10-12_2-00-53PM - Generated attachments/30653676/Exchange  Subscription Offer  7 Grand Harbour Marina 20172020.pdf
2020-10-12_2-00-53PM - Generated attachments/30653676/GHM139.pdf
2020-10-12_2-00-53PM - Generated attachments/30653685/GHM139.pdf
2020-10-12_2-00-53PM - Generated attachments/30653685/Exchange  Subscription Offer  7 Grand Harbour Marina 20172020.pdf
2020-10-12_2-00-53PM - Generated attachments/30653692/Exchange  Subscription Offer  7 Grand Harbour Marina 20172020.pdf
2020-10-12_2-00-53PM - Generated attachments/30653692/GHM139.pdf
2020-10-12_2-00-53PM - Generated attachments/30653699/Exchange  Subscription Offer  7 Grand Harbour Marina 20172020.pdf
2020-10-12_2-00-53PM - Generated attachments/30653699/GHM139.pdf
2020-10-12_2-00-53PM - Generated attachments/30653710/GHM139.pdf
2020-10-12_2-00-53PM - Generated attachments/30653710/Exchange  Subscription Offer  7 Grand Harbour Marina 20172020.pdf
2020-10-12_2-00-53PM - Generated attachments/30653717/Exchange  Subscription Offer  7 Grand Harbour Marina 20172020.pdf
2020-10-12_2-00-53PM - Generated attachments/30653717/GHM139.pdf
2020-10-12_2-00-53PM - Generated attachments/30653724/GHM139.pdf
2020-10-12_2-00-53PM - Generated attachments/30653724/Exchange  Subscription Offer  7 Grand Harbour Marina 20172020.pdf
2020-10-12_2-00-53PM - Generated attachments/30653731/GHM139.pdf
2020-10-12_2-00-53PM - Generated attachments/30653731/Exchange  Subscription Offer  7 Grand Harbour Marina 20172020.pdf
2020-10-12_2-00-53PM - Generated attachments/30653742/GHM139.pdf
2020-10-12_2-00-53PM - Generated attachments/30653742/Exchange  Subscription Offer  7 Grand Harbour Marina 20172020.pdf
2020-10-12_2-00-54PM - Generated attachments/31120128/Rights Issue  Banco Santander.pdf
2020-10-12_2-00-54PM - Generated attachments/38307117/GHM139.pdf
2020-10-12_2-00-54PM - Generated attachments/38307117/Exchange Offer  7 Grand Harbour Marina 20172020.pdf
