2020-10-06_11-18-32AM - Checking 1 jobs 	_ undefined/2
2020-10-06_11-18-32AM - b3922c4e9662f1c2bf993905cf00d1c7 - Checking
2020-10-06_11-18-32AM - b3922c4e9662f1c2bf993905cf00d1c7 - working - 1/30 - Creating Tickets #1

2020-10-06_11-18-33AM - Checking 2 jobs 	_ undefined/2
2020-10-06_11-18-33AM - b3922c4e9662f1c2bf993905cf00d1c7 - Checking
2020-10-06_11-18-33AM - b3922c4e9662f1c2bf993905cf00d1c7 - working - 2/30 - Creating Tickets #2

2020-10-06_11-18-33AM - 2f000ce43651d540e81ded5bc21ed20a - Checking
2020-10-06_11-18-33AM - 2f000ce43651d540e81ded5bc21ed20a - working - 1/30 - Creating Tickets #1

