2020-09-29_09-43-20AM-Starting mapping process
2020-09-29_09-43-20AM-1 file(s) detected.
2020-09-29_09-43-20AM-Starting tickets/Messages0.log
2020-09-29_09-43-20AM-Creating 2 batch files within batched_tickets/batched_tickets_0
2020-09-29_09-43-45AM-Finished batched_tickets/batched_tickets_0 folder with 51 tickets

