2020-10-06_3-19-35PM-Starting mapping process
2020-10-06_3-19-35PM-1 file(s) detected.
2020-10-06_3-19-35PM-Starting tickets/Messages3235837700.log
2020-10-06_3-19-35PM-Creating 150 batch files within batched_tickets/batched_tickets_0
2020-10-06_3-19-35PM-14969 total tickets || 100 tickets per file
2020-10-06_3-20-44PM-Finished batched_tickets/batched_tickets_0 folder with 14969 tickets

