2020-09-16_10-14-41AM-Starting mapping process
2020-09-16_10-14-41AM-1 file(s) detected.
2020-09-16_10-14-41AM-Starting tickets/Messages0.log
2020-09-16_10-14-41AM-Creating 2 files

2020-09-16_10-14-41AM-Finished batched_tickets/batched_tickets_0
