621256 151675 470
94014 227526 386
149786 370179 443
644123 818708 504
702976 241508 509
801144 255408 509
517018 129539 470
810634 461722 509
346692 548134 470
295458 293473 358
986853 134177 525
911926 864685 476
852562 355030 525
352379 848511 525
783402 398604 509
934645 97676 525
907263 391120 525
470560 621594 470
608948 643106 509
579023 748893 509
823186 466418 509
509625 946170 525
729220 766107 424
360452 157405 443
984845 70225 525
847235 6183 525
704430 374627 509
626330 540492 452
101964 447122 449
974392 751515 525
651860 186499 509
206713 183621 360
927208 195419 525
383613 613143 470
435898 813324 509
263376 494037 449
501407 834061 509
360132 761788 509
970501 817760 525
47147 42510 314
394804 781775 509
153652 840988 525
452715 572174 470
731421 698679 504
41017 493986 449
849658 164526 525
656935 153891 509
397040 898008 525
847175 846776 282
184419 410189 449
673216 27661 509
905890 300753 525
956241 272130 525
456354 592058 470
120658 464384 449
768378 452833 509
175753 221103 386
224142 508944 449
273476 821845 509
890577 876167 445
169131 338405 443
517865 193568 470
363233 4327 443
599908 538490 452
936981 951079 507
326637 99786 443
884567 918452 476
308236 426279 449
168982 672673 509
527208 423994 470
337621 193947 443
97580 647211 509
443526 575764 470
505153 929716 525
315547 550251 470
905890 517567 525
171311 649997 509
160637 49748 383
847286 324239 525
956426 595616 525
139062 997970 525
298960 938694 525
675481 540782 509
608978 310880 470
612833 557143 434
63135 801177 509
637012 434101 509
403415 397951 387
573354 211994 470
613185 100796 470
865408 744778 525
800263 507326 509
753156 855619 525
917530 791049 525
692804 88317 509
832739 102088 509
789988 246301 509
607254 123696 470
499731 774264 509
556180 929881 525
252327 248979 350
194994 664473 509
163031 275715 443
523168 754159 509
564778 309926 470
67649 562279 470
142628 545255 470
594996 951006 525
649051 106079 509
267415 315021 407
716791 855616 525
810923 308677 509
346094 649938 509
386174 573822 470
376532 203443 443
695208 930285 525
150630 207308 383
763992 246326 509
416193 674277 509
510062 226584 449
346636 156476 443
427558 692059 509
310473 212344 443
361406 359809 410
339911 680921 509
931578 199203 525
622453 990517 525
341573 561584 470
825104 300511 509
734275 416651 509
242180 936310 525
61326 852522 525
470669 244729 449
954220 301733 525
524259 896387 525
174135 393238 443
67017 654315 509
883684 106221 525
307375 519552 470
398371 196041 443
294118 522272 470
939506 703792 525
632635 667436 442
430117 582520 470
417290 576411 470
167176 37854 383
543310 378310 470
459147 298580 449
249316 470527 449
993534 725041 525
218577 423030 449
870919 712414 525
84176 721497 509
412935 274890 449
453009 619085 470
84402 546328 470
872295 293233 525
54502 937501 525
567743 551176 421
937529 934560 414
348518 52963 443
202123 483512 449
741818 546259 509
359711 755166 509
972320 546958 525
748460 671322 504
971852 389423 525
650722 577187 509
605419 718054 509
829513 379281 509
530796 329346 470
205057 163823 365
276641 767577 509
444754 159981 449
176785 824030 509
748819 362063 509
859260 474403 525
266945 73696 443
678171 325292 509
324579 838808 525
407884 739962 509
824704 327155 509
88609 134263 354
570456 80465 470
135746 368849 443
649509 839484 525
24261 239756 443
744672 403222 509
574090 310884 470
20621 449459 449
759374 848476 525
980516 417279 525
380187 113077 443
253404 611588 470
532667 779278 509
397241 349933 436
800565 85431 509
733541 55820 509
501497 427766 444
618669 250951 470
705791 415288 509
423812 986260 525
555089 225130 470
418009 567797 470
355706 362144 410
824829 530059 509
908212 700283 525
28050 93685 351
782434 387120 509
498580 436063 444
790124 135708 509
357839 145077 443
476477 932325 525
317418 396497 441
175513 375068 443
52491 889230 525
770513 639689 504
697809 716486 504
84298 934784 525
666857 405998 509
900175 51 525
334550 306607 384
324478 917868 525
999549 70102 525
521899 68556 470
902692 445207 525
629939 165511 509
318566 465619 449
579935 687451 509
261222 35302 443
815067 686709 504
99680 835132 509
831217 801884 450
251364 19946 443
536862 490506 470
256929 647007 509
795766 467374 509
725264 643857 504
537133 420436 470
25878 883712 525
262756 145534 443
804382 249765 509
783595 383782 509
800186 369428 509
594398 998432 525
102111 779241 509
335139 256696 407
226229 996948 525
779379 804637 468
