175699 380874 443
353257 828401 509
241654 715597 509
322379 730570 509
938661 402733 525
475880 850352 525
89529 38794 351
691284 264436 509
104006 605493 470
876834 400051 525
431000 638250 509
324609 414558 449
751918 784806 468
193070 850342 525
674590 168782 509
600116 667626 509
575555 440087 470
104143 235401 443
13693 66898 340
36397 579232 470
883307 114604 525
28711 876279 525
412666 50490 449
773308 15908 509
565971 816431 509
80013 152823 375
441850 757365 509
97348 877436 525
77608 716353 509
566710 117909 470
41632 156592 383
822661 434068 509
586069 744807 509
702098 308294 509
927832 980969 507
813488 486327 509
313773 51622 443
182578 658045 509
748364 926109 525
418075 476904 444
571173 598640 434
276122 274303 345
54904 65353 335
916514 78367 525
319396 113253 443
771447 112961 509
377528 976625 525
285516 483619 449
807108 832935 450
144347 345115 443
746256 105416 509
991448 180686 525
808076 338952 509
640857 801679 504
615544 44479 470
40494 881738 525
898388 573870 525
177733 646149 509
180926 940669 525
777098 143012 509
945491 226884 525
541862 551784 452
927192 242472 525
824822 470958 509
243977 723292 509
144684 271874 443
48868 794229 509
476377 472984 382
515727 607824 452
200872 448817 449
72538 128188 354
484917 555522 470
130551 782849 509
605033 818507 509
854861 616250 525
552627 141693 470
495786 111262 449
884255 173915 525
935480 76246 525
57527 535086 470
18415 653515 509
441193 91009 449
248065 521977 470
147792 868366 525
752012 17455 509
489516 977310 525
457978 83298 449
113173 540613 470
794461 192020 509
956976 498348 525
785015 429357 509
279416 995967 525
425470 319560 449
701882 544052 509
619242 708040 509
138112 819722 509
785486 727202 468
58415 463832 449
226614 190679 386
906189 96332 525
495621 141578 449
496273 682062 509
835719 981762 525
770834 753213 468
25564 365015 443
632005 727584 504
322185 877045 525
890185 477527 525
912219 18310 525
505918 184458 449
504032 839633 525
445408 57993 449
772983 395372 509
987151 258086 525
628007 763521 504
811791 137195 509
285955 855181 525
3307 609910 470
922832 920404 445
953691 644861 525
602991 575310 434
441856 95914 449
292282 286539 389
616128 718232 509
499981 548184 470
857616 428862 525
612974 112595 470
148108 245276 443
786098 939799 525
360097 659039 509
376033 300193 441
869261 690816 525
301879 890484 525
456250 193130 449
565740 761734 509
570333 176489 470
510713 655884 509
291803 254381 407
827403 981125 525
804160 664249 504
197000 153516 383
914882 682989 525
856234 91833 525
272373 109641 443
761401 326541 509
504357 525799 470
506538 797869 509
957236 296740 525
736757 368583 509
495910 97931 449
337085 282111 389
406625 484915 449
316176 132864 443
24923 72396 340
881884 105931 525
223228 711377 509
745925 431252 509
23449 152797 375
246180 733099 509
767221 317147 509
163475 859788 525
166946 326143 443
530521 978454 525
771583 651340 504
667945 908966 525
472992 177824 449
966308 899866 507
365540 130942 443
161148 731794 509
922560 376659 525
446852 225939 449
509898 83901 449
235844 986726 525
640787 744118 504
508450 887734 525
840454 222389 525
440687 588350 470
581738 398999 470
761398 437112 509
959695 427156 525
283655 694849 509
330756 611835 470
605262 400168 470
851 749115 509
622626 886357 525
727649 446500 509
254916 515369 470
998376 109689 525
209171 567218 470
601958 823491 509
1865 494652 449
689014 378313 509
484776 464517 413
254869 869108 525
59725 897102 525
72047 316618 443
313485 674045 509
262453 75834 443
268358 746017 509
899559 151604 525
975446 42235 525
625243 467309 470
840681 118024 525
148207 736785 509
655721 720527 504
661243 394761 509
681850 983135 525
778720 968216 525
408299 150922 443
139411 974120 525
100290 798072 509
969057 784321 525
802993 279062 509
901181 561760 525
334205 279535 389
12710 560007 470
178635 776113 509
729365 6797 509
799058 694586 504
861325 964125 507
953505 64009 525
320536 203494 443
391196 44023 443
763939 644924 504
390309 352994 436
95269 575292 470
164502 842683 525
502700 58527 449
757430 860811 525
508274 991516 525
506276 441500 444
904429 127941 525
43174 277391 443
19472 353333 443
499819 347162 449
597150 297833 470
572646 946550 525
24912 397668 443
736458 86309 509
204538 849725 525
85122 849751 525
765829 136114 509
393289 563348 470
425291 306354 449
990622 233497 525
275112 166516 443
706659 949339 525
169884 793280 509
851629 716538 525
678260 927647 525
