                                                                                                                                                                                                                                                                                                            
.lOOOOOx;                       .ckOOOOk;                     .;coxkkOOkkdo:,.                    .oOOOOOOOOOOOOkkxoc,.                   .oOOOOOo.                           .::.                       :kOOOOOOOOOOOOkxdl;.                ;kOOOOOOOOOOOOOOOOOOOx'          ;xOOOOOkl.                    
.kMMMMMMK:                     .oNMMMMMNl                 .,oOXWWMMMMMMMMMMWNKkc'                 '0MMMMMMMMMMMMMMMMMNKd,                 .OMMMMMO.                           cXXc                       oWMMMMMMMMMMMMMMMMWXOc.             lWMMMMMMMMMMMMMMMMMMMX:          .cKWMMMMWk,                   
.kMMMMMMMK:                    lNMMMMMMNl               .:kNMMMMMMMMMMMMMMMMMMMWXx,               '0MMMMMMMMMMMMMMMMMMMMNd.               .OMMMMMO.                          ;0MM0,                      oWMMMMMMMMMMMMMMMMMMMW0;            lNWWWWWWWWWWWWWWWWWWWK;            ,kWMMMMMKl.                 
.kMMMMMMMMK;                  cXMMMMMMMNl              'kNMMMMMWXOdlccccox0NWMMMMMXo.             .;ccccccccccclodONMMMMMWd.              .OMMMMMO.                         .kWMMWk.                     'cccllccccclllokKWMMMMMK;           .,;;;;;;;;;;;;;;;;;;;,.             .oXMMMMMNx'      ';:::::;. 
.kMMMMMMMMMK;                cXMMMMMMMMNl             ;0WMMMMW0l'         .,oKWMMMMWk'                            .:0WMMMMK;              .OMMMMMO.                        .dWMMMMWd.                                    .dNMMMMWd.                                                ;OWMMMMW0:   .lKWWWWWNx. 
.kMMMMMMMMMM0;              :KMMMMMMMMMNl            ,0MMMMMXo.              .xNMMMMWk.                             oNMMMMN:              .OMMMMMO.                        lNMMMMMMNl                                     ,KMMMMMk.                                                 .dNMMMMMNd',kNMMMMMKl.  
.kMMMMMMMMMMM0;            ;KMMMMMMMMMMNl           .xWMMMMXl                 .dNMMMMNl                            'OWMMMMX;              .OMMMMMO.                       ;KMMMMMMMMK;                                   .lNMMMMWd.                  .,,,,,.                          :0WMMMMWXXWMMMMWO,    
.kMMMMMWWMMMMW0,          ,0MMMMMMMMMMMNl           ;KMMMMWx.      .,:;'       'OWMMMMO'           ';;;;;;;;;;;::lxKWMMMMWx.              .OMMMMMO.                      'OWMMMWWMMMMO'                  .;;;;;;;;;;;;:coONMMMMMK;                  'OWWWWWx.                          'xNMMMMMMMMMMXo.     
.kMMMMMXOKMMMMW0,        ,OMMMMMXKWMMMMNl           lNMMMMNc      'kNWWXd.      oWMMMMX;          'OWWWWWWWWWWWWWMMMMMMMNx.               .OMMMMMO.                     .xWMMMWOOWMMMWx.                 oNWWWWWWWWWWWWMMMMMMMW0:                   '0MMMMMk.                           .lKMMMMMMMW0:       
.kMMMMM0;:KMMMMW0,      'OWMMMMKclNMMMMNl           lWMMMMX:      :XMMMM0'      lNMMMMX;          '0MMMMMMMMMMMMMMMMMWKx;.                .OMMMMMO.                    .oNMMMMO''OMMMMNo.                oWMMMMMMMMMMMMMMMMWNOl.                    '0MMMMMk.                             ;0WMMMMWk.        
.kMMMMM0' :KMMMMWO,    .kWMMMMX: :NMMMMNl           cNMMMMNl      .cOK0k;      .dWMMMMK,          '0MMMMMWXXXNWMMMMMXl.                   .OMMMMMO.                    :XMMMMX:  :XMMMMX:                oWMMMMWNXXXNMMMMMWk,.                      '0MMMMMk.                             .oNMMMMN:         
.kWMMMM0'  :KMMMMWO'  .xWMMMMKc  :NMMMMNl           '0MMMMMO'        ..        ;KMMMMWx.          '0MMMMMO;..,xWMMMMNd.                   .OMMMMMO.                   ,0MMMMNo.  .oNMMMM0,               oWMMMMNl...lXMMMMW0,                       '0MMMMMk.                              oNMMMMN:         
.kWMMMM0'   ;KMMMMWO'.xWMMMMKc   :NMMMMNl            lNMMMMWx.                ,OWMMMMK;           '0MMMMMk.   .kWMMMMNo.                  .OMMMMMO.                  .kWMMMWk.    .kWMMMWk.              oWMMMMX:    cXMMMMWO,                      '0MMMMMk.                              oNMMMMN:         
.kWMMMM0'    ;0WMMMW00NMMMMXc    ;OKKKK0c            .dWMMMMW0:.            .lKWMMMMXl            '0MMMMMk.    'OWMMMMNl.                 .OMMMMMO.                 .dNMMMMK;      ;KMMMMWd.             oWMMMMX:    .lNMMMMWO'                     '0MMMMMk.                              oNMMMMN:         
.kWMMMM0'     ;0MMMMMMMMMMXc      ......              .oNMMMMMNOo;..    .':o0WMMMMMKc.            '0MMMMMk.     ,OWMMMMXc                 'OMMMMMO'                 cXMMMMNl        lNMMMMXc             oWMMMMX:     .oNMMMMWk.                    '0MMMMMk.                              oNMMMMN:         
.kMMMMM0'      ;0WMMMMMMMXc                             ;ONMMMMMMWXKOOO0KNWMMMMMMNx'              '0MMMMMk.      ,0WMMMMX:            .lxxONMMMMMNOxxl;.           ;KMMMMWx.        .xWMMMMK;            oWMMMMX:      .dNMMMMWx.                   '0MMMMMk.                              oNMMMMN:         
.kWMMMM0'       ,0WMMMMMXc                               .:kXWMMMMMMMMMMMMMMMMWKd,                '0MMMMWk.       ;KMMMMMK:           ,KMMMMMMMMMMMMMKd,          'OWMMMM0,          ,0MMMMWO'           oWMMMMX:       .xWMMMMWd.                  '0MMMMMk.                             .oNMMMMN:         
.kWMMMM0'        'lddddd;                                   .:dkKXNWMMMWWNX0ko;.                  '0MMMMWk.        :KWMMMM0;          ,0MMMMMMMMMMMMM0d,         .dWMMMMXc            :XMMMMWd.          oWMMMMX:        .xWMMMMNo.                 '0MMMMWk.                             .oNMMMMN:         
.cxxxxxl.                                                      ..;loxxxdoc,.                      .lxxxxx:.         :xxxxxx;          .lxxxxxxxxxxxxxl;.         .lxxxxxl.            .cxxxxxl.          ;dxxxxo.         'oxxxxxl.                 .lxxxxx:.                              ,dxxxxd'         




