%YAML 1.1
%TAG !u! tag:unity3d.com,2011:
--- !u!1045 &1
EditorBuildSettings:
  m_ObjectHideFlags: 0
  serializedVersion: 2
  m_Scenes:
  - enabled: 1
    path: Assets/MyAssets/Scenes/MainScene.unity
    guid: 418f80871d9bc224e9a57b332107d7a7
  m_configObjects:
    com.unity.xr.management.loader_settings: {fileID: 11400000, guid: 4f7377aa89dbea54486eb45b58d1760c, type: 2}
