{
  "Server": {
    "port": 8000,
    "host": "localhost"
  },
  "Auth": {
    "secret": "VOORBEELD-zet-dit-nooit-hier-want-dan-komt-je-key-in-version-control-terecht-en-kan-iedereen-met-toegang-hem-zien"
  }
}